Implementation notes: amd64, kizomba, crypto_sign/mqqsig224

Computer: kizomba
Microarchitecture: amd64; Kaby Lake (906e9)
Architecture: amd64
CPU ID: GenuineIntel-000906e9-1fc9cbf5
SUPERCOP version: 20240425
Operation: crypto_sign
Primitive: mqqsig224

Compiler output

Implementation: T:ref
Security model: timingleaks
Compiler: clang -march=native -O2 -fomit-frame-pointer -fwrapv -Qunused-arguments -fPIC -fPIE
try.c: /usr/bin/ld: libcrypto_sign_mqqsig224.a(keygen.o):(.bss+0x240): multiple definition of `lookup_table_private_key'; /tmp/try-small-94edd8.o:(.bss+0x2b0): first defined here
try.c: /usr/bin/ld: libcrypto_sign_mqqsig224.a(keygen.o):(.bss+0x0): multiple definition of `mqq_a'; /tmp/try-small-94edd8.o:(.bss+0x70): first defined here
try.c: /usr/bin/ld: libcrypto_sign_mqqsig224.a(keygen.o):(.bss+0x60): multiple definition of `cc1'; /tmp/try-small-94edd8.o:(.bss+0xd0): first defined here
try.c: /usr/bin/ld: libcrypto_sign_mqqsig224.a(keygen.o):(.bss+0x70): multiple definition of `cc2'; /tmp/try-small-94edd8.o:(.bss+0xe0): first defined here
try.c: /usr/bin/ld: libcrypto_sign_mqqsig224.a(keygen.o):(.bss+0x80): multiple definition of `mqq_sigma1'; /tmp/try-small-94edd8.o:(.bss+0xf0): first defined here
try.c: /usr/bin/ld: libcrypto_sign_mqqsig224.a(keygen.o):(.bss+0x160): multiple definition of `mqq_sigmaK'; /tmp/try-small-94edd8.o:(.bss+0x1d0): first defined here
try.c: /usr/bin/ld: libcrypto_sign_mqqsig224.a(mqq-sign.o):(.bss+0x0): multiple definition of `cc1'; /tmp/try-small-94edd8.o:(.bss+0xd0): first defined here
try.c: /usr/bin/ld: libcrypto_sign_mqqsig224.a(mqq-sign.o):(.bss+0x10): multiple definition of `cc2'; /tmp/try-small-94edd8.o:(.bss+0xe0): first defined here
try.c: /usr/bin/ld: libcrypto_sign_mqqsig224.a(mqq-sign.o):(.bss+0x20): multiple definition of `mqq_a'; /tmp/try-small-94edd8.o:(.bss+0x70): first defined here
try.c: /usr/bin/ld: libcrypto_sign_mqqsig224.a(mqq-sign.o):(.bss+0x80): multiple definition of `mqq_sigma1'; /tmp/try-small-94edd8.o:(.bss+0xf0): first defined here
try.c: /usr/bin/ld: libcrypto_sign_mqqsig224.a(mqq-sign.o):(.bss+0x160): multiple definition of `mqq_sigmaK'; /tmp/try-small-94edd8.o:(.bss+0x1d0): first defined here
try.c: /usr/bin/ld: libcrypto_sign_mqqsig224.a(mqq-sign.o):(.bss+0x240): multiple definition of `lookup_table_private_key'; /tmp/try-small-94edd8.o:(.bss+0x2b0): first defined here
try.c: /usr/bin/ld: libcrypto_sign_mqqsig224.a(mqq-verify.o):(.bss+0x0): multiple definition of `mqq_a'; /tmp/try-small-94edd8.o:(.bss+0x70): first defined here
try.c: /usr/bin/ld: libcrypto_sign_mqqsig224.a(mqq-verify.o):(.bss+0x60): multiple definition of `cc1'; /tmp/try-small-94edd8.o:(.bss+0xd0): first defined here
try.c: /usr/bin/ld: libcrypto_sign_mqqsig224.a(mqq-verify.o):(.bss+0x70): multiple definition of `cc2'; /tmp/try-small-94edd8.o:(.bss+0xe0): first defined here
try.c: /usr/bin/ld: libcrypto_sign_mqqsig224.a(mqq-verify.o):(.bss+0x80): multiple definition of `mqq_sigma1'; /tmp/try-small-94edd8.o:(.bss+0xf0): first defined here
try.c: /usr/bin/ld: libcrypto_sign_mqqsig224.a(mqq-verify.o):(.bss+0x160): multiple definition of `mqq_sigmaK'; /tmp/try-small-94edd8.o:(.bss+0x1d0): first defined here
try.c: /usr/bin/ld: libcrypto_sign_mqqsig224.a(mqq-verify.o):(.bss+0x240): multiple definition of `lookup_table_private_key'; /tmp/try-small-94edd8.o:(.bss+0x2b0): first defined here
try.c: clang: error: linker command failed with exit code 1 (use -v to see invocation)

Number of similar (compiler,implementation) pairs: 1, namely:
CompilerImplementations
clang -march=native -O2 -fomit-frame-pointer -fwrapv -Qunused-arguments -fPIC -fPIE T:ref

Compiler output

Implementation: T:ref
Security model: timingleaks
Compiler: clang -march=native -O3 -fomit-frame-pointer -fwrapv -Qunused-arguments -fPIC -fPIE
try.c: /usr/bin/ld: libcrypto_sign_mqqsig224.a(keygen.o):(.bss+0x240): multiple definition of `lookup_table_private_key'; /tmp/try-small-a68aba.o:(.bss+0x2b0): first defined here
try.c: /usr/bin/ld: libcrypto_sign_mqqsig224.a(keygen.o):(.bss+0x0): multiple definition of `mqq_a'; /tmp/try-small-a68aba.o:(.bss+0x70): first defined here
try.c: /usr/bin/ld: libcrypto_sign_mqqsig224.a(keygen.o):(.bss+0x60): multiple definition of `cc1'; /tmp/try-small-a68aba.o:(.bss+0xd0): first defined here
try.c: /usr/bin/ld: libcrypto_sign_mqqsig224.a(keygen.o):(.bss+0x70): multiple definition of `cc2'; /tmp/try-small-a68aba.o:(.bss+0xe0): first defined here
try.c: /usr/bin/ld: libcrypto_sign_mqqsig224.a(keygen.o):(.bss+0x80): multiple definition of `mqq_sigma1'; /tmp/try-small-a68aba.o:(.bss+0xf0): first defined here
try.c: /usr/bin/ld: libcrypto_sign_mqqsig224.a(keygen.o):(.bss+0x160): multiple definition of `mqq_sigmaK'; /tmp/try-small-a68aba.o:(.bss+0x1d0): first defined here
try.c: /usr/bin/ld: libcrypto_sign_mqqsig224.a(mqq-sign.o):(.bss+0x0): multiple definition of `cc1'; /tmp/try-small-a68aba.o:(.bss+0xd0): first defined here
try.c: /usr/bin/ld: libcrypto_sign_mqqsig224.a(mqq-sign.o):(.bss+0x10): multiple definition of `cc2'; /tmp/try-small-a68aba.o:(.bss+0xe0): first defined here
try.c: /usr/bin/ld: libcrypto_sign_mqqsig224.a(mqq-sign.o):(.bss+0x20): multiple definition of `mqq_a'; /tmp/try-small-a68aba.o:(.bss+0x70): first defined here
try.c: /usr/bin/ld: libcrypto_sign_mqqsig224.a(mqq-sign.o):(.bss+0x80): multiple definition of `mqq_sigma1'; /tmp/try-small-a68aba.o:(.bss+0xf0): first defined here
try.c: /usr/bin/ld: libcrypto_sign_mqqsig224.a(mqq-sign.o):(.bss+0x160): multiple definition of `mqq_sigmaK'; /tmp/try-small-a68aba.o:(.bss+0x1d0): first defined here
try.c: /usr/bin/ld: libcrypto_sign_mqqsig224.a(mqq-sign.o):(.bss+0x240): multiple definition of `lookup_table_private_key'; /tmp/try-small-a68aba.o:(.bss+0x2b0): first defined here
try.c: /usr/bin/ld: libcrypto_sign_mqqsig224.a(mqq-verify.o):(.bss+0x0): multiple definition of `mqq_a'; /tmp/try-small-a68aba.o:(.bss+0x70): first defined here
try.c: /usr/bin/ld: libcrypto_sign_mqqsig224.a(mqq-verify.o):(.bss+0x60): multiple definition of `cc1'; /tmp/try-small-a68aba.o:(.bss+0xd0): first defined here
try.c: /usr/bin/ld: libcrypto_sign_mqqsig224.a(mqq-verify.o):(.bss+0x70): multiple definition of `cc2'; /tmp/try-small-a68aba.o:(.bss+0xe0): first defined here
try.c: /usr/bin/ld: libcrypto_sign_mqqsig224.a(mqq-verify.o):(.bss+0x80): multiple definition of `mqq_sigma1'; /tmp/try-small-a68aba.o:(.bss+0xf0): first defined here
try.c: /usr/bin/ld: libcrypto_sign_mqqsig224.a(mqq-verify.o):(.bss+0x160): multiple definition of `mqq_sigmaK'; /tmp/try-small-a68aba.o:(.bss+0x1d0): first defined here
try.c: /usr/bin/ld: libcrypto_sign_mqqsig224.a(mqq-verify.o):(.bss+0x240): multiple definition of `lookup_table_private_key'; /tmp/try-small-a68aba.o:(.bss+0x2b0): first defined here
try.c: clang: error: linker command failed with exit code 1 (use -v to see invocation)

Number of similar (compiler,implementation) pairs: 1, namely:
CompilerImplementations
clang -march=native -O3 -fomit-frame-pointer -fwrapv -Qunused-arguments -fPIC -fPIE T:ref

Compiler output

Implementation: T:ref
Security model: timingleaks
Compiler: clang -march=native -O -fomit-frame-pointer -fwrapv -Qunused-arguments -fPIC -fPIE
try.c: /usr/bin/ld: libcrypto_sign_mqqsig224.a(keygen.o):(.bss+0x240): multiple definition of `lookup_table_private_key'; /tmp/try-small-ea68d1.o:(.bss+0x2b0): first defined here
try.c: /usr/bin/ld: libcrypto_sign_mqqsig224.a(keygen.o):(.bss+0x0): multiple definition of `mqq_a'; /tmp/try-small-ea68d1.o:(.bss+0x70): first defined here
try.c: /usr/bin/ld: libcrypto_sign_mqqsig224.a(keygen.o):(.bss+0x60): multiple definition of `cc1'; /tmp/try-small-ea68d1.o:(.bss+0xd0): first defined here
try.c: /usr/bin/ld: libcrypto_sign_mqqsig224.a(keygen.o):(.bss+0x70): multiple definition of `cc2'; /tmp/try-small-ea68d1.o:(.bss+0xe0): first defined here
try.c: /usr/bin/ld: libcrypto_sign_mqqsig224.a(keygen.o):(.bss+0x80): multiple definition of `mqq_sigma1'; /tmp/try-small-ea68d1.o:(.bss+0xf0): first defined here
try.c: /usr/bin/ld: libcrypto_sign_mqqsig224.a(keygen.o):(.bss+0x160): multiple definition of `mqq_sigmaK'; /tmp/try-small-ea68d1.o:(.bss+0x1d0): first defined here
try.c: /usr/bin/ld: libcrypto_sign_mqqsig224.a(mqq-sign.o):(.bss+0x0): multiple definition of `cc1'; /tmp/try-small-ea68d1.o:(.bss+0xd0): first defined here
try.c: /usr/bin/ld: libcrypto_sign_mqqsig224.a(mqq-sign.o):(.bss+0x10): multiple definition of `cc2'; /tmp/try-small-ea68d1.o:(.bss+0xe0): first defined here
try.c: /usr/bin/ld: libcrypto_sign_mqqsig224.a(mqq-sign.o):(.bss+0x20): multiple definition of `mqq_a'; /tmp/try-small-ea68d1.o:(.bss+0x70): first defined here
try.c: /usr/bin/ld: libcrypto_sign_mqqsig224.a(mqq-sign.o):(.bss+0x80): multiple definition of `mqq_sigma1'; /tmp/try-small-ea68d1.o:(.bss+0xf0): first defined here
try.c: /usr/bin/ld: libcrypto_sign_mqqsig224.a(mqq-sign.o):(.bss+0x160): multiple definition of `mqq_sigmaK'; /tmp/try-small-ea68d1.o:(.bss+0x1d0): first defined here
try.c: /usr/bin/ld: libcrypto_sign_mqqsig224.a(mqq-sign.o):(.bss+0x240): multiple definition of `lookup_table_private_key'; /tmp/try-small-ea68d1.o:(.bss+0x2b0): first defined here
try.c: /usr/bin/ld: libcrypto_sign_mqqsig224.a(mqq-verify.o):(.bss+0x0): multiple definition of `mqq_a'; /tmp/try-small-ea68d1.o:(.bss+0x70): first defined here
try.c: /usr/bin/ld: libcrypto_sign_mqqsig224.a(mqq-verify.o):(.bss+0x60): multiple definition of `cc1'; /tmp/try-small-ea68d1.o:(.bss+0xd0): first defined here
try.c: /usr/bin/ld: libcrypto_sign_mqqsig224.a(mqq-verify.o):(.bss+0x70): multiple definition of `cc2'; /tmp/try-small-ea68d1.o:(.bss+0xe0): first defined here
try.c: /usr/bin/ld: libcrypto_sign_mqqsig224.a(mqq-verify.o):(.bss+0x80): multiple definition of `mqq_sigma1'; /tmp/try-small-ea68d1.o:(.bss+0xf0): first defined here
try.c: /usr/bin/ld: libcrypto_sign_mqqsig224.a(mqq-verify.o):(.bss+0x160): multiple definition of `mqq_sigmaK'; /tmp/try-small-ea68d1.o:(.bss+0x1d0): first defined here
try.c: /usr/bin/ld: libcrypto_sign_mqqsig224.a(mqq-verify.o):(.bss+0x240): multiple definition of `lookup_table_private_key'; /tmp/try-small-ea68d1.o:(.bss+0x2b0): first defined here
try.c: clang: error: linker command failed with exit code 1 (use -v to see invocation)

Number of similar (compiler,implementation) pairs: 1, namely:
CompilerImplementations
clang -march=native -O -fomit-frame-pointer -fwrapv -Qunused-arguments -fPIC -fPIE T:ref

Compiler output

Implementation: T:ref
Security model: timingleaks
Compiler: clang -march=native -Os -fomit-frame-pointer -fwrapv -Qunused-arguments -fPIC -fPIE
try.c: /usr/bin/ld: libcrypto_sign_mqqsig224.a(keygen.o):(.bss+0x240): multiple definition of `lookup_table_private_key'; /tmp/try-small-ca5a8b.o:(.bss+0x2b0): first defined here
try.c: /usr/bin/ld: libcrypto_sign_mqqsig224.a(keygen.o):(.bss+0x0): multiple definition of `mqq_a'; /tmp/try-small-ca5a8b.o:(.bss+0x70): first defined here
try.c: /usr/bin/ld: libcrypto_sign_mqqsig224.a(keygen.o):(.bss+0x60): multiple definition of `cc1'; /tmp/try-small-ca5a8b.o:(.bss+0xd0): first defined here
try.c: /usr/bin/ld: libcrypto_sign_mqqsig224.a(keygen.o):(.bss+0x70): multiple definition of `cc2'; /tmp/try-small-ca5a8b.o:(.bss+0xe0): first defined here
try.c: /usr/bin/ld: libcrypto_sign_mqqsig224.a(keygen.o):(.bss+0x80): multiple definition of `mqq_sigma1'; /tmp/try-small-ca5a8b.o:(.bss+0xf0): first defined here
try.c: /usr/bin/ld: libcrypto_sign_mqqsig224.a(keygen.o):(.bss+0x160): multiple definition of `mqq_sigmaK'; /tmp/try-small-ca5a8b.o:(.bss+0x1d0): first defined here
try.c: /usr/bin/ld: libcrypto_sign_mqqsig224.a(mqq-sign.o):(.bss+0x0): multiple definition of `cc1'; /tmp/try-small-ca5a8b.o:(.bss+0xd0): first defined here
try.c: /usr/bin/ld: libcrypto_sign_mqqsig224.a(mqq-sign.o):(.bss+0x10): multiple definition of `cc2'; /tmp/try-small-ca5a8b.o:(.bss+0xe0): first defined here
try.c: /usr/bin/ld: libcrypto_sign_mqqsig224.a(mqq-sign.o):(.bss+0x20): multiple definition of `mqq_a'; /tmp/try-small-ca5a8b.o:(.bss+0x70): first defined here
try.c: /usr/bin/ld: libcrypto_sign_mqqsig224.a(mqq-sign.o):(.bss+0x80): multiple definition of `mqq_sigma1'; /tmp/try-small-ca5a8b.o:(.bss+0xf0): first defined here
try.c: /usr/bin/ld: libcrypto_sign_mqqsig224.a(mqq-sign.o):(.bss+0x160): multiple definition of `mqq_sigmaK'; /tmp/try-small-ca5a8b.o:(.bss+0x1d0): first defined here
try.c: /usr/bin/ld: libcrypto_sign_mqqsig224.a(mqq-sign.o):(.bss+0x240): multiple definition of `lookup_table_private_key'; /tmp/try-small-ca5a8b.o:(.bss+0x2b0): first defined here
try.c: /usr/bin/ld: libcrypto_sign_mqqsig224.a(mqq-verify.o):(.bss+0x0): multiple definition of `mqq_a'; /tmp/try-small-ca5a8b.o:(.bss+0x70): first defined here
try.c: /usr/bin/ld: libcrypto_sign_mqqsig224.a(mqq-verify.o):(.bss+0x60): multiple definition of `cc1'; /tmp/try-small-ca5a8b.o:(.bss+0xd0): first defined here
try.c: /usr/bin/ld: libcrypto_sign_mqqsig224.a(mqq-verify.o):(.bss+0x70): multiple definition of `cc2'; /tmp/try-small-ca5a8b.o:(.bss+0xe0): first defined here
try.c: /usr/bin/ld: libcrypto_sign_mqqsig224.a(mqq-verify.o):(.bss+0x80): multiple definition of `mqq_sigma1'; /tmp/try-small-ca5a8b.o:(.bss+0xf0): first defined here
try.c: /usr/bin/ld: libcrypto_sign_mqqsig224.a(mqq-verify.o):(.bss+0x160): multiple definition of `mqq_sigmaK'; /tmp/try-small-ca5a8b.o:(.bss+0x1d0): first defined here
try.c: /usr/bin/ld: libcrypto_sign_mqqsig224.a(mqq-verify.o):(.bss+0x240): multiple definition of `lookup_table_private_key'; /tmp/try-small-ca5a8b.o:(.bss+0x2b0): first defined here
try.c: clang: error: linker command failed with exit code 1 (use -v to see invocation)

Number of similar (compiler,implementation) pairs: 1, namely:
CompilerImplementations
clang -march=native -Os -fomit-frame-pointer -fwrapv -Qunused-arguments -fPIC -fPIE T:ref

Compiler output

Implementation: T:ref
Security model: timingleaks
Compiler: clang -mcpu=native -O3 -fomit-frame-pointer -fwrapv -Qunused-arguments -fPIC -fPIE
try.c: /usr/bin/ld: libcrypto_sign_mqqsig224.a(keygen.o):(.bss+0x240): multiple definition of `lookup_table_private_key'; /tmp/try-small-717ef2.o:(.bss+0x2b0): first defined here
try.c: /usr/bin/ld: libcrypto_sign_mqqsig224.a(keygen.o):(.bss+0x0): multiple definition of `mqq_a'; /tmp/try-small-717ef2.o:(.bss+0x70): first defined here
try.c: /usr/bin/ld: libcrypto_sign_mqqsig224.a(keygen.o):(.bss+0x60): multiple definition of `cc1'; /tmp/try-small-717ef2.o:(.bss+0xd0): first defined here
try.c: /usr/bin/ld: libcrypto_sign_mqqsig224.a(keygen.o):(.bss+0x70): multiple definition of `cc2'; /tmp/try-small-717ef2.o:(.bss+0xe0): first defined here
try.c: /usr/bin/ld: libcrypto_sign_mqqsig224.a(keygen.o):(.bss+0x80): multiple definition of `mqq_sigma1'; /tmp/try-small-717ef2.o:(.bss+0xf0): first defined here
try.c: /usr/bin/ld: libcrypto_sign_mqqsig224.a(keygen.o):(.bss+0x160): multiple definition of `mqq_sigmaK'; /tmp/try-small-717ef2.o:(.bss+0x1d0): first defined here
try.c: /usr/bin/ld: libcrypto_sign_mqqsig224.a(mqq-sign.o):(.bss+0x0): multiple definition of `cc1'; /tmp/try-small-717ef2.o:(.bss+0xd0): first defined here
try.c: /usr/bin/ld: libcrypto_sign_mqqsig224.a(mqq-sign.o):(.bss+0x10): multiple definition of `cc2'; /tmp/try-small-717ef2.o:(.bss+0xe0): first defined here
try.c: /usr/bin/ld: libcrypto_sign_mqqsig224.a(mqq-sign.o):(.bss+0x20): multiple definition of `mqq_a'; /tmp/try-small-717ef2.o:(.bss+0x70): first defined here
try.c: /usr/bin/ld: libcrypto_sign_mqqsig224.a(mqq-sign.o):(.bss+0x80): multiple definition of `mqq_sigma1'; /tmp/try-small-717ef2.o:(.bss+0xf0): first defined here
try.c: /usr/bin/ld: libcrypto_sign_mqqsig224.a(mqq-sign.o):(.bss+0x160): multiple definition of `mqq_sigmaK'; /tmp/try-small-717ef2.o:(.bss+0x1d0): first defined here
try.c: /usr/bin/ld: libcrypto_sign_mqqsig224.a(mqq-sign.o):(.bss+0x240): multiple definition of `lookup_table_private_key'; /tmp/try-small-717ef2.o:(.bss+0x2b0): first defined here
try.c: /usr/bin/ld: libcrypto_sign_mqqsig224.a(mqq-verify.o):(.bss+0x0): multiple definition of `mqq_a'; /tmp/try-small-717ef2.o:(.bss+0x70): first defined here
try.c: /usr/bin/ld: libcrypto_sign_mqqsig224.a(mqq-verify.o):(.bss+0x60): multiple definition of `cc1'; /tmp/try-small-717ef2.o:(.bss+0xd0): first defined here
try.c: /usr/bin/ld: libcrypto_sign_mqqsig224.a(mqq-verify.o):(.bss+0x70): multiple definition of `cc2'; /tmp/try-small-717ef2.o:(.bss+0xe0): first defined here
try.c: /usr/bin/ld: libcrypto_sign_mqqsig224.a(mqq-verify.o):(.bss+0x80): multiple definition of `mqq_sigma1'; /tmp/try-small-717ef2.o:(.bss+0xf0): first defined here
try.c: /usr/bin/ld: libcrypto_sign_mqqsig224.a(mqq-verify.o):(.bss+0x160): multiple definition of `mqq_sigmaK'; /tmp/try-small-717ef2.o:(.bss+0x1d0): first defined here
try.c: /usr/bin/ld: libcrypto_sign_mqqsig224.a(mqq-verify.o):(.bss+0x240): multiple definition of `lookup_table_private_key'; /tmp/try-small-717ef2.o:(.bss+0x2b0): first defined here
try.c: clang: error: linker command failed with exit code 1 (use -v to see invocation)

Number of similar (compiler,implementation) pairs: 1, namely:
CompilerImplementations
clang -mcpu=native -O3 -fomit-frame-pointer -fwrapv -Qunused-arguments -fPIC -fPIE T:ref

Compiler output

Implementation: T:ref
Security model: timingleaks
Compiler: gcc -march=native -mtune=native -O2 -fomit-frame-pointer -fwrapv -fPIC -fPIE
try.c: /usr/bin/ld: libcrypto_sign_mqqsig224.a(keygen.o):(.bss+0x0): multiple definition of `lookup_table_private_key'; /tmp/cckmh0nA.o:(.bss+0x20): first defined here
try.c: /usr/bin/ld: libcrypto_sign_mqqsig224.a(keygen.o):(.bss+0x20000): multiple definition of `mqq_sigmaK'; /tmp/cckmh0nA.o:(.bss+0x20020): first defined here
try.c: /usr/bin/ld: libcrypto_sign_mqqsig224.a(keygen.o):(.bss+0x200e0): multiple definition of `mqq_sigma1'; /tmp/cckmh0nA.o:(.bss+0x20100): first defined here
try.c: /usr/bin/ld: libcrypto_sign_mqqsig224.a(keygen.o):(.bss+0x201c0): multiple definition of `cc2'; /tmp/cckmh0nA.o:(.bss+0x201e0): first defined here
try.c: /usr/bin/ld: libcrypto_sign_mqqsig224.a(keygen.o):(.bss+0x201d0): multiple definition of `cc1'; /tmp/cckmh0nA.o:(.bss+0x201f0): first defined here
try.c: /usr/bin/ld: libcrypto_sign_mqqsig224.a(keygen.o):(.bss+0x201e0): multiple definition of `mqq_a'; /tmp/cckmh0nA.o:(.bss+0x20200): first defined here
try.c: /usr/bin/ld: libcrypto_sign_mqqsig224.a(mqq-sign.o):(.bss+0x201d0): multiple definition of `cc1'; /tmp/cckmh0nA.o:(.bss+0x201f0): first defined here
try.c: /usr/bin/ld: libcrypto_sign_mqqsig224.a(mqq-sign.o):(.bss+0x201e0): multiple definition of `mqq_a'; /tmp/cckmh0nA.o:(.bss+0x20200): first defined here
try.c: /usr/bin/ld: libcrypto_sign_mqqsig224.a(mqq-sign.o):(.bss+0x201c0): multiple definition of `cc2'; /tmp/cckmh0nA.o:(.bss+0x201e0): first defined here
try.c: /usr/bin/ld: libcrypto_sign_mqqsig224.a(mqq-sign.o):(.bss+0x20000): multiple definition of `mqq_sigmaK'; /tmp/cckmh0nA.o:(.bss+0x20020): first defined here
try.c: /usr/bin/ld: libcrypto_sign_mqqsig224.a(mqq-sign.o):(.bss+0x200e0): multiple definition of `mqq_sigma1'; /tmp/cckmh0nA.o:(.bss+0x20100): first defined here
try.c: /usr/bin/ld: libcrypto_sign_mqqsig224.a(mqq-sign.o):(.bss+0x0): multiple definition of `lookup_table_private_key'; /tmp/cckmh0nA.o:(.bss+0x20): first defined here
try.c: /usr/bin/ld: libcrypto_sign_mqqsig224.a(mqq-verify.o):(.bss+0x0): multiple definition of `lookup_table_private_key'; /tmp/cckmh0nA.o:(.bss+0x20): first defined here
try.c: /usr/bin/ld: libcrypto_sign_mqqsig224.a(mqq-verify.o):(.bss+0x20000): multiple definition of `mqq_sigmaK'; /tmp/cckmh0nA.o:(.bss+0x20020): first defined here
try.c: /usr/bin/ld: libcrypto_sign_mqqsig224.a(mqq-verify.o):(.bss+0x200e0): multiple definition of `mqq_sigma1'; /tmp/cckmh0nA.o:(.bss+0x20100): first defined here
try.c: /usr/bin/ld: libcrypto_sign_mqqsig224.a(mqq-verify.o):(.bss+0x201c0): multiple definition of `cc2'; /tmp/cckmh0nA.o:(.bss+0x201e0): first defined here
try.c: /usr/bin/ld: libcrypto_sign_mqqsig224.a(mqq-verify.o):(.bss+0x201d0): multiple definition of `cc1'; /tmp/cckmh0nA.o:(.bss+0x201f0): first defined here
try.c: /usr/bin/ld: libcrypto_sign_mqqsig224.a(mqq-verify.o):(.bss+0x201e0): multiple definition of `mqq_a'; /tmp/cckmh0nA.o:(.bss+0x20200): first defined here
try.c: collect2: error: ld returned 1 exit status

Number of similar (compiler,implementation) pairs: 1, namely:
CompilerImplementations
gcc -march=native -mtune=native -O2 -fomit-frame-pointer -fwrapv -fPIC -fPIE T:ref

Compiler output

Implementation: T:ref
Security model: timingleaks
Compiler: gcc -march=native -mtune=native -O3 -fomit-frame-pointer -fwrapv -fPIC -fPIE
try.c: /usr/bin/ld: libcrypto_sign_mqqsig224.a(keygen.o):(.bss+0x0): multiple definition of `lookup_table_private_key'; /tmp/cc2Df39e.o:(.bss+0x20): first defined here
try.c: /usr/bin/ld: libcrypto_sign_mqqsig224.a(keygen.o):(.bss+0x20000): multiple definition of `mqq_sigmaK'; /tmp/cc2Df39e.o:(.bss+0x20020): first defined here
try.c: /usr/bin/ld: libcrypto_sign_mqqsig224.a(keygen.o):(.bss+0x200e0): multiple definition of `mqq_sigma1'; /tmp/cc2Df39e.o:(.bss+0x20100): first defined here
try.c: /usr/bin/ld: libcrypto_sign_mqqsig224.a(keygen.o):(.bss+0x201c0): multiple definition of `cc2'; /tmp/cc2Df39e.o:(.bss+0x201e0): first defined here
try.c: /usr/bin/ld: libcrypto_sign_mqqsig224.a(keygen.o):(.bss+0x201d0): multiple definition of `cc1'; /tmp/cc2Df39e.o:(.bss+0x201f0): first defined here
try.c: /usr/bin/ld: libcrypto_sign_mqqsig224.a(keygen.o):(.bss+0x201e0): multiple definition of `mqq_a'; /tmp/cc2Df39e.o:(.bss+0x20200): first defined here
try.c: /usr/bin/ld: libcrypto_sign_mqqsig224.a(mqq-sign.o):(.bss+0x20000): multiple definition of `mqq_sigmaK'; /tmp/cc2Df39e.o:(.bss+0x20020): first defined here
try.c: /usr/bin/ld: libcrypto_sign_mqqsig224.a(mqq-sign.o):(.bss+0x200e0): multiple definition of `mqq_sigma1'; /tmp/cc2Df39e.o:(.bss+0x20100): first defined here
try.c: /usr/bin/ld: libcrypto_sign_mqqsig224.a(mqq-sign.o):(.bss+0x201d0): multiple definition of `cc1'; /tmp/cc2Df39e.o:(.bss+0x201f0): first defined here
try.c: /usr/bin/ld: libcrypto_sign_mqqsig224.a(mqq-sign.o):(.bss+0x201c0): multiple definition of `cc2'; /tmp/cc2Df39e.o:(.bss+0x201e0): first defined here
try.c: /usr/bin/ld: libcrypto_sign_mqqsig224.a(mqq-sign.o):(.bss+0x201e0): multiple definition of `mqq_a'; /tmp/cc2Df39e.o:(.bss+0x20200): first defined here
try.c: /usr/bin/ld: libcrypto_sign_mqqsig224.a(mqq-sign.o):(.bss+0x0): multiple definition of `lookup_table_private_key'; /tmp/cc2Df39e.o:(.bss+0x20): first defined here
try.c: /usr/bin/ld: libcrypto_sign_mqqsig224.a(mqq-verify.o):(.bss+0x0): multiple definition of `lookup_table_private_key'; /tmp/cc2Df39e.o:(.bss+0x20): first defined here
try.c: /usr/bin/ld: libcrypto_sign_mqqsig224.a(mqq-verify.o):(.bss+0x20000): multiple definition of `mqq_sigmaK'; /tmp/cc2Df39e.o:(.bss+0x20020): first defined here
try.c: /usr/bin/ld: libcrypto_sign_mqqsig224.a(mqq-verify.o):(.bss+0x200e0): multiple definition of `mqq_sigma1'; /tmp/cc2Df39e.o:(.bss+0x20100): first defined here
try.c: /usr/bin/ld: libcrypto_sign_mqqsig224.a(mqq-verify.o):(.bss+0x201c0): multiple definition of `cc2'; /tmp/cc2Df39e.o:(.bss+0x201e0): first defined here
try.c: /usr/bin/ld: libcrypto_sign_mqqsig224.a(mqq-verify.o):(.bss+0x201d0): multiple definition of `cc1'; /tmp/cc2Df39e.o:(.bss+0x201f0): first defined here
try.c: /usr/bin/ld: libcrypto_sign_mqqsig224.a(mqq-verify.o):(.bss+0x201e0): multiple definition of `mqq_a'; /tmp/cc2Df39e.o:(.bss+0x20200): first defined here
try.c: collect2: error: ld returned 1 exit status

Number of similar (compiler,implementation) pairs: 1, namely:
CompilerImplementations
gcc -march=native -mtune=native -O3 -fomit-frame-pointer -fwrapv -fPIC -fPIE T:ref

Compiler output

Implementation: T:ref
Security model: timingleaks
Compiler: gcc -march=native -mtune=native -O -fomit-frame-pointer -fwrapv -fPIC -fPIE
try.c: /usr/bin/ld: libcrypto_sign_mqqsig224.a(keygen.o):(.bss+0x0): multiple definition of `lookup_table_private_key'; /tmp/cc3RRLaT.o:(.bss+0x20): first defined here
try.c: /usr/bin/ld: libcrypto_sign_mqqsig224.a(keygen.o):(.bss+0x20000): multiple definition of `mqq_sigmaK'; /tmp/cc3RRLaT.o:(.bss+0x20020): first defined here
try.c: /usr/bin/ld: libcrypto_sign_mqqsig224.a(keygen.o):(.bss+0x200e0): multiple definition of `mqq_sigma1'; /tmp/cc3RRLaT.o:(.bss+0x20100): first defined here
try.c: /usr/bin/ld: libcrypto_sign_mqqsig224.a(keygen.o):(.bss+0x201c0): multiple definition of `cc2'; /tmp/cc3RRLaT.o:(.bss+0x201e0): first defined here
try.c: /usr/bin/ld: libcrypto_sign_mqqsig224.a(keygen.o):(.bss+0x201d0): multiple definition of `cc1'; /tmp/cc3RRLaT.o:(.bss+0x201f0): first defined here
try.c: /usr/bin/ld: libcrypto_sign_mqqsig224.a(keygen.o):(.bss+0x201e0): multiple definition of `mqq_a'; /tmp/cc3RRLaT.o:(.bss+0x20200): first defined here
try.c: /usr/bin/ld: libcrypto_sign_mqqsig224.a(mqq-sign.o):(.bss+0x20000): multiple definition of `mqq_sigmaK'; /tmp/cc3RRLaT.o:(.bss+0x20020): first defined here
try.c: /usr/bin/ld: libcrypto_sign_mqqsig224.a(mqq-sign.o):(.bss+0x200e0): multiple definition of `mqq_sigma1'; /tmp/cc3RRLaT.o:(.bss+0x20100): first defined here
try.c: /usr/bin/ld: libcrypto_sign_mqqsig224.a(mqq-sign.o):(.bss+0x201d0): multiple definition of `cc1'; /tmp/cc3RRLaT.o:(.bss+0x201f0): first defined here
try.c: /usr/bin/ld: libcrypto_sign_mqqsig224.a(mqq-sign.o):(.bss+0x201e0): multiple definition of `mqq_a'; /tmp/cc3RRLaT.o:(.bss+0x20200): first defined here
try.c: /usr/bin/ld: libcrypto_sign_mqqsig224.a(mqq-sign.o):(.bss+0x201c0): multiple definition of `cc2'; /tmp/cc3RRLaT.o:(.bss+0x201e0): first defined here
try.c: /usr/bin/ld: libcrypto_sign_mqqsig224.a(mqq-sign.o):(.bss+0x0): multiple definition of `lookup_table_private_key'; /tmp/cc3RRLaT.o:(.bss+0x20): first defined here
try.c: /usr/bin/ld: libcrypto_sign_mqqsig224.a(mqq-verify.o):(.bss+0x0): multiple definition of `lookup_table_private_key'; /tmp/cc3RRLaT.o:(.bss+0x20): first defined here
try.c: /usr/bin/ld: libcrypto_sign_mqqsig224.a(mqq-verify.o):(.bss+0x20000): multiple definition of `mqq_sigmaK'; /tmp/cc3RRLaT.o:(.bss+0x20020): first defined here
try.c: /usr/bin/ld: libcrypto_sign_mqqsig224.a(mqq-verify.o):(.bss+0x200e0): multiple definition of `mqq_sigma1'; /tmp/cc3RRLaT.o:(.bss+0x20100): first defined here
try.c: /usr/bin/ld: libcrypto_sign_mqqsig224.a(mqq-verify.o):(.bss+0x201c0): multiple definition of `cc2'; /tmp/cc3RRLaT.o:(.bss+0x201e0): first defined here
try.c: /usr/bin/ld: libcrypto_sign_mqqsig224.a(mqq-verify.o):(.bss+0x201d0): multiple definition of `cc1'; /tmp/cc3RRLaT.o:(.bss+0x201f0): first defined here
try.c: /usr/bin/ld: libcrypto_sign_mqqsig224.a(mqq-verify.o):(.bss+0x201e0): multiple definition of `mqq_a'; /tmp/cc3RRLaT.o:(.bss+0x20200): first defined here
try.c: collect2: error: ld returned 1 exit status

Number of similar (compiler,implementation) pairs: 1, namely:
CompilerImplementations
gcc -march=native -mtune=native -O -fomit-frame-pointer -fwrapv -fPIC -fPIE T:ref

Compiler output

Implementation: T:ref
Security model: timingleaks
Compiler: gcc -march=native -mtune=native -Os -fomit-frame-pointer -fwrapv -fPIC -fPIE
try.c: /usr/bin/ld: libcrypto_sign_mqqsig224.a(keygen.o):(.bss+0x0): multiple definition of `lookup_table_private_key'; /tmp/ccQve3AX.o:(.bss+0x20): first defined here
try.c: /usr/bin/ld: libcrypto_sign_mqqsig224.a(keygen.o):(.bss+0x20000): multiple definition of `mqq_sigmaK'; /tmp/ccQve3AX.o:(.bss+0x20020): first defined here
try.c: /usr/bin/ld: libcrypto_sign_mqqsig224.a(keygen.o):(.bss+0x200e0): multiple definition of `mqq_sigma1'; /tmp/ccQve3AX.o:(.bss+0x20100): first defined here
try.c: /usr/bin/ld: libcrypto_sign_mqqsig224.a(keygen.o):(.bss+0x201c0): multiple definition of `cc2'; /tmp/ccQve3AX.o:(.bss+0x201e0): first defined here
try.c: /usr/bin/ld: libcrypto_sign_mqqsig224.a(keygen.o):(.bss+0x201d0): multiple definition of `cc1'; /tmp/ccQve3AX.o:(.bss+0x201f0): first defined here
try.c: /usr/bin/ld: libcrypto_sign_mqqsig224.a(keygen.o):(.bss+0x201e0): multiple definition of `mqq_a'; /tmp/ccQve3AX.o:(.bss+0x20200): first defined here
try.c: /usr/bin/ld: libcrypto_sign_mqqsig224.a(mqq-sign.o):(.bss+0x20000): multiple definition of `mqq_sigmaK'; /tmp/ccQve3AX.o:(.bss+0x20020): first defined here
try.c: /usr/bin/ld: libcrypto_sign_mqqsig224.a(mqq-sign.o):(.bss+0x200e0): multiple definition of `mqq_sigma1'; /tmp/ccQve3AX.o:(.bss+0x20100): first defined here
try.c: /usr/bin/ld: libcrypto_sign_mqqsig224.a(mqq-sign.o):(.bss+0x201d0): multiple definition of `cc1'; /tmp/ccQve3AX.o:(.bss+0x201f0): first defined here
try.c: /usr/bin/ld: libcrypto_sign_mqqsig224.a(mqq-sign.o):(.bss+0x201e0): multiple definition of `mqq_a'; /tmp/ccQve3AX.o:(.bss+0x20200): first defined here
try.c: /usr/bin/ld: libcrypto_sign_mqqsig224.a(mqq-sign.o):(.bss+0x201c0): multiple definition of `cc2'; /tmp/ccQve3AX.o:(.bss+0x201e0): first defined here
try.c: /usr/bin/ld: libcrypto_sign_mqqsig224.a(mqq-sign.o):(.bss+0x0): multiple definition of `lookup_table_private_key'; /tmp/ccQve3AX.o:(.bss+0x20): first defined here
try.c: /usr/bin/ld: libcrypto_sign_mqqsig224.a(mqq-verify.o):(.bss+0x0): multiple definition of `lookup_table_private_key'; /tmp/ccQve3AX.o:(.bss+0x20): first defined here
try.c: /usr/bin/ld: libcrypto_sign_mqqsig224.a(mqq-verify.o):(.bss+0x20000): multiple definition of `mqq_sigmaK'; /tmp/ccQve3AX.o:(.bss+0x20020): first defined here
try.c: /usr/bin/ld: libcrypto_sign_mqqsig224.a(mqq-verify.o):(.bss+0x200e0): multiple definition of `mqq_sigma1'; /tmp/ccQve3AX.o:(.bss+0x20100): first defined here
try.c: /usr/bin/ld: libcrypto_sign_mqqsig224.a(mqq-verify.o):(.bss+0x201c0): multiple definition of `cc2'; /tmp/ccQve3AX.o:(.bss+0x201e0): first defined here
try.c: /usr/bin/ld: libcrypto_sign_mqqsig224.a(mqq-verify.o):(.bss+0x201d0): multiple definition of `cc1'; /tmp/ccQve3AX.o:(.bss+0x201f0): first defined here
try.c: /usr/bin/ld: libcrypto_sign_mqqsig224.a(mqq-verify.o):(.bss+0x201e0): multiple definition of `mqq_a'; /tmp/ccQve3AX.o:(.bss+0x20200): first defined here
try.c: collect2: error: ld returned 1 exit status

Number of similar (compiler,implementation) pairs: 1, namely:
CompilerImplementations
gcc -march=native -mtune=native -Os -fomit-frame-pointer -fwrapv -fPIC -fPIE T:ref