Implementation notes: amd64, kizomba, crypto_hash/prh64s256

Computer: kizomba
Architecture: amd64
CPU ID: GenuineIntel-000906e9-bfebfbff
SUPERCOP version: 20210604
Operation: crypto_hash
Primitive: prh64s256
TimeObject sizeTest sizeImplementationCompilerBenchmark dateSUPERCOP version
8672869 0 017022 776 808refgcc_-march=native_-mtune=native_-O3_-fomit-frame-pointer_-fwrapv_-fPIC_-fPIE2021032320210323
8892473 0 013189 768 808refgcc_-march=native_-mtune=native_-O2_-fomit-frame-pointer_-fwrapv_-fPIC_-fPIE2021032320210323
9362332 0 012925 768 808refgcc_-march=native_-mtune=native_-O_-fomit-frame-pointer_-fwrapv_-fPIC_-fPIE2021032320210323

Compiler output

Implementation: ref
Security model: constbranchindex
Compiler: clang -march=native -O2 -fomit-frame-pointer -fwrapv -Qunused-arguments -fPIC -fPIE
try.c: libcrypto_hash_prh64s256.a(hash.o): In function `crypto_hash_prh64s256_ref_constbranchindex':
try.c: hash.c:(.text+0x...): undefined reference to `prvhash64s_oneshot'
try.c: clang: error: linker command failed with exit code 1 (use -v to see invocation)

Number of similar (compiler,implementation) pairs: 4, namely:
CompilerImplementations
clang -march=native -O2 -fomit-frame-pointer -fwrapv -Qunused-arguments -fPIC -fPIE ref
clang -march=native -O3 -fomit-frame-pointer -fwrapv -Qunused-arguments -fPIC -fPIE ref
clang -march=native -O -fomit-frame-pointer -fwrapv -Qunused-arguments -fPIC -fPIE ref
clang -mcpu=native -O3 -fomit-frame-pointer -fwrapv -Qunused-arguments -fPIC -fPIE ref

Compiler output

Implementation: ref
Security model: constbranchindex
Compiler: clang -march=native -Os -fomit-frame-pointer -fwrapv -Qunused-arguments -fPIC -fPIE
try.c: libcrypto_hash_prh64s256.a(hash.o): In function `crypto_hash_prh64s256_ref_constbranchindex':
try.c: hash.c:(.text+0x...): undefined reference to `prvhash64s_update'
try.c: hash.c:(.text+0x...): undefined reference to `prvhash64s_final'
try.c: clang: error: linker command failed with exit code 1 (use -v to see invocation)

Number of similar (compiler,implementation) pairs: 1, namely:
CompilerImplementations
clang -march=native -Os -fomit-frame-pointer -fwrapv -Qunused-arguments -fPIC -fPIE ref

Compiler output

Implementation: ref
Security model: constbranchindex
Compiler: gcc -march=native -mtune=native -Os -fomit-frame-pointer -fwrapv -fPIC -fPIE
try.c: libcrypto_hash_prh64s256.a(hash.o): In function `crypto_hash_prh64s256_ref_constbranchindex':
try.c: hash.c:(.text+0x...): undefined reference to `prvhash64s_oneshot'
try.c: collect2: error: ld returned 1 exit status

Number of similar (compiler,implementation) pairs: 1, namely:
CompilerImplementations
gcc -march=native -mtune=native -Os -fomit-frame-pointer -fwrapv -fPIC -fPIE ref