Implementation notes: amd64, kizomba, crypto_hash/hamsi512

Computer: kizomba
Architecture: amd64
CPU ID: GenuineIntel-000906e9-bfebfbff
SUPERCOP version: 20181216
Operation: crypto_hash
Primitive: hamsi512

Compiler output

Implementation: crypto_hash/hamsi512/sphlib
Compiler: cc
hamsi.c: hamsi.c:111:10: fatal error: hamsi_helper.c: No such file or directory
hamsi.c: #include "hamsi_helper.c"
hamsi.c: ^~~~~~~~~~~~~~~~
hamsi.c: compilation terminated.

Number of similar (compiler,implementation) pairs: 214, namely:
CompilerImplementations
cc sphlib sphlib-small
gcc sphlib sphlib-small
gcc -O2 -fomit-frame-pointer sphlib sphlib-small
gcc -O3 -fomit-frame-pointer sphlib sphlib-small
gcc -O -fomit-frame-pointer sphlib sphlib-small
gcc -Os -fomit-frame-pointer sphlib sphlib-small
gcc -fno-schedule-insns -O2 -fomit-frame-pointer sphlib sphlib-small
gcc -fno-schedule-insns -O3 -fomit-frame-pointer sphlib sphlib-small
gcc -fno-schedule-insns -O -fomit-frame-pointer sphlib sphlib-small
gcc -fno-schedule-insns -Os -fomit-frame-pointer sphlib sphlib-small
gcc -funroll-loops sphlib sphlib-small
gcc -funroll-loops -O2 -fomit-frame-pointer sphlib sphlib-small
gcc -funroll-loops -O3 -fomit-frame-pointer sphlib sphlib-small
gcc -funroll-loops -O -fomit-frame-pointer sphlib sphlib-small
gcc -funroll-loops -Os -fomit-frame-pointer sphlib sphlib-small
gcc -funroll-loops -fno-schedule-insns -O2 -fomit-frame-pointer sphlib sphlib-small
gcc -funroll-loops -fno-schedule-insns -O3 -fomit-frame-pointer sphlib sphlib-small
gcc -funroll-loops -fno-schedule-insns -O -fomit-frame-pointer sphlib sphlib-small
gcc -funroll-loops -fno-schedule-insns -Os -fomit-frame-pointer sphlib sphlib-small
gcc -funroll-loops -m64 -O2 -fomit-frame-pointer sphlib sphlib-small
gcc -funroll-loops -m64 -O3 -fomit-frame-pointer sphlib sphlib-small
gcc -funroll-loops -m64 -O -fomit-frame-pointer sphlib sphlib-small
gcc -funroll-loops -m64 -Os -fomit-frame-pointer sphlib sphlib-small
gcc -funroll-loops -m64 -march=barcelona -O2 -fomit-frame-pointer sphlib sphlib-small
gcc -funroll-loops -m64 -march=barcelona -O3 -fomit-frame-pointer sphlib sphlib-small
gcc -funroll-loops -m64 -march=barcelona -O -fomit-frame-pointer sphlib sphlib-small
gcc -funroll-loops -m64 -march=barcelona -Os -fomit-frame-pointer sphlib sphlib-small
gcc -funroll-loops -m64 -march=k8 -O2 -fomit-frame-pointer sphlib sphlib-small
gcc -funroll-loops -m64 -march=k8 -O3 -fomit-frame-pointer sphlib sphlib-small
gcc -funroll-loops -m64 -march=k8 -O -fomit-frame-pointer sphlib sphlib-small
gcc -funroll-loops -m64 -march=k8 -Os -fomit-frame-pointer sphlib sphlib-small
gcc -funroll-loops -m64 -march=nocona -O2 -fomit-frame-pointer sphlib sphlib-small
gcc -funroll-loops -m64 -march=nocona -O3 -fomit-frame-pointer sphlib sphlib-small
gcc -funroll-loops -m64 -march=nocona -O -fomit-frame-pointer sphlib sphlib-small
gcc -funroll-loops -m64 -march=nocona -Os -fomit-frame-pointer sphlib sphlib-small
gcc -funroll-loops -march=barcelona -O2 -fomit-frame-pointer sphlib sphlib-small
gcc -funroll-loops -march=barcelona -O3 -fomit-frame-pointer sphlib sphlib-small
gcc -funroll-loops -march=barcelona -O -fomit-frame-pointer sphlib sphlib-small
gcc -funroll-loops -march=barcelona -Os -fomit-frame-pointer sphlib sphlib-small
gcc -funroll-loops -march=k8 -O2 -fomit-frame-pointer sphlib sphlib-small
gcc -funroll-loops -march=k8 -O3 -fomit-frame-pointer sphlib sphlib-small
gcc -funroll-loops -march=k8 -O -fomit-frame-pointer sphlib sphlib-small
gcc -funroll-loops -march=k8 -Os -fomit-frame-pointer sphlib sphlib-small
gcc -funroll-loops -march=nocona -O2 -fomit-frame-pointer sphlib sphlib-small
gcc -funroll-loops -march=nocona -O3 -fomit-frame-pointer sphlib sphlib-small
gcc -funroll-loops -march=nocona -O -fomit-frame-pointer sphlib sphlib-small
gcc -funroll-loops -march=nocona -Os -fomit-frame-pointer sphlib sphlib-small
gcc -m64 -O2 -fomit-frame-pointer sphlib sphlib-small
gcc -m64 -O3 -fomit-frame-pointer sphlib sphlib-small
gcc -m64 -O -fomit-frame-pointer sphlib sphlib-small
gcc -m64 -Os -fomit-frame-pointer sphlib sphlib-small
gcc -m64 -march=core-avx-i -O2 -fomit-frame-pointer sphlib sphlib-small
gcc -m64 -march=core-avx-i -O3 -fomit-frame-pointer sphlib sphlib-small
gcc -m64 -march=core-avx-i -O -fomit-frame-pointer sphlib sphlib-small
gcc -m64 -march=core-avx-i -Os -fomit-frame-pointer sphlib sphlib-small
gcc -m64 -march=core-avx2 -O2 -fomit-frame-pointer sphlib sphlib-small
gcc -m64 -march=core-avx2 -O3 -fomit-frame-pointer sphlib sphlib-small
gcc -m64 -march=core-avx2 -O -fomit-frame-pointer sphlib sphlib-small
gcc -m64 -march=core-avx2 -Os -fomit-frame-pointer sphlib sphlib-small
gcc -m64 -march=core2 -O2 -fomit-frame-pointer sphlib sphlib-small
gcc -m64 -march=core2 -O3 -fomit-frame-pointer sphlib sphlib-small
gcc -m64 -march=core2 -O -fomit-frame-pointer sphlib sphlib-small
gcc -m64 -march=core2 -Os -fomit-frame-pointer sphlib sphlib-small
gcc -m64 -march=core2 -msse4.1 -O2 -fomit-frame-pointer sphlib sphlib-small
gcc -m64 -march=core2 -msse4.1 -O3 -fomit-frame-pointer sphlib sphlib-small
gcc -m64 -march=core2 -msse4.1 -O -fomit-frame-pointer sphlib sphlib-small
gcc -m64 -march=core2 -msse4.1 -Os -fomit-frame-pointer sphlib sphlib-small
gcc -m64 -march=core2 -msse4 -O2 -fomit-frame-pointer sphlib sphlib-small
gcc -m64 -march=core2 -msse4 -O3 -fomit-frame-pointer sphlib sphlib-small
gcc -m64 -march=core2 -msse4 -O -fomit-frame-pointer sphlib sphlib-small
gcc -m64 -march=core2 -msse4 -Os -fomit-frame-pointer sphlib sphlib-small
gcc -m64 -march=corei7-avx -O2 -fomit-frame-pointer sphlib sphlib-small
gcc -m64 -march=corei7-avx -O3 -fomit-frame-pointer sphlib sphlib-small
gcc -m64 -march=corei7-avx -O -fomit-frame-pointer sphlib sphlib-small
gcc -m64 -march=corei7-avx -Os -fomit-frame-pointer sphlib sphlib-small
gcc -m64 -march=corei7 -O2 -fomit-frame-pointer sphlib sphlib-small
gcc -m64 -march=corei7 -O3 -fomit-frame-pointer sphlib sphlib-small
gcc -m64 -march=corei7 -O -fomit-frame-pointer sphlib sphlib-small
gcc -m64 -march=corei7 -Os -fomit-frame-pointer sphlib sphlib-small
gcc -m64 -march=k8 -O2 -fomit-frame-pointer sphlib sphlib-small
gcc -m64 -march=k8 -O3 -fomit-frame-pointer sphlib sphlib-small
gcc -m64 -march=k8 -O -fomit-frame-pointer sphlib sphlib-small
gcc -m64 -march=k8 -Os -fomit-frame-pointer sphlib sphlib-small
gcc -m64 -march=native -mtune=native -O2 -fomit-frame-pointer sphlib sphlib-small
gcc -m64 -march=native -mtune=native -O3 -fomit-frame-pointer sphlib sphlib-small
gcc -m64 -march=native -mtune=native -O -fomit-frame-pointer sphlib sphlib-small
gcc -m64 -march=native -mtune=native -Os -fomit-frame-pointer sphlib sphlib-small
gcc -m64 -march=nocona -O2 -fomit-frame-pointer sphlib sphlib-small
gcc -m64 -march=nocona -O3 -fomit-frame-pointer sphlib sphlib-small
gcc -m64 -march=nocona -O -fomit-frame-pointer sphlib sphlib-small
gcc -m64 -march=nocona -Os -fomit-frame-pointer sphlib sphlib-small
gcc -march=barcelona -O2 -fomit-frame-pointer sphlib sphlib-small
gcc -march=barcelona -O3 -fomit-frame-pointer sphlib sphlib-small
gcc -march=barcelona -O -fomit-frame-pointer sphlib sphlib-small
gcc -march=barcelona -Os -fomit-frame-pointer sphlib sphlib-small
gcc -march=k8 -O2 -fomit-frame-pointer sphlib sphlib-small
gcc -march=k8 -O3 -fomit-frame-pointer sphlib sphlib-small
gcc -march=k8 -O -fomit-frame-pointer sphlib sphlib-small
gcc -march=k8 -Os -fomit-frame-pointer sphlib sphlib-small
gcc -march=native -mtune=native -O2 -fomit-frame-pointer -fwrapv sphlib sphlib-small
gcc -march=native -mtune=native -O3 -fomit-frame-pointer -fwrapv sphlib sphlib-small
gcc -march=native -mtune=native -O -fomit-frame-pointer -fwrapv sphlib sphlib-small
gcc -march=native -mtune=native -Os -fomit-frame-pointer -fwrapv sphlib sphlib-small
gcc -march=nocona -O2 -fomit-frame-pointer sphlib sphlib-small
gcc -march=nocona -O3 -fomit-frame-pointer sphlib sphlib-small
gcc -march=nocona -O -fomit-frame-pointer sphlib sphlib-small
gcc -march=nocona -Os -fomit-frame-pointer sphlib sphlib-small

Compiler output

Implementation: crypto_hash/hamsi512/sphlib
Compiler: clang -O3 -fomit-frame-pointer -Qunused-arguments
hamsi.c: hamsi.c:111:10: fatal error: 'hamsi_helper.c' file not found
hamsi.c: #include "hamsi_helper.c"
hamsi.c: ^~~~~~~~~~~~~~~~
hamsi.c: 1 error generated.

Number of similar (compiler,implementation) pairs: 20, namely:
CompilerImplementations
clang -O3 -fomit-frame-pointer -Qunused-arguments sphlib sphlib-small
clang -O3 -fwrapv -march=native -fomit-frame-pointer -Qunused-arguments sphlib sphlib-small
clang -O3 -fwrapv -march=x86-64 -mcpu=core-avx2 -mavx2 -maes -mpclmul -fomit-frame-pointer -Qunused-arguments sphlib sphlib-small
clang -O3 -fwrapv -mavx2 -fomit-frame-pointer -Qunused-arguments sphlib sphlib-small
clang -O3 -fwrapv -mavx -fomit-frame-pointer -Qunused-arguments sphlib sphlib-small
clang -O3 -fwrapv -mavx -maes -mpclmul -fomit-frame-pointer -Qunused-arguments sphlib sphlib-small
clang -march=native -O3 -fomit-frame-pointer -fwrapv -Qunused-arguments sphlib sphlib-small
clang -mcpu=cortex-a8 -mfpu=neon -O3 -fomit-frame-pointer -fwrapv -Qunused-arguments sphlib sphlib-small
clang -mcpu=cortex-a9 -mfpu=neon -O3 -fomit-frame-pointer -fwrapv -Qunused-arguments sphlib sphlib-small
clang -mcpu=native -mfpu=neon -O3 -fomit-frame-pointer -fwrapv -Qunused-arguments sphlib sphlib-small

Compiler output

Implementation: crypto_hash/hamsi512/sphlib
Compiler: gcc -m64 -march=barcelona -O2 -fomit-frame-pointer
hamsi.c: hamsi.c:111:10: fatal error: hamsi_helper.c: No such file or directory
hamsi.c: #include "hamsi_helper.c"
hamsi.c: ^~~~~~~~~~~~~~~~
hamsi.c: compilation terminated.
hamsi.c: hamsi.c:111:10: fatal error: hamsi_helper.c: No such file or directory
hamsi.c: #include "hamsi_helper.c"
hamsi.c: ^~~~~~~~~~~~~~~~
hamsi.c: compilation terminated.

Number of similar (compiler,implementation) pairs: 8, namely:
CompilerImplementations
gcc -m64 -march=barcelona -O2 -fomit-frame-pointer sphlib sphlib-small
gcc -m64 -march=barcelona -O3 -fomit-frame-pointer sphlib sphlib-small
gcc -m64 -march=barcelona -O -fomit-frame-pointer sphlib sphlib-small
gcc -m64 -march=barcelona -Os -fomit-frame-pointer sphlib sphlib-small