Implementation notes: amd64, kizomba, crypto_aead/schwaemm256256v1

Computer: kizomba
Microarchitecture: amd64; Kaby Lake (906e9)
Architecture: amd64
CPU ID: GenuineIntel-000906e9-1fc9cbf5
SUPERCOP version: 20240425
Operation: crypto_aead
Primitive: schwaemm256256v1
TimeObject sizeTest sizeImplementationCompilerBenchmark dateSUPERCOP version
1874489621 0 026725 792 928T:refgcc_-march=native_-mtune=native_-O3_-fomit-frame-pointer_-fwrapv_-fPIC_-fPIE2024042620240425
2876156574 0 023557 784 928T:optgcc_-march=native_-mtune=native_-O3_-fomit-frame-pointer_-fwrapv_-fPIC_-fPIE2024042620240425

Compiler output

Implementation: T:opt
Security model: timingleaks
Compiler: clang -march=native -O2 -fomit-frame-pointer -fwrapv -Qunused-arguments -fPIC -fPIE
try.c: /usr/bin/ld: libcrypto_aead_schwaemm256256v1.a(encrypt.o): in function `crypto_aead_schwaemm256256v1_opt_timingleaks_encrypt':
try.c: encrypt.c:(.text+0x...): undefined reference to `initialize'
try.c: /usr/bin/ld: encrypt.c:(.text+0x...): undefined reference to `processAD'
try.c: /usr/bin/ld: encrypt.c:(.text+0x...): undefined reference to `encryptPT'
try.c: /usr/bin/ld: libcrypto_aead_schwaemm256256v1.a(encrypt.o): in function `crypto_aead_schwaemm256256v1_opt_timingleaks_decrypt':
try.c: encrypt.c:(.text+0x...): undefined reference to `initialize'
try.c: /usr/bin/ld: encrypt.c:(.text+0x...): undefined reference to `processAD'
try.c: /usr/bin/ld: encrypt.c:(.text+0x...): undefined reference to `decryptCT'
try.c: clang: error: linker command failed with exit code 1 (use -v to see invocation)

Number of similar (compiler,implementation) pairs: 3, namely:
CompilerImplementations
clang -march=native -O2 -fomit-frame-pointer -fwrapv -Qunused-arguments -fPIC -fPIE T:opt
clang -march=native -O3 -fomit-frame-pointer -fwrapv -Qunused-arguments -fPIC -fPIE T:opt
clang -mcpu=native -O3 -fomit-frame-pointer -fwrapv -Qunused-arguments -fPIC -fPIE T:opt

Compiler output

Implementation: T:opt
Security model: timingleaks
Compiler: clang -march=native -O -fomit-frame-pointer -fwrapv -Qunused-arguments -fPIC -fPIE
try.c: /usr/bin/ld: libcrypto_aead_schwaemm256256v1.a(encrypt.o): in function `crypto_aead_schwaemm256256v1_opt_timingleaks_encrypt':
try.c: encrypt.c:(.text+0x...): undefined reference to `encryptPT'
try.c: /usr/bin/ld: libcrypto_aead_schwaemm256256v1.a(encrypt.o): in function `crypto_aead_schwaemm256256v1_opt_timingleaks_decrypt':
try.c: encrypt.c:(.text+0x...): undefined reference to `decryptCT'
try.c: clang: error: linker command failed with exit code 1 (use -v to see invocation)

Number of similar (compiler,implementation) pairs: 2, namely:
CompilerImplementations
clang -march=native -O -fomit-frame-pointer -fwrapv -Qunused-arguments -fPIC -fPIE T:opt
clang -march=native -Os -fomit-frame-pointer -fwrapv -Qunused-arguments -fPIC -fPIE T:opt

Compiler output

Implementation: T:opt
Security model: timingleaks
Compiler: gcc -march=native -mtune=native -O2 -fomit-frame-pointer -fwrapv -fPIC -fPIE
try.c: /usr/bin/ld: libcrypto_aead_schwaemm256256v1.a(encrypt.o): in function `crypto_aead_schwaemm256256v1_opt_timingleaks_encrypt':
try.c: encrypt.c:(.text+0x...): undefined reference to `encryptPT'
try.c: /usr/bin/ld: libcrypto_aead_schwaemm256256v1.a(encrypt.o): in function `crypto_aead_schwaemm256256v1_opt_timingleaks_decrypt':
try.c: encrypt.c:(.text+0x...): undefined reference to `decryptCT'
try.c: collect2: error: ld returned 1 exit status

Number of similar (compiler,implementation) pairs: 2, namely:
CompilerImplementations
gcc -march=native -mtune=native -O2 -fomit-frame-pointer -fwrapv -fPIC -fPIE T:opt
gcc -march=native -mtune=native -O -fomit-frame-pointer -fwrapv -fPIC -fPIE T:opt

Compiler output

Implementation: T:opt
Security model: timingleaks
Compiler: gcc -march=native -mtune=native -Os -fomit-frame-pointer -fwrapv -fPIC -fPIE
try.c: /usr/bin/ld: libcrypto_aead_schwaemm256256v1.a(encrypt.o): in function `crypto_aead_schwaemm256256v1_opt_timingleaks_encrypt':
try.c: encrypt.c:(.text+0x...): undefined reference to `initialize'
try.c: /usr/bin/ld: encrypt.c:(.text+0x...): undefined reference to `processAD'
try.c: /usr/bin/ld: encrypt.c:(.text+0x...): undefined reference to `encryptPT'
try.c: /usr/bin/ld: libcrypto_aead_schwaemm256256v1.a(encrypt.o): in function `crypto_aead_schwaemm256256v1_opt_timingleaks_decrypt':
try.c: encrypt.c:(.text+0x...): undefined reference to `initialize'
try.c: /usr/bin/ld: encrypt.c:(.text+0x...): undefined reference to `processAD'
try.c: /usr/bin/ld: encrypt.c:(.text+0x...): undefined reference to `decryptCT'
try.c: collect2: error: ld returned 1 exit status

Number of similar (compiler,implementation) pairs: 1, namely:
CompilerImplementations
gcc -march=native -mtune=native -Os -fomit-frame-pointer -fwrapv -fPIC -fPIE T:opt

Compiler output

Implementation: T:ref
Security model: timingleaks
Compiler: clang -march=native -O2 -fomit-frame-pointer -fwrapv -Qunused-arguments -fPIC -fPIE
try.c: /usr/bin/ld: libcrypto_aead_schwaemm256256v1.a(encrypt.o): in function `crypto_aead_schwaemm256256v1_ref_timingleaks_encrypt':
try.c: encrypt.c:(.text+0x...): undefined reference to `initialize'
try.c: /usr/bin/ld: encrypt.c:(.text+0x...): undefined reference to `processAD'
try.c: /usr/bin/ld: encrypt.c:(.text+0x...): undefined reference to `encryptPT'
try.c: /usr/bin/ld: libcrypto_aead_schwaemm256256v1.a(encrypt.o): in function `crypto_aead_schwaemm256256v1_ref_timingleaks_decrypt':
try.c: encrypt.c:(.text+0x...): undefined reference to `initialize'
try.c: /usr/bin/ld: encrypt.c:(.text+0x...): undefined reference to `processAD'
try.c: /usr/bin/ld: encrypt.c:(.text+0x...): undefined reference to `decryptCT'
try.c: clang: error: linker command failed with exit code 1 (use -v to see invocation)

Number of similar (compiler,implementation) pairs: 3, namely:
CompilerImplementations
clang -march=native -O2 -fomit-frame-pointer -fwrapv -Qunused-arguments -fPIC -fPIE T:ref
clang -march=native -O3 -fomit-frame-pointer -fwrapv -Qunused-arguments -fPIC -fPIE T:ref
clang -mcpu=native -O3 -fomit-frame-pointer -fwrapv -Qunused-arguments -fPIC -fPIE T:ref

Compiler output

Implementation: T:ref
Security model: timingleaks
Compiler: clang -march=native -O -fomit-frame-pointer -fwrapv -Qunused-arguments -fPIC -fPIE
try.c: /usr/bin/ld: libcrypto_aead_schwaemm256256v1.a(encrypt.o): in function `crypto_aead_schwaemm256256v1_ref_timingleaks_encrypt':
try.c: encrypt.c:(.text+0x...): undefined reference to `encryptPT'
try.c: /usr/bin/ld: libcrypto_aead_schwaemm256256v1.a(encrypt.o): in function `crypto_aead_schwaemm256256v1_ref_timingleaks_decrypt':
try.c: encrypt.c:(.text+0x...): undefined reference to `decryptCT'
try.c: clang: error: linker command failed with exit code 1 (use -v to see invocation)

Number of similar (compiler,implementation) pairs: 2, namely:
CompilerImplementations
clang -march=native -O -fomit-frame-pointer -fwrapv -Qunused-arguments -fPIC -fPIE T:ref
clang -march=native -Os -fomit-frame-pointer -fwrapv -Qunused-arguments -fPIC -fPIE T:ref

Compiler output

Implementation: T:ref
Security model: timingleaks
Compiler: gcc -march=native -mtune=native -O2 -fomit-frame-pointer -fwrapv -fPIC -fPIE
try.c: /usr/bin/ld: libcrypto_aead_schwaemm256256v1.a(encrypt.o): in function `crypto_aead_schwaemm256256v1_ref_timingleaks_encrypt':
try.c: encrypt.c:(.text+0x...): undefined reference to `encryptPT'
try.c: /usr/bin/ld: libcrypto_aead_schwaemm256256v1.a(encrypt.o): in function `crypto_aead_schwaemm256256v1_ref_timingleaks_decrypt':
try.c: encrypt.c:(.text+0x...): undefined reference to `decryptCT'
try.c: collect2: error: ld returned 1 exit status

Number of similar (compiler,implementation) pairs: 2, namely:
CompilerImplementations
gcc -march=native -mtune=native -O2 -fomit-frame-pointer -fwrapv -fPIC -fPIE T:ref
gcc -march=native -mtune=native -O -fomit-frame-pointer -fwrapv -fPIC -fPIE T:ref

Compiler output

Implementation: T:ref
Security model: timingleaks
Compiler: gcc -march=native -mtune=native -Os -fomit-frame-pointer -fwrapv -fPIC -fPIE
try.c: /usr/bin/ld: libcrypto_aead_schwaemm256256v1.a(encrypt.o): in function `crypto_aead_schwaemm256256v1_ref_timingleaks_encrypt':
try.c: encrypt.c:(.text+0x...): undefined reference to `initialize'
try.c: /usr/bin/ld: encrypt.c:(.text+0x...): undefined reference to `processAD'
try.c: /usr/bin/ld: encrypt.c:(.text+0x...): undefined reference to `encryptPT'
try.c: /usr/bin/ld: libcrypto_aead_schwaemm256256v1.a(encrypt.o): in function `crypto_aead_schwaemm256256v1_ref_timingleaks_decrypt':
try.c: encrypt.c:(.text+0x...): undefined reference to `initialize'
try.c: /usr/bin/ld: encrypt.c:(.text+0x...): undefined reference to `processAD'
try.c: /usr/bin/ld: encrypt.c:(.text+0x...): undefined reference to `decryptCT'
try.c: collect2: error: ld returned 1 exit status

Number of similar (compiler,implementation) pairs: 1, namely:
CompilerImplementations
gcc -march=native -mtune=native -Os -fomit-frame-pointer -fwrapv -fPIC -fPIE T:ref