Test results for amd64, kizomba, crypto_aead/omdsha256k128n96tau64v1
[Page version: 20250314 17:19:59]
Measurements for amd64, kizomba, crypto_aead
Test results for amd64, kizomba, crypto_aead
Test results for crypto_aead/omdsha256k128n96tau64v1
Computer: kizomba
Microarchitecture: amd64; Kaby Lake (906e9)
Architecture: amd64
CPU ID: GenuineIntel-000906e9-1fc9cbf5
SUPERCOP version: 20250307
Operation: crypto_aead
Primitive: omdsha256k128n96tau64v1
Time | Object size | Test size | Implementation | Compiler | Benchmark date | SUPERCOP version |
161710 | 14802 0 0 | 38229 784 928 | T:ref | gcc -march=native -mtune=native -O3 -fwrapv -fPIC -fPIE -gdwarf-4 -Wall | 20250309 | 20250307 |
176303 | 11685 0 0 | 34820 816 872 | T:ref | clang -march=native -O2 -fwrapv -Qunused-arguments -fPIC -fPIE -gdwarf-4 -Wall | 20250309 | 20250307 |
177406 | 10811 0 0 | 34164 816 920 | T:ref | clang -march=native -O3 -fwrapv -Qunused-arguments -fPIC -fPIE -gdwarf-4 -Wall | 20250309 | 20250307 |
188784 | 4553 0 0 | 24870 808 920 | T:ref | clang -march=native -Os -fwrapv -Qunused-arguments -fPIC -fPIE -gdwarf-4 -Wall | 20250309 | 20250307 |
193655 | 6080 0 0 | 26740 776 928 | T:ref | gcc -march=native -mtune=native -O -fwrapv -fPIC -fPIE -gdwarf-4 -Wall | 20250309 | 20250307 |
194976 | 6465 0 0 | 27741 784 928 | T:ref | gcc -march=native -mtune=native -O2 -fwrapv -fPIC -fPIE -gdwarf-4 -Wall | 20250309 | 20250307 |
201966 | 5679 0 0 | 25116 816 856 | T:ref | clang -march=native -O -fwrapv -Qunused-arguments -fPIC -fPIE -gdwarf-4 -Wall | 20250309 | 20250307 |
204421 | 12097 0 0 | 33916 816 856 | T:ref | clang -mcpu=native -O3 -fwrapv -Qunused-arguments -fPIC -fPIE -gdwarf-4 -Wall | 20250309 | 20250307 |
209395 | 4583 0 0 | 23616 760 896 | T:ref | gcc -march=native -mtune=native -Os -fwrapv -fPIC -fPIE -gdwarf-4 -Wall | 20250309 | 20250307 |
Compiler output
try.c: /usr/bin/ld: libcrypto_aead_omdsha256k128n96tau64v1.a(omdsha256.o):.../supercop-data/kizomba/amd64/try/c/clang_-march=native_-O2_-fwrapv_-Qunused-arguments_-fPIC_-fPIE_-gdwarf-4_-Wall/timingleaks/crypto_aead/omdsha256k128n96tau64v1/avx1/work/./omdsha256.h:137: multiple definition of `Hash'; libcrypto_aead_omdsha256k128n96tau64v1.a(encrypt.o):.../supercop-data/kizomba/amd64/try/c/clang_-march=native_-O2_-fwrapv_-Qunused-arguments_-fPIC_-fPIE_-gdwarf-4_-Wall/timingleaks/crypto_aead/omdsha256k128n96tau64v1/avx1/work/./omdsha256.h:137: first defined here
try.c: clang: error: linker command failed with exit code 1 (use -v to see invocation)
Number of similar (implementation,compiler) pairs: 1, namely:
Implementation | Compiler |
T:avx1 | clang -march=native -O2 -fwrapv -Qunused-arguments -fPIC -fPIE -gdwarf-4 -Wall (Ubuntu_Clang_14.0.0) |
Compiler output
try.c: /usr/bin/ld: libcrypto_aead_omdsha256k128n96tau64v1.a(omdsha256.o):.../supercop-data/kizomba/amd64/try/c/clang_-march=native_-O3_-fwrapv_-Qunused-arguments_-fPIC_-fPIE_-gdwarf-4_-Wall/timingleaks/crypto_aead/omdsha256k128n96tau64v1/avx1/work/./omdsha256.h:137: multiple definition of `Hash'; libcrypto_aead_omdsha256k128n96tau64v1.a(encrypt.o):.../supercop-data/kizomba/amd64/try/c/clang_-march=native_-O3_-fwrapv_-Qunused-arguments_-fPIC_-fPIE_-gdwarf-4_-Wall/timingleaks/crypto_aead/omdsha256k128n96tau64v1/avx1/work/./omdsha256.h:137: first defined here
try.c: clang: error: linker command failed with exit code 1 (use -v to see invocation)
Number of similar (implementation,compiler) pairs: 1, namely:
Implementation | Compiler |
T:avx1 | clang -march=native -O3 -fwrapv -Qunused-arguments -fPIC -fPIE -gdwarf-4 -Wall (Ubuntu_Clang_14.0.0) |
Compiler output
try.c: /usr/bin/ld: libcrypto_aead_omdsha256k128n96tau64v1.a(omdsha256.o):.../supercop-data/kizomba/amd64/try/c/clang_-march=native_-O_-fwrapv_-Qunused-arguments_-fPIC_-fPIE_-gdwarf-4_-Wall/timingleaks/crypto_aead/omdsha256k128n96tau64v1/avx1/work/./omdsha256.h:137: multiple definition of `Hash'; libcrypto_aead_omdsha256k128n96tau64v1.a(encrypt.o):.../supercop-data/kizomba/amd64/try/c/clang_-march=native_-O_-fwrapv_-Qunused-arguments_-fPIC_-fPIE_-gdwarf-4_-Wall/timingleaks/crypto_aead/omdsha256k128n96tau64v1/avx1/work/./omdsha256.h:137: first defined here
try.c: clang: error: linker command failed with exit code 1 (use -v to see invocation)
Number of similar (implementation,compiler) pairs: 1, namely:
Implementation | Compiler |
T:avx1 | clang -march=native -O -fwrapv -Qunused-arguments -fPIC -fPIE -gdwarf-4 -Wall (Ubuntu_Clang_14.0.0) |
Compiler output
try.c: /usr/bin/ld: libcrypto_aead_omdsha256k128n96tau64v1.a(omdsha256.o):.../supercop-data/kizomba/amd64/try/c/clang_-march=native_-Os_-fwrapv_-Qunused-arguments_-fPIC_-fPIE_-gdwarf-4_-Wall/timingleaks/crypto_aead/omdsha256k128n96tau64v1/avx1/work/./omdsha256.h:137: multiple definition of `Hash'; libcrypto_aead_omdsha256k128n96tau64v1.a(encrypt.o):.../supercop-data/kizomba/amd64/try/c/clang_-march=native_-Os_-fwrapv_-Qunused-arguments_-fPIC_-fPIE_-gdwarf-4_-Wall/timingleaks/crypto_aead/omdsha256k128n96tau64v1/avx1/work/./omdsha256.h:137: first defined here
try.c: clang: error: linker command failed with exit code 1 (use -v to see invocation)
Number of similar (implementation,compiler) pairs: 1, namely:
Implementation | Compiler |
T:avx1 | clang -march=native -Os -fwrapv -Qunused-arguments -fPIC -fPIE -gdwarf-4 -Wall (Ubuntu_Clang_14.0.0) |
Compiler output
try.c: /usr/bin/ld: libcrypto_aead_omdsha256k128n96tau64v1.a(omdsha256.o):.../supercop-data/kizomba/amd64/try/c/clang_-mcpu=native_-O3_-fwrapv_-Qunused-arguments_-fPIC_-fPIE_-gdwarf-4_-Wall/timingleaks/crypto_aead/omdsha256k128n96tau64v1/avx1/work/./omdsha256.h:137: multiple definition of `Hash'; libcrypto_aead_omdsha256k128n96tau64v1.a(encrypt.o):.../supercop-data/kizomba/amd64/try/c/clang_-mcpu=native_-O3_-fwrapv_-Qunused-arguments_-fPIC_-fPIE_-gdwarf-4_-Wall/timingleaks/crypto_aead/omdsha256k128n96tau64v1/avx1/work/./omdsha256.h:137: first defined here
try.c: clang: error: linker command failed with exit code 1 (use -v to see invocation)
Number of similar (implementation,compiler) pairs: 1, namely:
Implementation | Compiler |
T:avx1 | clang -mcpu=native -O3 -fwrapv -Qunused-arguments -fPIC -fPIE -gdwarf-4 -Wall (Ubuntu_Clang_14.0.0) |
Compiler output
encrypt.c: /tmp/ccSUMfeH.s: Assembler messages:
encrypt.c: /tmp/ccSUMfeH.s:922: Warning: dwarf line number information for .data ignored
encrypt.c: /tmp/ccSUMfeH.s:924: Warning: dwarf line number information for .data ignored
encrypt.c: /tmp/ccSUMfeH.s:926: Warning: dwarf line number information for .data ignored
encrypt.c: /tmp/ccSUMfeH.s:927: Warning: dwarf line number information for .data ignored
encrypt.c: /tmp/ccSUMfeH.s:928: Warning: dwarf line number information for .data ignored
encrypt.c: /tmp/ccSUMfeH.s:939: Warning: dwarf line number information for .data ignored
encrypt.c: /tmp/ccSUMfeH.s:946: Warning: dwarf line number information for .data ignored
encrypt.c: /tmp/ccSUMfeH.s:949: Warning: dwarf line number information for .data ignored
encrypt.c: /tmp/ccSUMfeH.s:950: Warning: dwarf line number information for .data ignored
encrypt.c: /tmp/ccSUMfeH.s:957: Warning: dwarf line number information for .data ignored
encrypt.c: /tmp/ccSUMfeH.s:958: Warning: dwarf line number information for .data ignored
encrypt.c: /tmp/ccSUMfeH.s:961: Warning: dwarf line number information for .data ignored
encrypt.c: /tmp/ccSUMfeH.s:963: Warning: dwarf line number information for .data ignored
encrypt.c: /tmp/ccSUMfeH.s:966: Warning: dwarf line number information for .data ignored
encrypt.c: /tmp/ccSUMfeH.s:974: Warning: dwarf line number information for .data ignored
encrypt.c: /tmp/ccSUMfeH.s:985: Warning: dwarf line number information for .data ignored
encrypt.c: /tmp/ccSUMfeH.s:987: Warning: dwarf line number information for .data ignored
encrypt.c: /tmp/ccSUMfeH.s:989: Warning: dwarf line number information for .data ignored
encrypt.c: /tmp/ccSUMfeH.s:990: Warning: dwarf line number information for .data ignored
encrypt.c: /tmp/ccSUMfeH.s:991: Warning: dwarf line number information for .data ignored
encrypt.c: /tmp/ccSUMfeH.s:998: Warning: dwarf line number information for .data ignored
encrypt.c: /tmp/ccSUMfeH.s:1005: Warning: dwarf line number information for .data ignored
encrypt.c: /tmp/ccSUMfeH.s:1008: Warning: dwarf line number information for .data ignored
encrypt.c: /tmp/ccSUMfeH.s:1013: Warning: dwarf line number information for .data ignored
encrypt.c: ...
Number of similar (implementation,compiler) pairs: 1, namely:
Implementation | Compiler |
T:avx1 | gcc -march=native -mtune=native -O2 -fwrapv -fPIC -fPIE -gdwarf-4 -Wall (11.4.0) |
Compiler output
encrypt.c: /tmp/cciVHQyv.s: Assembler messages:
encrypt.c: /tmp/cciVHQyv.s:922: Warning: dwarf line number information for .data ignored
encrypt.c: /tmp/cciVHQyv.s:924: Warning: dwarf line number information for .data ignored
encrypt.c: /tmp/cciVHQyv.s:926: Warning: dwarf line number information for .data ignored
encrypt.c: /tmp/cciVHQyv.s:927: Warning: dwarf line number information for .data ignored
encrypt.c: /tmp/cciVHQyv.s:928: Warning: dwarf line number information for .data ignored
encrypt.c: /tmp/cciVHQyv.s:939: Warning: dwarf line number information for .data ignored
encrypt.c: /tmp/cciVHQyv.s:946: Warning: dwarf line number information for .data ignored
encrypt.c: /tmp/cciVHQyv.s:949: Warning: dwarf line number information for .data ignored
encrypt.c: /tmp/cciVHQyv.s:950: Warning: dwarf line number information for .data ignored
encrypt.c: /tmp/cciVHQyv.s:957: Warning: dwarf line number information for .data ignored
encrypt.c: /tmp/cciVHQyv.s:958: Warning: dwarf line number information for .data ignored
encrypt.c: /tmp/cciVHQyv.s:961: Warning: dwarf line number information for .data ignored
encrypt.c: /tmp/cciVHQyv.s:963: Warning: dwarf line number information for .data ignored
encrypt.c: /tmp/cciVHQyv.s:966: Warning: dwarf line number information for .data ignored
encrypt.c: /tmp/cciVHQyv.s:974: Warning: dwarf line number information for .data ignored
encrypt.c: /tmp/cciVHQyv.s:985: Warning: dwarf line number information for .data ignored
encrypt.c: /tmp/cciVHQyv.s:987: Warning: dwarf line number information for .data ignored
encrypt.c: /tmp/cciVHQyv.s:989: Warning: dwarf line number information for .data ignored
encrypt.c: /tmp/cciVHQyv.s:990: Warning: dwarf line number information for .data ignored
encrypt.c: /tmp/cciVHQyv.s:991: Warning: dwarf line number information for .data ignored
encrypt.c: /tmp/cciVHQyv.s:998: Warning: dwarf line number information for .data ignored
encrypt.c: /tmp/cciVHQyv.s:1005: Warning: dwarf line number information for .data ignored
encrypt.c: /tmp/cciVHQyv.s:1008: Warning: dwarf line number information for .data ignored
encrypt.c: /tmp/cciVHQyv.s:1013: Warning: dwarf line number information for .data ignored
encrypt.c: ...
Number of similar (implementation,compiler) pairs: 1, namely:
Implementation | Compiler |
T:avx1 | gcc -march=native -mtune=native -O3 -fwrapv -fPIC -fPIE -gdwarf-4 -Wall (11.4.0) |
Compiler output
encrypt.c: /tmp/ccFLeQVU.s: Assembler messages:
encrypt.c: /tmp/ccFLeQVU.s:921: Warning: dwarf line number information for .data ignored
encrypt.c: /tmp/ccFLeQVU.s:923: Warning: dwarf line number information for .data ignored
encrypt.c: /tmp/ccFLeQVU.s:935: Warning: dwarf line number information for .data ignored
encrypt.c: /tmp/ccFLeQVU.s:936: Warning: dwarf line number information for .data ignored
encrypt.c: /tmp/ccFLeQVU.s:937: Warning: dwarf line number information for .data ignored
encrypt.c: /tmp/ccFLeQVU.s:944: Warning: dwarf line number information for .data ignored
encrypt.c: /tmp/ccFLeQVU.s:947: Warning: dwarf line number information for .data ignored
encrypt.c: /tmp/ccFLeQVU.s:948: Warning: dwarf line number information for .data ignored
encrypt.c: /tmp/ccFLeQVU.s:953: Warning: dwarf line number information for .data ignored
encrypt.c: /tmp/ccFLeQVU.s:954: Warning: dwarf line number information for .data ignored
encrypt.c: /tmp/ccFLeQVU.s:957: Warning: dwarf line number information for .data ignored
encrypt.c: /tmp/ccFLeQVU.s:959: Warning: dwarf line number information for .data ignored
encrypt.c: /tmp/ccFLeQVU.s:962: Warning: dwarf line number information for .data ignored
encrypt.c: /tmp/ccFLeQVU.s:970: Warning: dwarf line number information for .data ignored
encrypt.c: /tmp/ccFLeQVU.s:980: Warning: dwarf line number information for .data ignored
encrypt.c: /tmp/ccFLeQVU.s:982: Warning: dwarf line number information for .data ignored
encrypt.c: /tmp/ccFLeQVU.s:995: Warning: dwarf line number information for .data ignored
encrypt.c: /tmp/ccFLeQVU.s:999: Warning: dwarf line number information for .data ignored
encrypt.c: /tmp/ccFLeQVU.s:1000: Warning: dwarf line number information for .data ignored
encrypt.c: /tmp/ccFLeQVU.s:1001: Warning: dwarf line number information for .data ignored
encrypt.c: /tmp/ccFLeQVU.s:1008: Warning: dwarf line number information for .data ignored
encrypt.c: /tmp/ccFLeQVU.s:1011: Warning: dwarf line number information for .data ignored
encrypt.c: /tmp/ccFLeQVU.s:1014: Warning: dwarf line number information for .data ignored
encrypt.c: /tmp/ccFLeQVU.s:1017: Warning: dwarf line number information for .data ignored
encrypt.c: ...
Number of similar (implementation,compiler) pairs: 1, namely:
Implementation | Compiler |
T:avx1 | gcc -march=native -mtune=native -O -fwrapv -fPIC -fPIE -gdwarf-4 -Wall (11.4.0) |
Compiler output
encrypt.c: /tmp/ccs5oaAu.s: Assembler messages:
encrypt.c: /tmp/ccs5oaAu.s:921: Warning: dwarf line number information for .data ignored
encrypt.c: /tmp/ccs5oaAu.s:923: Warning: dwarf line number information for .data ignored
encrypt.c: /tmp/ccs5oaAu.s:925: Warning: dwarf line number information for .data ignored
encrypt.c: /tmp/ccs5oaAu.s:926: Warning: dwarf line number information for .data ignored
encrypt.c: /tmp/ccs5oaAu.s:927: Warning: dwarf line number information for .data ignored
encrypt.c: /tmp/ccs5oaAu.s:938: Warning: dwarf line number information for .data ignored
encrypt.c: /tmp/ccs5oaAu.s:945: Warning: dwarf line number information for .data ignored
encrypt.c: /tmp/ccs5oaAu.s:948: Warning: dwarf line number information for .data ignored
encrypt.c: /tmp/ccs5oaAu.s:949: Warning: dwarf line number information for .data ignored
encrypt.c: /tmp/ccs5oaAu.s:956: Warning: dwarf line number information for .data ignored
encrypt.c: /tmp/ccs5oaAu.s:957: Warning: dwarf line number information for .data ignored
encrypt.c: /tmp/ccs5oaAu.s:960: Warning: dwarf line number information for .data ignored
encrypt.c: /tmp/ccs5oaAu.s:962: Warning: dwarf line number information for .data ignored
encrypt.c: /tmp/ccs5oaAu.s:965: Warning: dwarf line number information for .data ignored
encrypt.c: /tmp/ccs5oaAu.s:973: Warning: dwarf line number information for .data ignored
encrypt.c: /tmp/ccs5oaAu.s:983: Warning: dwarf line number information for .data ignored
encrypt.c: /tmp/ccs5oaAu.s:985: Warning: dwarf line number information for .data ignored
encrypt.c: /tmp/ccs5oaAu.s:987: Warning: dwarf line number information for .data ignored
encrypt.c: /tmp/ccs5oaAu.s:988: Warning: dwarf line number information for .data ignored
encrypt.c: /tmp/ccs5oaAu.s:989: Warning: dwarf line number information for .data ignored
encrypt.c: /tmp/ccs5oaAu.s:996: Warning: dwarf line number information for .data ignored
encrypt.c: /tmp/ccs5oaAu.s:1003: Warning: dwarf line number information for .data ignored
encrypt.c: /tmp/ccs5oaAu.s:1006: Warning: dwarf line number information for .data ignored
encrypt.c: /tmp/ccs5oaAu.s:1009: Warning: dwarf line number information for .data ignored
encrypt.c: ...
Number of similar (implementation,compiler) pairs: 1, namely:
Implementation | Compiler |
T:avx1 | gcc -march=native -mtune=native -Os -fwrapv -fPIC -fPIE -gdwarf-4 -Wall (11.4.0) |
Compiler output
try.c: /usr/bin/ld: libcrypto_aead_omdsha256k128n96tau64v1.a(omdsha256.o):.../supercop-data/kizomba/amd64/try/c/clang_-march=native_-O2_-fwrapv_-Qunused-arguments_-fPIC_-fPIE_-gdwarf-4_-Wall/timingleaks/crypto_aead/omdsha256k128n96tau64v1/sse4/work/./omdsha256.h:137: multiple definition of `Hash'; libcrypto_aead_omdsha256k128n96tau64v1.a(encrypt.o):.../supercop-data/kizomba/amd64/try/c/clang_-march=native_-O2_-fwrapv_-Qunused-arguments_-fPIC_-fPIE_-gdwarf-4_-Wall/timingleaks/crypto_aead/omdsha256k128n96tau64v1/sse4/work/./omdsha256.h:137: first defined here
try.c: clang: error: linker command failed with exit code 1 (use -v to see invocation)
Number of similar (implementation,compiler) pairs: 1, namely:
Implementation | Compiler |
T:sse4 | clang -march=native -O2 -fwrapv -Qunused-arguments -fPIC -fPIE -gdwarf-4 -Wall (Ubuntu_Clang_14.0.0) |
Compiler output
try.c: /usr/bin/ld: libcrypto_aead_omdsha256k128n96tau64v1.a(omdsha256.o):.../supercop-data/kizomba/amd64/try/c/clang_-march=native_-O3_-fwrapv_-Qunused-arguments_-fPIC_-fPIE_-gdwarf-4_-Wall/timingleaks/crypto_aead/omdsha256k128n96tau64v1/sse4/work/./omdsha256.h:137: multiple definition of `Hash'; libcrypto_aead_omdsha256k128n96tau64v1.a(encrypt.o):.../supercop-data/kizomba/amd64/try/c/clang_-march=native_-O3_-fwrapv_-Qunused-arguments_-fPIC_-fPIE_-gdwarf-4_-Wall/timingleaks/crypto_aead/omdsha256k128n96tau64v1/sse4/work/./omdsha256.h:137: first defined here
try.c: clang: error: linker command failed with exit code 1 (use -v to see invocation)
Number of similar (implementation,compiler) pairs: 1, namely:
Implementation | Compiler |
T:sse4 | clang -march=native -O3 -fwrapv -Qunused-arguments -fPIC -fPIE -gdwarf-4 -Wall (Ubuntu_Clang_14.0.0) |
Compiler output
try.c: /usr/bin/ld: libcrypto_aead_omdsha256k128n96tau64v1.a(omdsha256.o):.../supercop-data/kizomba/amd64/try/c/clang_-march=native_-O_-fwrapv_-Qunused-arguments_-fPIC_-fPIE_-gdwarf-4_-Wall/timingleaks/crypto_aead/omdsha256k128n96tau64v1/sse4/work/./omdsha256.h:137: multiple definition of `Hash'; libcrypto_aead_omdsha256k128n96tau64v1.a(encrypt.o):.../supercop-data/kizomba/amd64/try/c/clang_-march=native_-O_-fwrapv_-Qunused-arguments_-fPIC_-fPIE_-gdwarf-4_-Wall/timingleaks/crypto_aead/omdsha256k128n96tau64v1/sse4/work/./omdsha256.h:137: first defined here
try.c: clang: error: linker command failed with exit code 1 (use -v to see invocation)
Number of similar (implementation,compiler) pairs: 1, namely:
Implementation | Compiler |
T:sse4 | clang -march=native -O -fwrapv -Qunused-arguments -fPIC -fPIE -gdwarf-4 -Wall (Ubuntu_Clang_14.0.0) |
Compiler output
try.c: /usr/bin/ld: libcrypto_aead_omdsha256k128n96tau64v1.a(omdsha256.o):.../supercop-data/kizomba/amd64/try/c/clang_-march=native_-Os_-fwrapv_-Qunused-arguments_-fPIC_-fPIE_-gdwarf-4_-Wall/timingleaks/crypto_aead/omdsha256k128n96tau64v1/sse4/work/./omdsha256.h:137: multiple definition of `Hash'; libcrypto_aead_omdsha256k128n96tau64v1.a(encrypt.o):.../supercop-data/kizomba/amd64/try/c/clang_-march=native_-Os_-fwrapv_-Qunused-arguments_-fPIC_-fPIE_-gdwarf-4_-Wall/timingleaks/crypto_aead/omdsha256k128n96tau64v1/sse4/work/./omdsha256.h:137: first defined here
try.c: clang: error: linker command failed with exit code 1 (use -v to see invocation)
Number of similar (implementation,compiler) pairs: 1, namely:
Implementation | Compiler |
T:sse4 | clang -march=native -Os -fwrapv -Qunused-arguments -fPIC -fPIE -gdwarf-4 -Wall (Ubuntu_Clang_14.0.0) |
Compiler output
try.c: /usr/bin/ld: libcrypto_aead_omdsha256k128n96tau64v1.a(omdsha256.o):.../supercop-data/kizomba/amd64/try/c/clang_-mcpu=native_-O3_-fwrapv_-Qunused-arguments_-fPIC_-fPIE_-gdwarf-4_-Wall/timingleaks/crypto_aead/omdsha256k128n96tau64v1/sse4/work/./omdsha256.h:137: multiple definition of `Hash'; libcrypto_aead_omdsha256k128n96tau64v1.a(encrypt.o):.../supercop-data/kizomba/amd64/try/c/clang_-mcpu=native_-O3_-fwrapv_-Qunused-arguments_-fPIC_-fPIE_-gdwarf-4_-Wall/timingleaks/crypto_aead/omdsha256k128n96tau64v1/sse4/work/./omdsha256.h:137: first defined here
try.c: clang: error: linker command failed with exit code 1 (use -v to see invocation)
Number of similar (implementation,compiler) pairs: 1, namely:
Implementation | Compiler |
T:sse4 | clang -mcpu=native -O3 -fwrapv -Qunused-arguments -fPIC -fPIE -gdwarf-4 -Wall (Ubuntu_Clang_14.0.0) |
Compiler output
encrypt.c: /tmp/ccsPkh4W.s: Assembler messages:
encrypt.c: /tmp/ccsPkh4W.s:961: Warning: dwarf line number information for .data ignored
encrypt.c: /tmp/ccsPkh4W.s:963: Warning: dwarf line number information for .data ignored
encrypt.c: /tmp/ccsPkh4W.s:965: Warning: dwarf line number information for .data ignored
encrypt.c: /tmp/ccsPkh4W.s:966: Warning: dwarf line number information for .data ignored
encrypt.c: /tmp/ccsPkh4W.s:967: Warning: dwarf line number information for .data ignored
encrypt.c: /tmp/ccsPkh4W.s:978: Warning: dwarf line number information for .data ignored
encrypt.c: /tmp/ccsPkh4W.s:985: Warning: dwarf line number information for .data ignored
encrypt.c: /tmp/ccsPkh4W.s:988: Warning: dwarf line number information for .data ignored
encrypt.c: /tmp/ccsPkh4W.s:989: Warning: dwarf line number information for .data ignored
encrypt.c: /tmp/ccsPkh4W.s:996: Warning: dwarf line number information for .data ignored
encrypt.c: /tmp/ccsPkh4W.s:997: Warning: dwarf line number information for .data ignored
encrypt.c: /tmp/ccsPkh4W.s:1000: Warning: dwarf line number information for .data ignored
encrypt.c: /tmp/ccsPkh4W.s:1002: Warning: dwarf line number information for .data ignored
encrypt.c: /tmp/ccsPkh4W.s:1005: Warning: dwarf line number information for .data ignored
encrypt.c: /tmp/ccsPkh4W.s:1013: Warning: dwarf line number information for .data ignored
encrypt.c: /tmp/ccsPkh4W.s:1024: Warning: dwarf line number information for .data ignored
encrypt.c: /tmp/ccsPkh4W.s:1026: Warning: dwarf line number information for .data ignored
encrypt.c: /tmp/ccsPkh4W.s:1028: Warning: dwarf line number information for .data ignored
encrypt.c: /tmp/ccsPkh4W.s:1029: Warning: dwarf line number information for .data ignored
encrypt.c: /tmp/ccsPkh4W.s:1030: Warning: dwarf line number information for .data ignored
encrypt.c: /tmp/ccsPkh4W.s:1037: Warning: dwarf line number information for .data ignored
encrypt.c: /tmp/ccsPkh4W.s:1044: Warning: dwarf line number information for .data ignored
encrypt.c: /tmp/ccsPkh4W.s:1047: Warning: dwarf line number information for .data ignored
encrypt.c: /tmp/ccsPkh4W.s:1052: Warning: dwarf line number information for .data ignored
encrypt.c: ...
Number of similar (implementation,compiler) pairs: 1, namely:
Implementation | Compiler |
T:sse4 | gcc -march=native -mtune=native -O2 -fwrapv -fPIC -fPIE -gdwarf-4 -Wall (11.4.0) |
Compiler output
encrypt.c: /tmp/cclt10MW.s: Assembler messages:
encrypt.c: /tmp/cclt10MW.s:961: Warning: dwarf line number information for .data ignored
encrypt.c: /tmp/cclt10MW.s:963: Warning: dwarf line number information for .data ignored
encrypt.c: /tmp/cclt10MW.s:965: Warning: dwarf line number information for .data ignored
encrypt.c: /tmp/cclt10MW.s:966: Warning: dwarf line number information for .data ignored
encrypt.c: /tmp/cclt10MW.s:967: Warning: dwarf line number information for .data ignored
encrypt.c: /tmp/cclt10MW.s:978: Warning: dwarf line number information for .data ignored
encrypt.c: /tmp/cclt10MW.s:985: Warning: dwarf line number information for .data ignored
encrypt.c: /tmp/cclt10MW.s:988: Warning: dwarf line number information for .data ignored
encrypt.c: /tmp/cclt10MW.s:989: Warning: dwarf line number information for .data ignored
encrypt.c: /tmp/cclt10MW.s:996: Warning: dwarf line number information for .data ignored
encrypt.c: /tmp/cclt10MW.s:997: Warning: dwarf line number information for .data ignored
encrypt.c: /tmp/cclt10MW.s:1000: Warning: dwarf line number information for .data ignored
encrypt.c: /tmp/cclt10MW.s:1002: Warning: dwarf line number information for .data ignored
encrypt.c: /tmp/cclt10MW.s:1005: Warning: dwarf line number information for .data ignored
encrypt.c: /tmp/cclt10MW.s:1013: Warning: dwarf line number information for .data ignored
encrypt.c: /tmp/cclt10MW.s:1024: Warning: dwarf line number information for .data ignored
encrypt.c: /tmp/cclt10MW.s:1026: Warning: dwarf line number information for .data ignored
encrypt.c: /tmp/cclt10MW.s:1028: Warning: dwarf line number information for .data ignored
encrypt.c: /tmp/cclt10MW.s:1029: Warning: dwarf line number information for .data ignored
encrypt.c: /tmp/cclt10MW.s:1030: Warning: dwarf line number information for .data ignored
encrypt.c: /tmp/cclt10MW.s:1037: Warning: dwarf line number information for .data ignored
encrypt.c: /tmp/cclt10MW.s:1044: Warning: dwarf line number information for .data ignored
encrypt.c: /tmp/cclt10MW.s:1047: Warning: dwarf line number information for .data ignored
encrypt.c: /tmp/cclt10MW.s:1052: Warning: dwarf line number information for .data ignored
encrypt.c: ...
Number of similar (implementation,compiler) pairs: 1, namely:
Implementation | Compiler |
T:sse4 | gcc -march=native -mtune=native -O3 -fwrapv -fPIC -fPIE -gdwarf-4 -Wall (11.4.0) |
Compiler output
encrypt.c: /tmp/ccD3QnJC.s: Assembler messages:
encrypt.c: /tmp/ccD3QnJC.s:960: Warning: dwarf line number information for .data ignored
encrypt.c: /tmp/ccD3QnJC.s:962: Warning: dwarf line number information for .data ignored
encrypt.c: /tmp/ccD3QnJC.s:974: Warning: dwarf line number information for .data ignored
encrypt.c: /tmp/ccD3QnJC.s:975: Warning: dwarf line number information for .data ignored
encrypt.c: /tmp/ccD3QnJC.s:976: Warning: dwarf line number information for .data ignored
encrypt.c: /tmp/ccD3QnJC.s:983: Warning: dwarf line number information for .data ignored
encrypt.c: /tmp/ccD3QnJC.s:986: Warning: dwarf line number information for .data ignored
encrypt.c: /tmp/ccD3QnJC.s:987: Warning: dwarf line number information for .data ignored
encrypt.c: /tmp/ccD3QnJC.s:992: Warning: dwarf line number information for .data ignored
encrypt.c: /tmp/ccD3QnJC.s:993: Warning: dwarf line number information for .data ignored
encrypt.c: /tmp/ccD3QnJC.s:996: Warning: dwarf line number information for .data ignored
encrypt.c: /tmp/ccD3QnJC.s:998: Warning: dwarf line number information for .data ignored
encrypt.c: /tmp/ccD3QnJC.s:1001: Warning: dwarf line number information for .data ignored
encrypt.c: /tmp/ccD3QnJC.s:1009: Warning: dwarf line number information for .data ignored
encrypt.c: /tmp/ccD3QnJC.s:1019: Warning: dwarf line number information for .data ignored
encrypt.c: /tmp/ccD3QnJC.s:1021: Warning: dwarf line number information for .data ignored
encrypt.c: /tmp/ccD3QnJC.s:1034: Warning: dwarf line number information for .data ignored
encrypt.c: /tmp/ccD3QnJC.s:1038: Warning: dwarf line number information for .data ignored
encrypt.c: /tmp/ccD3QnJC.s:1039: Warning: dwarf line number information for .data ignored
encrypt.c: /tmp/ccD3QnJC.s:1040: Warning: dwarf line number information for .data ignored
encrypt.c: /tmp/ccD3QnJC.s:1047: Warning: dwarf line number information for .data ignored
encrypt.c: /tmp/ccD3QnJC.s:1050: Warning: dwarf line number information for .data ignored
encrypt.c: /tmp/ccD3QnJC.s:1053: Warning: dwarf line number information for .data ignored
encrypt.c: /tmp/ccD3QnJC.s:1056: Warning: dwarf line number information for .data ignored
encrypt.c: ...
Number of similar (implementation,compiler) pairs: 1, namely:
Implementation | Compiler |
T:sse4 | gcc -march=native -mtune=native -O -fwrapv -fPIC -fPIE -gdwarf-4 -Wall (11.4.0) |
Compiler output
encrypt.c: /tmp/ccFqfNDp.s: Assembler messages:
encrypt.c: /tmp/ccFqfNDp.s:960: Warning: dwarf line number information for .data ignored
encrypt.c: /tmp/ccFqfNDp.s:962: Warning: dwarf line number information for .data ignored
encrypt.c: /tmp/ccFqfNDp.s:964: Warning: dwarf line number information for .data ignored
encrypt.c: /tmp/ccFqfNDp.s:965: Warning: dwarf line number information for .data ignored
encrypt.c: /tmp/ccFqfNDp.s:966: Warning: dwarf line number information for .data ignored
encrypt.c: /tmp/ccFqfNDp.s:977: Warning: dwarf line number information for .data ignored
encrypt.c: /tmp/ccFqfNDp.s:984: Warning: dwarf line number information for .data ignored
encrypt.c: /tmp/ccFqfNDp.s:987: Warning: dwarf line number information for .data ignored
encrypt.c: /tmp/ccFqfNDp.s:988: Warning: dwarf line number information for .data ignored
encrypt.c: /tmp/ccFqfNDp.s:995: Warning: dwarf line number information for .data ignored
encrypt.c: /tmp/ccFqfNDp.s:996: Warning: dwarf line number information for .data ignored
encrypt.c: /tmp/ccFqfNDp.s:999: Warning: dwarf line number information for .data ignored
encrypt.c: /tmp/ccFqfNDp.s:1001: Warning: dwarf line number information for .data ignored
encrypt.c: /tmp/ccFqfNDp.s:1004: Warning: dwarf line number information for .data ignored
encrypt.c: /tmp/ccFqfNDp.s:1012: Warning: dwarf line number information for .data ignored
encrypt.c: /tmp/ccFqfNDp.s:1022: Warning: dwarf line number information for .data ignored
encrypt.c: /tmp/ccFqfNDp.s:1024: Warning: dwarf line number information for .data ignored
encrypt.c: /tmp/ccFqfNDp.s:1026: Warning: dwarf line number information for .data ignored
encrypt.c: /tmp/ccFqfNDp.s:1027: Warning: dwarf line number information for .data ignored
encrypt.c: /tmp/ccFqfNDp.s:1028: Warning: dwarf line number information for .data ignored
encrypt.c: /tmp/ccFqfNDp.s:1035: Warning: dwarf line number information for .data ignored
encrypt.c: /tmp/ccFqfNDp.s:1042: Warning: dwarf line number information for .data ignored
encrypt.c: /tmp/ccFqfNDp.s:1045: Warning: dwarf line number information for .data ignored
encrypt.c: /tmp/ccFqfNDp.s:1048: Warning: dwarf line number information for .data ignored
encrypt.c: ...
Number of similar (implementation,compiler) pairs: 1, namely:
Implementation | Compiler |
T:sse4 | gcc -march=native -mtune=native -Os -fwrapv -fPIC -fPIE -gdwarf-4 -Wall (11.4.0) |
Namespace violations
omdsha256.o calc_L_i T
omdsha256.o double_block T
omdsha256.o final_masking_associated_data T
omdsha256.o final_masking_message T
omdsha256.o hash T
omdsha256.o increment_masking_associated_data T
omdsha256.o increment_masking_message T
omdsha256.o key_func T
omdsha256.o l2b T
omdsha256.o ntz T
omdsha256.o omdsha256_process T
omdsha256.o triple_block T
omdsha256.o xor_block T
sha256.o sha256_comp T
Number of similar (implementation,compiler) pairs: 9, namely:
Implementation | Compiler |
T:ref | clang -march=native -O2 -fwrapv -Qunused-arguments -fPIC -fPIE -gdwarf-4 -Wall (Ubuntu_Clang_14.0.0) |
T:ref | clang -march=native -O3 -fwrapv -Qunused-arguments -fPIC -fPIE -gdwarf-4 -Wall (Ubuntu_Clang_14.0.0) |
T:ref | clang -march=native -O -fwrapv -Qunused-arguments -fPIC -fPIE -gdwarf-4 -Wall (Ubuntu_Clang_14.0.0) |
T:ref | clang -march=native -Os -fwrapv -Qunused-arguments -fPIC -fPIE -gdwarf-4 -Wall (Ubuntu_Clang_14.0.0) |
T:ref | clang -mcpu=native -O3 -fwrapv -Qunused-arguments -fPIC -fPIE -gdwarf-4 -Wall (Ubuntu_Clang_14.0.0) |
T:ref | gcc -march=native -mtune=native -O2 -fwrapv -fPIC -fPIE -gdwarf-4 -Wall (11.4.0) |
T:ref | gcc -march=native -mtune=native -O3 -fwrapv -fPIC -fPIE -gdwarf-4 -Wall (11.4.0) |
T:ref | gcc -march=native -mtune=native -O -fwrapv -fPIC -fPIE -gdwarf-4 -Wall (11.4.0) |
T:ref | gcc -march=native -mtune=native -Os -fwrapv -fPIC -fPIE -gdwarf-4 -Wall (11.4.0) |