Implementation notes: amd64, kizomba, crypto_aead/morus1280128v1

Computer: kizomba
Microarchitecture: amd64; Kaby Lake (906e9)
Architecture: amd64
CPU ID: GenuineIntel-000906e9-1fc9cbf5
SUPERCOP version: 20240716
Operation: crypto_aead
Primitive: morus1280128v1
TimeObject sizeTest sizeImplementationCompilerBenchmark dateSUPERCOP version
47035757 0 023316 816 920T:avx2clang_-march=native_-O3_-fwrapv_-Qunused-arguments_-fPIC_-fPIE_-gdwarf-4_-Wall2024071720240716
47285757 0 023020 816 872T:avx2clang_-march=native_-O2_-fwrapv_-Qunused-arguments_-fPIC_-fPIE_-gdwarf-4_-Wall2024071720240716
48016612 0 020044 816 856T:avx2clang_-march=native_-O_-fwrapv_-Qunused-arguments_-fPIC_-fPIE_-gdwarf-4_-Wall2024071720240716
48434449 0 018734 808 920T:avx2clang_-march=native_-Os_-fwrapv_-Qunused-arguments_-fPIC_-fPIE_-gdwarf-4_-Wall2024071720240716
52266074 0 023077 784 928T:avx2gcc_-march=native_-mtune=native_-O3_-fwrapv_-fPIC_-fPIE_-gdwarf-4_-Wall2024071720240716
53163824 0 018349 784 928T:avx2gcc_-march=native_-mtune=native_-O_-fwrapv_-fPIC_-fPIE_-gdwarf-4_-Wall2024071720240716
53253812 0 018677 784 928T:avx2gcc_-march=native_-mtune=native_-O2_-fwrapv_-fPIC_-fPIE_-gdwarf-4_-Wall2024071720240716
1071611126 0 028117 784 928T:refgcc_-march=native_-mtune=native_-O3_-fwrapv_-fPIC_-fPIE_-gdwarf-4_-Wall2024071720240716
1092214390 0 031405 784 928T:ref64gcc_-march=native_-mtune=native_-O3_-fwrapv_-fPIC_-fPIE_-gdwarf-4_-Wall2024071720240716
1345018927 0 032412 816 856T:refclang_-march=native_-O_-fwrapv_-Qunused-arguments_-fPIC_-fPIE_-gdwarf-4_-Wall2024071720240716
1401613483 0 029476 816 856T:refclang_-mcpu=native_-O3_-fwrapv_-Qunused-arguments_-fPIC_-fPIE_-gdwarf-4_-Wall2024071720240716
1463713639 0 031260 816 920T:refclang_-march=native_-O3_-fwrapv_-Qunused-arguments_-fPIC_-fPIE_-gdwarf-4_-Wall2024071720240716
147269205 0 023502 808 920T:refclang_-march=native_-Os_-fwrapv_-Qunused-arguments_-fPIC_-fPIE_-gdwarf-4_-Wall2024071720240716
1485913607 0 030932 816 872T:refclang_-march=native_-O2_-fwrapv_-Qunused-arguments_-fPIC_-fPIE_-gdwarf-4_-Wall2024071720240716
179226086 0 020957 784 928T:ref64gcc_-march=native_-mtune=native_-O2_-fwrapv_-fPIC_-fPIE_-gdwarf-4_-Wall2024071720240716
179565959 0 020388 776 928T:ref64gcc_-march=native_-mtune=native_-O_-fwrapv_-fPIC_-fPIE_-gdwarf-4_-Wall2024071720240716
181213736 0 016952 760 896T:refgcc_-march=native_-mtune=native_-Os_-fwrapv_-fPIC_-fPIE_-gdwarf-4_-Wall2024071720240716
182164331 0 018748 776 928T:refgcc_-march=native_-mtune=native_-O_-fwrapv_-fPIC_-fPIE_-gdwarf-4_-Wall2024071720240716
182464350 0 019205 784 928T:refgcc_-march=native_-mtune=native_-O2_-fwrapv_-fPIC_-fPIE_-gdwarf-4_-Wall2024071720240716
185145640 0 018856 760 896T:ref64gcc_-march=native_-mtune=native_-Os_-fwrapv_-fPIC_-fPIE_-gdwarf-4_-Wall2024071720240716
195976730 0 022740 816 856T:ref64clang_-mcpu=native_-O3_-fwrapv_-Qunused-arguments_-fPIC_-fPIE_-gdwarf-4_-Wall2024071720240716
207216696 0 024036 816 872T:ref64clang_-march=native_-O2_-fwrapv_-Qunused-arguments_-fPIC_-fPIE_-gdwarf-4_-Wall2024071720240716
208336696 0 024332 816 920T:ref64clang_-march=native_-O3_-fwrapv_-Qunused-arguments_-fPIC_-fPIE_-gdwarf-4_-Wall2024071720240716
209595569 0 019870 808 920T:ref64clang_-march=native_-Os_-fwrapv_-Qunused-arguments_-fPIC_-fPIE_-gdwarf-4_-Wall2024071720240716
238677478 0 020980 816 856T:ref64clang_-march=native_-O_-fwrapv_-Qunused-arguments_-fPIC_-fPIE_-gdwarf-4_-Wall2024071720240716

Compiler output


morus1280128v1avx2.c: morus1280128v1avx2.c:306:23: warning: unused variable 'j' [-Wunused-variable]
morus1280128v1avx2.c:         unsigned long long i,j;
morus1280128v1avx2.c:                              ^
morus1280128v1avx2.c: morus1280128v1avx2.c:357:16: warning: unused variable 'check' [-Wunused-variable]
morus1280128v1avx2.c:         unsigned char check = 0;
morus1280128v1avx2.c:                       ^
morus1280128v1avx2.c: morus1280128v1avx2.c:356:16: warning: unused variable 'tag' [-Wunused-variable]
morus1280128v1avx2.c:         unsigned char tag[16];
morus1280128v1avx2.c:                       ^
morus1280128v1avx2.c: morus1280128v1avx2.c:354:23: warning: unused variable 'j' [-Wunused-variable]
morus1280128v1avx2.c:         unsigned long long i,j;
morus1280128v1avx2.c:                              ^
morus1280128v1avx2.c: 4 warnings generated.

Number of similar (implementation,compiler) pairs: 1, namely:
ImplementationCompiler
T:avx2clang -march=native -O2 -fwrapv -Qunused-arguments -fPIC -fPIE -gdwarf-4 -Wall (Ubuntu_Clang_14.0.0)

Compiler output


morus1280128v1avx2.c: morus1280128v1avx2.c:306:23: warning: unused variable 'j' [-Wunused-variable]
morus1280128v1avx2.c:         unsigned long long i,j;
morus1280128v1avx2.c:                              ^
morus1280128v1avx2.c: morus1280128v1avx2.c:354:23: warning: unused variable 'j' [-Wunused-variable]
morus1280128v1avx2.c:         unsigned long long i,j;
morus1280128v1avx2.c:                              ^
morus1280128v1avx2.c: morus1280128v1avx2.c:356:16: warning: unused variable 'tag' [-Wunused-variable]
morus1280128v1avx2.c:         unsigned char tag[16];
morus1280128v1avx2.c:                       ^
morus1280128v1avx2.c: morus1280128v1avx2.c:357:16: warning: unused variable 'check' [-Wunused-variable]
morus1280128v1avx2.c:         unsigned char check = 0;
morus1280128v1avx2.c:                       ^
morus1280128v1avx2.c: 4 warnings generated.

Number of similar (implementation,compiler) pairs: 2, namely:
ImplementationCompiler
T:avx2clang -march=native -O3 -fwrapv -Qunused-arguments -fPIC -fPIE -gdwarf-4 -Wall (Ubuntu_Clang_14.0.0)
T:avx2clang -march=native -O -fwrapv -Qunused-arguments -fPIC -fPIE -gdwarf-4 -Wall (Ubuntu_Clang_14.0.0)

Compiler output


morus1280128v1avx2.c: morus1280128v1avx2.c:306:23: warning: unused variable 'j' [-Wunused-variable]
morus1280128v1avx2.c:         unsigned long long i,j;
morus1280128v1avx2.c:                              ^
morus1280128v1avx2.c: morus1280128v1avx2.c:356:16: warning: unused variable 'tag' [-Wunused-variable]
morus1280128v1avx2.c:         unsigned char tag[16];
morus1280128v1avx2.c:                       ^
morus1280128v1avx2.c: morus1280128v1avx2.c:354:23: warning: unused variable 'j' [-Wunused-variable]
morus1280128v1avx2.c:         unsigned long long i,j;
morus1280128v1avx2.c:                              ^
morus1280128v1avx2.c: morus1280128v1avx2.c:357:16: warning: unused variable 'check' [-Wunused-variable]
morus1280128v1avx2.c:         unsigned char check = 0;
morus1280128v1avx2.c:                       ^
morus1280128v1avx2.c: 4 warnings generated.

Number of similar (implementation,compiler) pairs: 1, namely:
ImplementationCompiler
T:avx2clang -march=native -Os -fwrapv -Qunused-arguments -fPIC -fPIE -gdwarf-4 -Wall (Ubuntu_Clang_14.0.0)

Compiler output


morus1280128v1avx2.c: morus1280128v1avx2.c:55:13: error: always_inline function '_mm256_xor_si256' requires target feature 'avx2', but would be inlined into function 'morus_stateupdate' that is compiled without support for 'avx2'
morus1280128v1avx2.c:         state[0] = XOR256(state[0], state[3]);
morus1280128v1avx2.c:                    ^
morus1280128v1avx2.c: morus1280128v1avx2.c:25:27: note: expanded from macro 'XOR256'
morus1280128v1avx2.c: #define XOR256(x,y)       _mm256_xor_si256((x),(y))        /*XOR256(x,y) = x ^ y, where x and y are two 256-bit word*/
morus1280128v1avx2.c:                           ^
morus1280128v1avx2.c: morus1280128v1avx2.c:55:13: error: AVX vector argument of type '__m256i' (vector of 4 'long long' values) without 'avx' enabled changes the ABI
morus1280128v1avx2.c: morus1280128v1avx2.c:25:27: note: expanded from macro 'XOR256'
morus1280128v1avx2.c: #define XOR256(x,y)       _mm256_xor_si256((x),(y))        /*XOR256(x,y) = x ^ y, where x and y are two 256-bit word*/
morus1280128v1avx2.c:                           ^
morus1280128v1avx2.c: morus1280128v1avx2.c:56:30: error: always_inline function '_mm256_and_si256' requires target feature 'avx2', but would be inlined into function 'morus_stateupdate' that is compiled without support for 'avx2'
morus1280128v1avx2.c:         state[0] = XOR256(state[0], AND256(state[1], state[2]));
morus1280128v1avx2.c:                                     ^
morus1280128v1avx2.c: morus1280128v1avx2.c:26:27: note: expanded from macro 'AND256'
morus1280128v1avx2.c: #define AND256(x,y)       _mm256_and_si256((x),(y))        /*AND(x,y) = x & y, where x and y are two 256-bit word*/
morus1280128v1avx2.c:                           ^
morus1280128v1avx2.c: morus1280128v1avx2.c:56:30: error: AVX vector argument of type '__m256i' (vector of 4 'long long' values) without 'avx' enabled changes the ABI
morus1280128v1avx2.c: morus1280128v1avx2.c:26:27: note: expanded from macro 'AND256'
morus1280128v1avx2.c: #define AND256(x,y)       _mm256_and_si256((x),(y))        /*AND(x,y) = x & y, where x and y are two 256-bit word*/
morus1280128v1avx2.c:                           ^
morus1280128v1avx2.c: morus1280128v1avx2.c:56:13: error: always_inline function '_mm256_xor_si256' requires target feature 'avx2', but would be inlined into function 'morus_stateupdate' that is compiled without support for 'avx2'
morus1280128v1avx2.c:         state[0] = XOR256(state[0], AND256(state[1], state[2]));
morus1280128v1avx2.c:                    ^
morus1280128v1avx2.c: morus1280128v1avx2.c:25:27: note: expanded from macro 'XOR256'
morus1280128v1avx2.c: #define XOR256(x,y)       _mm256_xor_si256((x),(y))        /*XOR256(x,y) = x ^ y, where x and y are two 256-bit word*/
morus1280128v1avx2.c: ...

Number of similar (implementation,compiler) pairs: 1, namely:
ImplementationCompiler
T:avx2clang -mcpu=native -O3 -fwrapv -Qunused-arguments -fPIC -fPIE -gdwarf-4 -Wall (Ubuntu_Clang_14.0.0)

Compiler output


morus1280128v1avx2.c: morus1280128v1avx2.c: In function 'crypto_aead_morus1280128v1_avx2_timingleaks_encrypt':
morus1280128v1avx2.c: morus1280128v1avx2.c:306:30: warning: unused variable 'j' [-Wunused-variable]
morus1280128v1avx2.c:   306 |         unsigned long long i,j;
morus1280128v1avx2.c:       |                              ^
morus1280128v1avx2.c: morus1280128v1avx2.c: In function 'crypto_aead_morus1280128v1_avx2_timingleaks_decrypt':
morus1280128v1avx2.c: morus1280128v1avx2.c:357:23: warning: unused variable 'check' [-Wunused-variable]
morus1280128v1avx2.c:   357 |         unsigned char check = 0;
morus1280128v1avx2.c:       |                       ^~~~~
morus1280128v1avx2.c: morus1280128v1avx2.c:356:23: warning: unused variable 'tag' [-Wunused-variable]
morus1280128v1avx2.c:   356 |         unsigned char tag[16];
morus1280128v1avx2.c:       |                       ^~~
morus1280128v1avx2.c: morus1280128v1avx2.c:354:30: warning: unused variable 'j' [-Wunused-variable]
morus1280128v1avx2.c:   354 |         unsigned long long i,j;
morus1280128v1avx2.c:       |                              ^

Number of similar (implementation,compiler) pairs: 3, namely:
ImplementationCompiler
T:avx2gcc -march=native -mtune=native -O2 -fwrapv -fPIC -fPIE -gdwarf-4 -Wall (11.4.0)
T:avx2gcc -march=native -mtune=native -O3 -fwrapv -fPIC -fPIE -gdwarf-4 -Wall (11.4.0)
T:avx2gcc -march=native -mtune=native -O -fwrapv -fPIC -fPIE -gdwarf-4 -Wall (11.4.0)

Compiler output


morus1280128v1avx2.c: morus1280128v1avx2.c: In function 'crypto_aead_morus1280128v1_avx2_timingleaks_encrypt':
morus1280128v1avx2.c: morus1280128v1avx2.c:306:30: warning: unused variable 'j' [-Wunused-variable]
morus1280128v1avx2.c:   306 |         unsigned long long i,j;
morus1280128v1avx2.c:       |                              ^
morus1280128v1avx2.c: morus1280128v1avx2.c: In function 'crypto_aead_morus1280128v1_avx2_timingleaks_decrypt':
morus1280128v1avx2.c: morus1280128v1avx2.c:357:23: warning: unused variable 'check' [-Wunused-variable]
morus1280128v1avx2.c:   357 |         unsigned char check = 0;
morus1280128v1avx2.c:       |                       ^~~~~
morus1280128v1avx2.c: morus1280128v1avx2.c:356:23: warning: unused variable 'tag' [-Wunused-variable]
morus1280128v1avx2.c:   356 |         unsigned char tag[16];
morus1280128v1avx2.c:       |                       ^~~
morus1280128v1avx2.c: morus1280128v1avx2.c:354:30: warning: unused variable 'j' [-Wunused-variable]
morus1280128v1avx2.c:   354 |         unsigned long long i,j;
morus1280128v1avx2.c:       |                              ^
try.c: /usr/bin/ld: libcrypto_aead_morus1280128v1.a(morus1280128v1avx2.o): in function `crypto_aead_morus1280128v1_avx2_timingleaks_encrypt':
try.c: .../supercop-data/kizomba/amd64/try/c/gcc_-march=native_-mtune=native_-Os_-fwrapv_-fPIC_-fPIE_-gdwarf-4_-Wall/timingleaks/crypto_aead/morus1280128v1/avx2/work/morus1280128v1avx2.c:317: undefined reference to `morus_enc_aut_step'
try.c: /usr/bin/ld: .../supercop-data/kizomba/amd64/try/c/gcc_-march=native_-mtune=native_-Os_-fwrapv_-fPIC_-fPIE_-gdwarf-4_-Wall/timingleaks/crypto_aead/morus1280128v1/avx2/work/morus1280128v1avx2.c:329: undefined reference to `morus_enc_aut_step'
try.c: /usr/bin/ld: libcrypto_aead_morus1280128v1.a(morus1280128v1avx2.o): in function `crypto_aead_morus1280128v1_avx2_timingleaks_decrypt':
try.c: .../supercop-data/kizomba/amd64/try/c/gcc_-march=native_-mtune=native_-Os_-fwrapv_-fPIC_-fPIE_-gdwarf-4_-Wall/timingleaks/crypto_aead/morus1280128v1/avx2/work/morus1280128v1avx2.c:364: undefined reference to `morus_enc_aut_step'
try.c: /usr/bin/ld: .../supercop-data/kizomba/amd64/try/c/gcc_-march=native_-mtune=native_-Os_-fwrapv_-fPIC_-fPIE_-gdwarf-4_-Wall/timingleaks/crypto_aead/morus1280128v1/avx2/work/morus1280128v1avx2.c:376: undefined reference to `morus_dec_aut_step'
try.c: collect2: error: ld returned 1 exit status

Number of similar (implementation,compiler) pairs: 1, namely:
ImplementationCompiler
T:avx2gcc -march=native -mtune=native -Os -fwrapv -fPIC -fPIE -gdwarf-4 -Wall (11.4.0)

Compiler output


encrypt.c: encrypt.c:224:17: warning: unused variable 'plaintextblock' [-Wunused-variable]
encrypt.c:         uint8_t plaintextblock[32], ciphertextblock[32];
encrypt.c:                 ^
encrypt.c: encrypt.c:268:25: warning: unused variable 'j' [-Wunused-variable]
encrypt.c:         unsigned long i,j;
encrypt.c:                         ^
encrypt.c: encrypt.c:269:17: warning: unused variable 'plaintextblock' [-Wunused-variable]
encrypt.c:         uint8_t plaintextblock[32], ciphertextblock[32];
encrypt.c:                 ^
encrypt.c: encrypt.c:270:17: warning: unused variable 'tag' [-Wunused-variable]
encrypt.c:         uint8_t tag[16];
encrypt.c:                 ^
encrypt.c: encrypt.c:271:17: warning: unused variable 'check' [-Wunused-variable]
encrypt.c:         uint8_t check = 0;
encrypt.c:                 ^
encrypt.c: 5 warnings generated.

Number of similar (implementation,compiler) pairs: 5, namely:
ImplementationCompiler
T:refclang -march=native -O2 -fwrapv -Qunused-arguments -fPIC -fPIE -gdwarf-4 -Wall (Ubuntu_Clang_14.0.0)
T:refclang -march=native -O3 -fwrapv -Qunused-arguments -fPIC -fPIE -gdwarf-4 -Wall (Ubuntu_Clang_14.0.0)
T:refclang -march=native -O -fwrapv -Qunused-arguments -fPIC -fPIE -gdwarf-4 -Wall (Ubuntu_Clang_14.0.0)
T:refclang -march=native -Os -fwrapv -Qunused-arguments -fPIC -fPIE -gdwarf-4 -Wall (Ubuntu_Clang_14.0.0)
T:refclang -mcpu=native -O3 -fwrapv -Qunused-arguments -fPIC -fPIE -gdwarf-4 -Wall (Ubuntu_Clang_14.0.0)

Compiler output


encrypt.c: encrypt.c: In function 'crypto_aead_morus1280128v1_ref_timingleaks_encrypt':
encrypt.c: encrypt.c:224:17: warning: unused variable 'plaintextblock' [-Wunused-variable]
encrypt.c:   224 |         uint8_t plaintextblock[32], ciphertextblock[32];
encrypt.c:       |                 ^~~~~~~~~~~~~~
encrypt.c: encrypt.c: In function 'crypto_aead_morus1280128v1_ref_timingleaks_decrypt':
encrypt.c: encrypt.c:271:17: warning: unused variable 'check' [-Wunused-variable]
encrypt.c:   271 |         uint8_t check = 0;
encrypt.c:       |                 ^~~~~
encrypt.c: encrypt.c:270:17: warning: unused variable 'tag' [-Wunused-variable]
encrypt.c:   270 |         uint8_t tag[16];
encrypt.c:       |                 ^~~
encrypt.c: encrypt.c:269:17: warning: unused variable 'plaintextblock' [-Wunused-variable]
encrypt.c:   269 |         uint8_t plaintextblock[32], ciphertextblock[32];
encrypt.c:       |                 ^~~~~~~~~~~~~~
encrypt.c: encrypt.c:268:25: warning: unused variable 'j' [-Wunused-variable]
encrypt.c:   268 |         unsigned long i,j;
encrypt.c:       |                         ^

Number of similar (implementation,compiler) pairs: 4, namely:
ImplementationCompiler
T:refgcc -march=native -mtune=native -O2 -fwrapv -fPIC -fPIE -gdwarf-4 -Wall (11.4.0)
T:refgcc -march=native -mtune=native -O3 -fwrapv -fPIC -fPIE -gdwarf-4 -Wall (11.4.0)
T:refgcc -march=native -mtune=native -O -fwrapv -fPIC -fPIE -gdwarf-4 -Wall (11.4.0)
T:refgcc -march=native -mtune=native -Os -fwrapv -fPIC -fPIE -gdwarf-4 -Wall (11.4.0)

Compiler output


morus1280128v1opt64.c: morus1280128v1opt64.c:286:17: warning: unused variable 'plaintextblock' [-Wunused-variable]
morus1280128v1opt64.c:         uint8_t plaintextblock[32], ciphertextblock[32];
morus1280128v1opt64.c:                 ^
morus1280128v1opt64.c: morus1280128v1opt64.c:331:25: warning: unused variable 'j' [-Wunused-variable]
morus1280128v1opt64.c:         unsigned long i,j;
morus1280128v1opt64.c:                         ^
morus1280128v1opt64.c: morus1280128v1opt64.c:332:17: warning: unused variable 'plaintextblock' [-Wunused-variable]
morus1280128v1opt64.c:         uint8_t plaintextblock[32], ciphertextblock[32];
morus1280128v1opt64.c:                 ^
morus1280128v1opt64.c: morus1280128v1opt64.c:333:17: warning: unused variable 'tag' [-Wunused-variable]
morus1280128v1opt64.c:         uint8_t tag[16];
morus1280128v1opt64.c:                 ^
morus1280128v1opt64.c: morus1280128v1opt64.c:334:17: warning: unused variable 'check' [-Wunused-variable]
morus1280128v1opt64.c:         uint8_t check = 0;
morus1280128v1opt64.c:                 ^
morus1280128v1opt64.c: 5 warnings generated.

Number of similar (implementation,compiler) pairs: 5, namely:
ImplementationCompiler
T:ref64clang -march=native -O2 -fwrapv -Qunused-arguments -fPIC -fPIE -gdwarf-4 -Wall (Ubuntu_Clang_14.0.0)
T:ref64clang -march=native -O3 -fwrapv -Qunused-arguments -fPIC -fPIE -gdwarf-4 -Wall (Ubuntu_Clang_14.0.0)
T:ref64clang -march=native -O -fwrapv -Qunused-arguments -fPIC -fPIE -gdwarf-4 -Wall (Ubuntu_Clang_14.0.0)
T:ref64clang -march=native -Os -fwrapv -Qunused-arguments -fPIC -fPIE -gdwarf-4 -Wall (Ubuntu_Clang_14.0.0)
T:ref64clang -mcpu=native -O3 -fwrapv -Qunused-arguments -fPIC -fPIE -gdwarf-4 -Wall (Ubuntu_Clang_14.0.0)

Compiler output


morus1280128v1opt64.c: morus1280128v1opt64.c: In function 'crypto_aead_morus1280128v1_ref64_timingleaks_encrypt':
morus1280128v1opt64.c: morus1280128v1opt64.c:286:17: warning: unused variable 'plaintextblock' [-Wunused-variable]
morus1280128v1opt64.c:   286 |         uint8_t plaintextblock[32], ciphertextblock[32];
morus1280128v1opt64.c:       |                 ^~~~~~~~~~~~~~
morus1280128v1opt64.c: morus1280128v1opt64.c: In function 'crypto_aead_morus1280128v1_ref64_timingleaks_decrypt':
morus1280128v1opt64.c: morus1280128v1opt64.c:334:17: warning: unused variable 'check' [-Wunused-variable]
morus1280128v1opt64.c:   334 |         uint8_t check = 0;
morus1280128v1opt64.c:       |                 ^~~~~
morus1280128v1opt64.c: morus1280128v1opt64.c:333:17: warning: unused variable 'tag' [-Wunused-variable]
morus1280128v1opt64.c:   333 |         uint8_t tag[16];
morus1280128v1opt64.c:       |                 ^~~
morus1280128v1opt64.c: morus1280128v1opt64.c:332:17: warning: unused variable 'plaintextblock' [-Wunused-variable]
morus1280128v1opt64.c:   332 |         uint8_t plaintextblock[32], ciphertextblock[32];
morus1280128v1opt64.c:       |                 ^~~~~~~~~~~~~~
morus1280128v1opt64.c: morus1280128v1opt64.c:331:25: warning: unused variable 'j' [-Wunused-variable]
morus1280128v1opt64.c:   331 |         unsigned long i,j;
morus1280128v1opt64.c:       |                         ^

Number of similar (implementation,compiler) pairs: 4, namely:
ImplementationCompiler
T:ref64gcc -march=native -mtune=native -O2 -fwrapv -fPIC -fPIE -gdwarf-4 -Wall (11.4.0)
T:ref64gcc -march=native -mtune=native -O3 -fwrapv -fPIC -fPIE -gdwarf-4 -Wall (11.4.0)
T:ref64gcc -march=native -mtune=native -O -fwrapv -fPIC -fPIE -gdwarf-4 -Wall (11.4.0)
T:ref64gcc -march=native -mtune=native -Os -fwrapv -fPIC -fPIE -gdwarf-4 -Wall (11.4.0)

Compiler output


morus1280128v1sse2.c: morus1280128v1sse2.c:196:13: warning: unused variable 't' [-Wunused-variable]
morus1280128v1sse2.c:     __m128i t;
morus1280128v1sse2.c:             ^
morus1280128v1sse2.c: morus1280128v1sse2.c:197:21: warning: unused variable 't2' [-Wunused-variable]
morus1280128v1sse2.c:     __m128i tt, t1, t2;
morus1280128v1sse2.c:                     ^
morus1280128v1sse2.c: morus1280128v1sse2.c:197:17: warning: unused variable 't1' [-Wunused-variable]
morus1280128v1sse2.c:     __m128i tt, t1, t2;
morus1280128v1sse2.c:                 ^
morus1280128v1sse2.c: morus1280128v1sse2.c:197:13: warning: unused variable 'tt' [-Wunused-variable]
morus1280128v1sse2.c:     __m128i tt, t1, t2;
morus1280128v1sse2.c:             ^
morus1280128v1sse2.c: morus1280128v1sse2.c:222:13: warning: unused variable 't' [-Wunused-variable]
morus1280128v1sse2.c:     __m128i t;
morus1280128v1sse2.c:             ^
morus1280128v1sse2.c: morus1280128v1sse2.c:314:13: warning: unused variable 'plaintextblock' [-Wunused-variable]
morus1280128v1sse2.c:     uint8_t plaintextblock[32], ciphertextblock[32];
morus1280128v1sse2.c:             ^
morus1280128v1sse2.c: morus1280128v1sse2.c:360:13: warning: unused variable 'plaintextblock' [-Wunused-variable]
morus1280128v1sse2.c:     uint8_t plaintextblock[32], ciphertextblock[32];
morus1280128v1sse2.c:             ^
morus1280128v1sse2.c: morus1280128v1sse2.c:361:13: warning: unused variable 'tag' [-Wunused-variable]
morus1280128v1sse2.c:     uint8_t tag[16];
morus1280128v1sse2.c:             ^
morus1280128v1sse2.c: morus1280128v1sse2.c:362:13: warning: unused variable 'check' [-Wunused-variable]
morus1280128v1sse2.c: ...

Number of similar (implementation,compiler) pairs: 1, namely:
ImplementationCompiler
T:sse2clang -march=native -O2 -fwrapv -Qunused-arguments -fPIC -fPIE -gdwarf-4 -Wall (Ubuntu_Clang_14.0.0)

Compiler output


morus1280128v1sse2.c: morus1280128v1sse2.c:197:21: warning: unused variable 't2' [-Wunused-variable]
morus1280128v1sse2.c:     __m128i tt, t1, t2;
morus1280128v1sse2.c:                     ^
morus1280128v1sse2.c: morus1280128v1sse2.c:197:17: warning: unused variable 't1' [-Wunused-variable]
morus1280128v1sse2.c:     __m128i tt, t1, t2;
morus1280128v1sse2.c:                 ^
morus1280128v1sse2.c: morus1280128v1sse2.c:196:13: warning: unused variable 't' [-Wunused-variable]
morus1280128v1sse2.c:     __m128i t;
morus1280128v1sse2.c:             ^
morus1280128v1sse2.c: morus1280128v1sse2.c:197:13: warning: unused variable 'tt' [-Wunused-variable]
morus1280128v1sse2.c:     __m128i tt, t1, t2;
morus1280128v1sse2.c:             ^
morus1280128v1sse2.c: morus1280128v1sse2.c:222:13: warning: unused variable 't' [-Wunused-variable]
morus1280128v1sse2.c:     __m128i t;
morus1280128v1sse2.c:             ^
morus1280128v1sse2.c: morus1280128v1sse2.c:314:13: warning: unused variable 'plaintextblock' [-Wunused-variable]
morus1280128v1sse2.c:     uint8_t plaintextblock[32], ciphertextblock[32];
morus1280128v1sse2.c:             ^
morus1280128v1sse2.c: morus1280128v1sse2.c:360:13: warning: unused variable 'plaintextblock' [-Wunused-variable]
morus1280128v1sse2.c:     uint8_t plaintextblock[32], ciphertextblock[32];
morus1280128v1sse2.c:             ^
morus1280128v1sse2.c: morus1280128v1sse2.c:361:13: warning: unused variable 'tag' [-Wunused-variable]
morus1280128v1sse2.c:     uint8_t tag[16];
morus1280128v1sse2.c:             ^
morus1280128v1sse2.c: morus1280128v1sse2.c:362:13: warning: unused variable 'check' [-Wunused-variable]
morus1280128v1sse2.c: ...

Number of similar (implementation,compiler) pairs: 1, namely:
ImplementationCompiler
T:sse2clang -march=native -O3 -fwrapv -Qunused-arguments -fPIC -fPIE -gdwarf-4 -Wall (Ubuntu_Clang_14.0.0)

Compiler output


morus1280128v1sse2.c: morus1280128v1sse2.c:197:13: warning: unused variable 'tt' [-Wunused-variable]
morus1280128v1sse2.c:     __m128i tt, t1, t2;
morus1280128v1sse2.c:             ^
morus1280128v1sse2.c: morus1280128v1sse2.c:196:13: warning: unused variable 't' [-Wunused-variable]
morus1280128v1sse2.c:     __m128i t;
morus1280128v1sse2.c:             ^
morus1280128v1sse2.c: morus1280128v1sse2.c:197:21: warning: unused variable 't2' [-Wunused-variable]
morus1280128v1sse2.c:     __m128i tt, t1, t2;
morus1280128v1sse2.c:                     ^
morus1280128v1sse2.c: morus1280128v1sse2.c:197:17: warning: unused variable 't1' [-Wunused-variable]
morus1280128v1sse2.c:     __m128i tt, t1, t2;
morus1280128v1sse2.c:                 ^
morus1280128v1sse2.c: morus1280128v1sse2.c:222:13: warning: unused variable 't' [-Wunused-variable]
morus1280128v1sse2.c:     __m128i t;
morus1280128v1sse2.c:             ^
morus1280128v1sse2.c: morus1280128v1sse2.c:314:13: warning: unused variable 'plaintextblock' [-Wunused-variable]
morus1280128v1sse2.c:     uint8_t plaintextblock[32], ciphertextblock[32];
morus1280128v1sse2.c:             ^
morus1280128v1sse2.c: morus1280128v1sse2.c:359:16: warning: unused variable 'j' [-Wunused-variable]
morus1280128v1sse2.c:     uint64_t i,j;
morus1280128v1sse2.c:                ^
morus1280128v1sse2.c: morus1280128v1sse2.c:362:13: warning: unused variable 'check' [-Wunused-variable]
morus1280128v1sse2.c:     uint8_t check = 0;
morus1280128v1sse2.c:             ^
morus1280128v1sse2.c: morus1280128v1sse2.c:361:13: warning: unused variable 'tag' [-Wunused-variable]
morus1280128v1sse2.c: ...

Number of similar (implementation,compiler) pairs: 1, namely:
ImplementationCompiler
T:sse2clang -march=native -O -fwrapv -Qunused-arguments -fPIC -fPIE -gdwarf-4 -Wall (Ubuntu_Clang_14.0.0)

Compiler output


morus1280128v1sse2.c: morus1280128v1sse2.c:197:21: warning: unused variable 't2' [-Wunused-variable]
morus1280128v1sse2.c:     __m128i tt, t1, t2;
morus1280128v1sse2.c:                     ^
morus1280128v1sse2.c: morus1280128v1sse2.c:196:13: warning: unused variable 't' [-Wunused-variable]
morus1280128v1sse2.c:     __m128i t;
morus1280128v1sse2.c:             ^
morus1280128v1sse2.c: morus1280128v1sse2.c:197:13: warning: unused variable 'tt' [-Wunused-variable]
morus1280128v1sse2.c:     __m128i tt, t1, t2;
morus1280128v1sse2.c:             ^
morus1280128v1sse2.c: morus1280128v1sse2.c:197:17: warning: unused variable 't1' [-Wunused-variable]
morus1280128v1sse2.c:     __m128i tt, t1, t2;
morus1280128v1sse2.c:                 ^
morus1280128v1sse2.c: morus1280128v1sse2.c:222:13: warning: unused variable 't' [-Wunused-variable]
morus1280128v1sse2.c:     __m128i t;
morus1280128v1sse2.c:             ^
morus1280128v1sse2.c: morus1280128v1sse2.c:314:13: warning: unused variable 'plaintextblock' [-Wunused-variable]
morus1280128v1sse2.c:     uint8_t plaintextblock[32], ciphertextblock[32];
morus1280128v1sse2.c:             ^
morus1280128v1sse2.c: morus1280128v1sse2.c:362:13: warning: unused variable 'check' [-Wunused-variable]
morus1280128v1sse2.c:     uint8_t check = 0;
morus1280128v1sse2.c:             ^
morus1280128v1sse2.c: morus1280128v1sse2.c:360:13: warning: unused variable 'plaintextblock' [-Wunused-variable]
morus1280128v1sse2.c:     uint8_t plaintextblock[32], ciphertextblock[32];
morus1280128v1sse2.c:             ^
morus1280128v1sse2.c: morus1280128v1sse2.c:359:16: warning: unused variable 'j' [-Wunused-variable]
morus1280128v1sse2.c: ...

Number of similar (implementation,compiler) pairs: 1, namely:
ImplementationCompiler
T:sse2clang -march=native -Os -fwrapv -Qunused-arguments -fPIC -fPIE -gdwarf-4 -Wall (Ubuntu_Clang_14.0.0)

Compiler output


morus1280128v1sse2.c: morus1280128v1sse2.c:196:13: warning: unused variable 't' [-Wunused-variable]
morus1280128v1sse2.c:     __m128i t;
morus1280128v1sse2.c:             ^
morus1280128v1sse2.c: morus1280128v1sse2.c:197:13: warning: unused variable 'tt' [-Wunused-variable]
morus1280128v1sse2.c:     __m128i tt, t1, t2;
morus1280128v1sse2.c:             ^
morus1280128v1sse2.c: morus1280128v1sse2.c:197:17: warning: unused variable 't1' [-Wunused-variable]
morus1280128v1sse2.c:     __m128i tt, t1, t2;
morus1280128v1sse2.c:                 ^
morus1280128v1sse2.c: morus1280128v1sse2.c:197:21: warning: unused variable 't2' [-Wunused-variable]
morus1280128v1sse2.c:     __m128i tt, t1, t2;
morus1280128v1sse2.c:                     ^
morus1280128v1sse2.c: morus1280128v1sse2.c:222:13: warning: unused variable 't' [-Wunused-variable]
morus1280128v1sse2.c:     __m128i t;
morus1280128v1sse2.c:             ^
morus1280128v1sse2.c: morus1280128v1sse2.c:314:13: warning: unused variable 'plaintextblock' [-Wunused-variable]
morus1280128v1sse2.c:     uint8_t plaintextblock[32], ciphertextblock[32];
morus1280128v1sse2.c:             ^
morus1280128v1sse2.c: morus1280128v1sse2.c:359:16: warning: unused variable 'j' [-Wunused-variable]
morus1280128v1sse2.c:     uint64_t i,j;
morus1280128v1sse2.c:                ^
morus1280128v1sse2.c: morus1280128v1sse2.c:362:13: warning: unused variable 'check' [-Wunused-variable]
morus1280128v1sse2.c:     uint8_t check = 0;
morus1280128v1sse2.c:             ^
morus1280128v1sse2.c: morus1280128v1sse2.c:361:13: warning: unused variable 'tag' [-Wunused-variable]
morus1280128v1sse2.c: ...

Number of similar (implementation,compiler) pairs: 1, namely:
ImplementationCompiler
T:sse2clang -mcpu=native -O3 -fwrapv -Qunused-arguments -fPIC -fPIE -gdwarf-4 -Wall (Ubuntu_Clang_14.0.0)

Compiler output


morus1280128v1sse2.c: morus1280128v1sse2.c: In function 'morus_enc_aut_step':
morus1280128v1sse2.c: morus1280128v1sse2.c:197:21: warning: unused variable 't2' [-Wunused-variable]
morus1280128v1sse2.c:   197 |     __m128i tt, t1, t2;
morus1280128v1sse2.c:       |                     ^~
morus1280128v1sse2.c: morus1280128v1sse2.c:197:17: warning: unused variable 't1' [-Wunused-variable]
morus1280128v1sse2.c:   197 |     __m128i tt, t1, t2;
morus1280128v1sse2.c:       |                 ^~
morus1280128v1sse2.c: morus1280128v1sse2.c:197:13: warning: unused variable 'tt' [-Wunused-variable]
morus1280128v1sse2.c:   197 |     __m128i tt, t1, t2;
morus1280128v1sse2.c:       |             ^~
morus1280128v1sse2.c: morus1280128v1sse2.c:196:13: warning: unused variable 't' [-Wunused-variable]
morus1280128v1sse2.c:   196 |     __m128i t;
morus1280128v1sse2.c:       |             ^
morus1280128v1sse2.c: morus1280128v1sse2.c: In function 'morus_dec_aut_step':
morus1280128v1sse2.c: morus1280128v1sse2.c:222:13: warning: unused variable 't' [-Wunused-variable]
morus1280128v1sse2.c:   222 |     __m128i t;
morus1280128v1sse2.c:       |             ^
morus1280128v1sse2.c: morus1280128v1sse2.c: In function 'crypto_aead_morus1280128v1_sse2_timingleaks_encrypt':
morus1280128v1sse2.c: morus1280128v1sse2.c:314:13: warning: unused variable 'plaintextblock' [-Wunused-variable]
morus1280128v1sse2.c:   314 |     uint8_t plaintextblock[32], ciphertextblock[32];
morus1280128v1sse2.c:       |             ^~~~~~~~~~~~~~
morus1280128v1sse2.c: morus1280128v1sse2.c: In function 'crypto_aead_morus1280128v1_sse2_timingleaks_decrypt':
morus1280128v1sse2.c: morus1280128v1sse2.c:362:13: warning: unused variable 'check' [-Wunused-variable]
morus1280128v1sse2.c:   362 |     uint8_t check = 0;
morus1280128v1sse2.c:       |             ^~~~~
morus1280128v1sse2.c: ...

Number of similar (implementation,compiler) pairs: 4, namely:
ImplementationCompiler
T:sse2gcc -march=native -mtune=native -O2 -fwrapv -fPIC -fPIE -gdwarf-4 -Wall (11.4.0)
T:sse2gcc -march=native -mtune=native -O3 -fwrapv -fPIC -fPIE -gdwarf-4 -Wall (11.4.0)
T:sse2gcc -march=native -mtune=native -O -fwrapv -fPIC -fPIE -gdwarf-4 -Wall (11.4.0)
T:sse2gcc -march=native -mtune=native -Os -fwrapv -fPIC -fPIE -gdwarf-4 -Wall (11.4.0)

Namespace violations


morus1280128v1avx2.o morus_dec_aut_partialblock T
morus1280128v1avx2.o morus_enc_aut_partialblock T
morus1280128v1avx2.o morus_initialization T
morus1280128v1avx2.o morus_stateupdate T
morus1280128v1avx2.o morus_tag_generation T
morus1280128v1avx2.o morus_tag_verification T

Number of similar (implementation,compiler) pairs: 7, namely:
ImplementationCompiler
T:avx2clang -march=native -O2 -fwrapv -Qunused-arguments -fPIC -fPIE -gdwarf-4 -Wall (Ubuntu_Clang_14.0.0)
T:avx2clang -march=native -O3 -fwrapv -Qunused-arguments -fPIC -fPIE -gdwarf-4 -Wall (Ubuntu_Clang_14.0.0)
T:avx2clang -march=native -O -fwrapv -Qunused-arguments -fPIC -fPIE -gdwarf-4 -Wall (Ubuntu_Clang_14.0.0)
T:avx2clang -march=native -Os -fwrapv -Qunused-arguments -fPIC -fPIE -gdwarf-4 -Wall (Ubuntu_Clang_14.0.0)
T:avx2gcc -march=native -mtune=native -O2 -fwrapv -fPIC -fPIE -gdwarf-4 -Wall (11.4.0)
T:avx2gcc -march=native -mtune=native -O3 -fwrapv -fPIC -fPIE -gdwarf-4 -Wall (11.4.0)
T:avx2gcc -march=native -mtune=native -O -fwrapv -fPIC -fPIE -gdwarf-4 -Wall (11.4.0)

Namespace violations


encrypt.o morus_dec_aut_partialblock T
encrypt.o morus_enc_aut_partialblock T
encrypt.o morus_initialization T
encrypt.o morus_tag_generation T
encrypt.o morus_tag_verification T

Number of similar (implementation,compiler) pairs: 9, namely:
ImplementationCompiler
T:refclang -march=native -O2 -fwrapv -Qunused-arguments -fPIC -fPIE -gdwarf-4 -Wall (Ubuntu_Clang_14.0.0)
T:refclang -march=native -O3 -fwrapv -Qunused-arguments -fPIC -fPIE -gdwarf-4 -Wall (Ubuntu_Clang_14.0.0)
T:refclang -march=native -O -fwrapv -Qunused-arguments -fPIC -fPIE -gdwarf-4 -Wall (Ubuntu_Clang_14.0.0)
T:refclang -march=native -Os -fwrapv -Qunused-arguments -fPIC -fPIE -gdwarf-4 -Wall (Ubuntu_Clang_14.0.0)
T:refclang -mcpu=native -O3 -fwrapv -Qunused-arguments -fPIC -fPIE -gdwarf-4 -Wall (Ubuntu_Clang_14.0.0)
T:refgcc -march=native -mtune=native -O2 -fwrapv -fPIC -fPIE -gdwarf-4 -Wall (11.4.0)
T:refgcc -march=native -mtune=native -O3 -fwrapv -fPIC -fPIE -gdwarf-4 -Wall (11.4.0)
T:refgcc -march=native -mtune=native -O -fwrapv -fPIC -fPIE -gdwarf-4 -Wall (11.4.0)
T:refgcc -march=native -mtune=native -Os -fwrapv -fPIC -fPIE -gdwarf-4 -Wall (11.4.0)

Namespace violations


morus1280128v1opt64.o morus_dec_aut_partialblock T
morus1280128v1opt64.o morus_dec_aut_step T
morus1280128v1opt64.o morus_enc_aut_partialblock T
morus1280128v1opt64.o morus_enc_aut_step T
morus1280128v1opt64.o morus_initialization T
morus1280128v1opt64.o morus_stateupdate T
morus1280128v1opt64.o morus_tag_generation T
morus1280128v1opt64.o morus_tag_verification T

Number of similar (implementation,compiler) pairs: 9, namely:
ImplementationCompiler
T:ref64clang -march=native -O2 -fwrapv -Qunused-arguments -fPIC -fPIE -gdwarf-4 -Wall (Ubuntu_Clang_14.0.0)
T:ref64clang -march=native -O3 -fwrapv -Qunused-arguments -fPIC -fPIE -gdwarf-4 -Wall (Ubuntu_Clang_14.0.0)
T:ref64clang -march=native -O -fwrapv -Qunused-arguments -fPIC -fPIE -gdwarf-4 -Wall (Ubuntu_Clang_14.0.0)
T:ref64clang -march=native -Os -fwrapv -Qunused-arguments -fPIC -fPIE -gdwarf-4 -Wall (Ubuntu_Clang_14.0.0)
T:ref64clang -mcpu=native -O3 -fwrapv -Qunused-arguments -fPIC -fPIE -gdwarf-4 -Wall (Ubuntu_Clang_14.0.0)
T:ref64gcc -march=native -mtune=native -O2 -fwrapv -fPIC -fPIE -gdwarf-4 -Wall (11.4.0)
T:ref64gcc -march=native -mtune=native -O3 -fwrapv -fPIC -fPIE -gdwarf-4 -Wall (11.4.0)
T:ref64gcc -march=native -mtune=native -O -fwrapv -fPIC -fPIE -gdwarf-4 -Wall (11.4.0)
T:ref64gcc -march=native -mtune=native -Os -fwrapv -fPIC -fPIE -gdwarf-4 -Wall (11.4.0)