Implementation notes: amd64, kizomba, crypto_aead/aegis128

Computer: kizomba
Architecture: amd64
CPU ID: GenuineIntel-000906e9-bfebfbff
SUPERCOP version: 20220506
Operation: crypto_aead
Primitive: aegis128
TimeObject sizeTest sizeImplementationCompilerBenchmark dateSUPERCOP version
30992467 0 015279 768 856T:aesniclang_-march=native_-Os_-fomit-frame-pointer_-fwrapv_-Qunused-arguments_-fPIC_-fPIE2020081520200815
31573851 0 020529 776 872T:aesniclang_-march=native_-O3_-fomit-frame-pointer_-fwrapv_-Qunused-arguments_-fPIC_-fPIE2020081520200815
31653803 0 020465 776 872T:aesniclang_-march=native_-O2_-fomit-frame-pointer_-fwrapv_-Qunused-arguments_-fPIC_-fPIE2020081520200815
31693803 0 020465 776 872T:aesniclang_-march=native_-O_-fomit-frame-pointer_-fwrapv_-Qunused-arguments_-fPIC_-fPIE2020081520200815
32302495 0 016835 784 928T:aesnigcc_-march=native_-mtune=native_-O_-fomit-frame-pointer_-fwrapv_-fPIC_-fPIE2020081520200815
32622951 0 017323 784 928T:aesnigcc_-march=native_-mtune=native_-O2_-fomit-frame-pointer_-fwrapv_-fPIC_-fPIE2020081520200815
32684737 0 022508 792 928T:aesnigcc_-march=native_-mtune=native_-O3_-fomit-frame-pointer_-fwrapv_-fPIC_-fPIE2020081520200815
452624965 4096 020801 4880 856T:refclang_-mcpu=native_-O3_-fomit-frame-pointer_-fwrapv_-Qunused-arguments_-fPIC_-fPIE2020081520200815
456375159 4096 021905 4880 872T:refclang_-march=native_-O3_-fomit-frame-pointer_-fwrapv_-Qunused-arguments_-fPIC_-fPIE2020081520200815
456933735 4096 020449 4880 872T:refclang_-march=native_-O_-fomit-frame-pointer_-fwrapv_-Qunused-arguments_-fPIC_-fPIE2020081520200815
457053735 4096 020449 4880 872T:refclang_-march=native_-O2_-fomit-frame-pointer_-fwrapv_-Qunused-arguments_-fPIC_-fPIE2020081520200815
458013509 4096 016383 4872 856T:refclang_-march=native_-Os_-fomit-frame-pointer_-fwrapv_-Qunused-arguments_-fPIC_-fPIE2020081520200815
460764610 4096 022380 4896 928T:refgcc_-march=native_-mtune=native_-O3_-fomit-frame-pointer_-fwrapv_-fPIC_-fPIE2020081520200815
461644744 4096 019099 4888 928T:refgcc_-march=native_-mtune=native_-O2_-fomit-frame-pointer_-fwrapv_-fPIC_-fPIE2020081520200815
462524354 4096 018659 4888 928T:refgcc_-march=native_-mtune=native_-O_-fomit-frame-pointer_-fwrapv_-fPIC_-fPIE2020081520200815

Compiler output

Implementation: T:aesni
Security model: timingleaks
Compiler: clang -mcpu=native -O3 -fomit-frame-pointer -fwrapv -Qunused-arguments -fPIC -fPIE
encrypt.c: encrypt.c:34:25: error: always_inline function '_mm_aesenc_si128' requires target feature 'aes', but would be inlined into function 'aegis128_initialization' that is compiled without support for 'aes'
encrypt.c: state[4] = _mm_aesenc_si128(state[3], state[4]);
encrypt.c: ^
encrypt.c: encrypt.c:35:25: error: always_inline function '_mm_aesenc_si128' requires target feature 'aes', but would be inlined into function 'aegis128_initialization' that is compiled without support for 'aes'
encrypt.c: state[3] = _mm_aesenc_si128(state[2], state[3]);
encrypt.c: ^
encrypt.c: encrypt.c:36:25: error: always_inline function '_mm_aesenc_si128' requires target feature 'aes', but would be inlined into function 'aegis128_initialization' that is compiled without support for 'aes'
encrypt.c: state[2] = _mm_aesenc_si128(state[1], state[2]);
encrypt.c: ^
encrypt.c: encrypt.c:37:25: error: always_inline function '_mm_aesenc_si128' requires target feature 'aes', but would be inlined into function 'aegis128_initialization' that is compiled without support for 'aes'
encrypt.c: state[1] = _mm_aesenc_si128(state[0], state[1]);
encrypt.c: ^
encrypt.c: encrypt.c:38:25: error: always_inline function '_mm_aesenc_si128' requires target feature 'aes', but would be inlined into function 'aegis128_initialization' that is compiled without support for 'aes'
encrypt.c: state[0] = _mm_aesenc_si128(tmp, state[0]);
encrypt.c: ^
encrypt.c: 5 errors generated.

Number of similar (compiler,implementation) pairs: 1, namely:
CompilerImplementations
clang -mcpu=native -O3 -fomit-frame-pointer -fwrapv -Qunused-arguments -fPIC -fPIE T:aesni

Compiler output

Implementation: T:aesni
Security model: timingleaks
Compiler: gcc -march=native -mtune=native -Os -fomit-frame-pointer -fwrapv -fPIC -fPIE
try.c: crypto_aead_aegis128.a(encrypt.o): In function `crypto_aead_aegis128_aesni_timingleaks_encrypt':
try.c: encrypt.c:(.text+0x...): undefined reference to `aegis128_enc_aut_step'
try.c: encrypt.c:(.text+0x...): undefined reference to `aegis128_enc_aut_step'
try.c: encrypt.c:(.text+0x...): undefined reference to `aegis128_enc_aut_step'
try.c: encrypt.c:(.text+0x...): undefined reference to `aegis128_enc_aut_step'
try.c: crypto_aead_aegis128.a(encrypt.o): In function `crypto_aead_aegis128_aesni_timingleaks_decrypt':
try.c: encrypt.c:(.text+0x...): undefined reference to `aegis128_enc_aut_step'
try.c: crypto_aead_aegis128.a(encrypt.o):encrypt.c:(.text+0x...): more undefined references to `aegis128_enc_aut_step' follow
try.c: crypto_aead_aegis128.a(encrypt.o): In function `crypto_aead_aegis128_aesni_timingleaks_decrypt':
try.c: encrypt.c:(.text+0x...): undefined reference to `aegis128_dec_aut_step'
try.c: encrypt.c:(.text+0x...): undefined reference to `aegis128_dec_aut_step'
try.c: collect2: error: ld returned 1 exit status

Number of similar (compiler,implementation) pairs: 1, namely:
CompilerImplementations
gcc -march=native -mtune=native -Os -fomit-frame-pointer -fwrapv -fPIC -fPIE T:aesni

Compiler output

Implementation: T:ref
Security model: timingleaks
Compiler: gcc -march=native -mtune=native -Os -fomit-frame-pointer -fwrapv -fPIC -fPIE
try.c: crypto_aead_aegis128.a(encrypt.o): In function `crypto_aead_aegis128_ref_timingleaks_encrypt':
try.c: encrypt.c:(.text+0x...): undefined reference to `aegis128_enc_aut_step'
try.c: encrypt.c:(.text+0x...): undefined reference to `aegis128_enc_aut_step'
try.c: encrypt.c:(.text+0x...): undefined reference to `aegis128_enc_aut_step'
try.c: encrypt.c:(.text+0x...): undefined reference to `aegis128_enc_aut_step'
try.c: crypto_aead_aegis128.a(encrypt.o): In function `crypto_aead_aegis128_ref_timingleaks_decrypt':
try.c: encrypt.c:(.text+0x...): undefined reference to `aegis128_enc_aut_step'
try.c: crypto_aead_aegis128.a(encrypt.o):encrypt.c:(.text+0x...): more undefined references to `aegis128_enc_aut_step' follow
try.c: crypto_aead_aegis128.a(encrypt.o): In function `crypto_aead_aegis128_ref_timingleaks_decrypt':
try.c: encrypt.c:(.text+0x...): undefined reference to `aegis128_dec_aut_step'
try.c: encrypt.c:(.text+0x...): undefined reference to `aegis128_dec_aut_step'
try.c: collect2: error: ld returned 1 exit status

Number of similar (compiler,implementation) pairs: 1, namely:
CompilerImplementations
gcc -march=native -mtune=native -Os -fomit-frame-pointer -fwrapv -fPIC -fPIE T:ref

Namespace violations

Implementation: T:aesni
Security model: timingleaks
Compiler: clang -march=native -O2 -fomit-frame-pointer -fwrapv -Qunused-arguments -fPIC -fPIE
encrypt.o aegis128_initialization T
encrypt.o aegis128_tag_generation T

Number of similar (compiler,implementation) pairs: 7, namely:
CompilerImplementations
clang -march=native -O2 -fomit-frame-pointer -fwrapv -Qunused-arguments -fPIC -fPIE T:aesni
clang -march=native -O3 -fomit-frame-pointer -fwrapv -Qunused-arguments -fPIC -fPIE T:aesni
clang -march=native -O -fomit-frame-pointer -fwrapv -Qunused-arguments -fPIC -fPIE T:aesni
clang -march=native -Os -fomit-frame-pointer -fwrapv -Qunused-arguments -fPIC -fPIE T:aesni
gcc -march=native -mtune=native -O2 -fomit-frame-pointer -fwrapv -fPIC -fPIE T:aesni
gcc -march=native -mtune=native -O3 -fomit-frame-pointer -fwrapv -fPIC -fPIE T:aesni
gcc -march=native -mtune=native -O -fomit-frame-pointer -fwrapv -fPIC -fPIE T:aesni

Namespace violations

Implementation: T:ref
Security model: timingleaks
Compiler: clang -march=native -O2 -fomit-frame-pointer -fwrapv -Qunused-arguments -fPIC -fPIE
aes.o AESROUND T
aes.o TE0 D
aes.o TE1 D
aes.o TE2 D
aes.o TE3 D
encrypt.o aegis128_initialization T
encrypt.o aegis128_tag_generation T

Number of similar (compiler,implementation) pairs: 8, namely:
CompilerImplementations
clang -march=native -O2 -fomit-frame-pointer -fwrapv -Qunused-arguments -fPIC -fPIE T:ref
clang -march=native -O3 -fomit-frame-pointer -fwrapv -Qunused-arguments -fPIC -fPIE T:ref
clang -march=native -O -fomit-frame-pointer -fwrapv -Qunused-arguments -fPIC -fPIE T:ref
clang -march=native -Os -fomit-frame-pointer -fwrapv -Qunused-arguments -fPIC -fPIE T:ref
clang -mcpu=native -O3 -fomit-frame-pointer -fwrapv -Qunused-arguments -fPIC -fPIE T:ref
gcc -march=native -mtune=native -O2 -fomit-frame-pointer -fwrapv -fPIC -fPIE T:ref
gcc -march=native -mtune=native -O3 -fomit-frame-pointer -fwrapv -fPIC -fPIE T:ref
gcc -march=native -mtune=native -O -fomit-frame-pointer -fwrapv -fPIC -fPIE T:ref