Test results for amd64, jasper3, crypto_aead/omdsha256k256n248tau256v2
[Page version: 20250321 02:58:08]
Measurements for amd64, jasper3, crypto_aead
Test results for amd64, jasper3, crypto_aead
Test results for crypto_aead/omdsha256k256n248tau256v2
Computer: jasper3
Microarchitecture: amd64; Tremont (906c0)
Architecture: amd64
CPU ID: GenuineIntel-000906c0-20-bfebfbff
SUPERCOP version: 20250307
Operation: crypto_aead
Primitive: omdsha256k256n248tau256v2
Time | Object size | Test size | Implementation | Compiler | Benchmark date | SUPERCOP version |
265934 | 23180 0 0 | 45320 780 1080 | T:ref | gcc -march=native -mtune=native -O3 -fwrapv -fPIC -fPIE -gdwarf-4 -Wall | 20250310 | 20250307 |
282004 | 10386 0 0 | 31776 812 1016 | T:ref | clang -march=native -O2 -fwrapv -Qunused-arguments -fPIC -fPIE -gdwarf-4 -Wall | 20250310 | 20250307 |
288908 | 8360 0 0 | 32160 812 1016 | T:ref | clang -march=native -O3 -fwrapv -Qunused-arguments -fPIC -fPIE -gdwarf-4 -Wall | 20250310 | 20250307 |
302000 | 8770 0 0 | 31192 812 1016 | T:ref | clang -mcpu=native -O3 -fwrapv -Qunused-arguments -fPIC -fPIE -gdwarf-4 -Wall | 20250310 | 20250307 |
305735 | 4774 0 0 | 24374 804 1016 | T:ref | clang -march=native -Os -fwrapv -Qunused-arguments -fPIC -fPIE -gdwarf-4 -Wall | 20250310 | 20250307 |
308583 | 6884 0 0 | 27880 780 1080 | T:ref | gcc -march=native -mtune=native -O2 -fwrapv -fPIC -fPIE -gdwarf-4 -Wall | 20250310 | 20250307 |
309679 | 6129 0 0 | 26559 772 1080 | T:ref | gcc -march=native -mtune=native -O -fwrapv -fPIC -fPIE -gdwarf-4 -Wall | 20250310 | 20250307 |
320807 | 4487 0 0 | 24534 804 1016 | T:ref | clang -march=native -O -fwrapv -Qunused-arguments -fPIC -fPIE -gdwarf-4 -Wall | 20250310 | 20250307 |
334977 | 4078 0 0 | 22947 756 1048 | T:ref | gcc -march=native -mtune=native -Os -fwrapv -fPIC -fPIE -gdwarf-4 -Wall | 20250310 | 20250307 |
Compiler output
try.c: /usr/bin/ld: libcrypto_aead_omdsha256k256n248tau256v2.a(omdsha256.o):.../supercop-data/jasper3/amd64/try/c/clang_-march=native_-O2_-fwrapv_-Qunused-arguments_-fPIC_-fPIE_-gdwarf-4_-Wall/timingleaks/crypto_aead/omdsha256k256n248tau256v2/avx1/work/./omdsha256.h:41: multiple definition of `Hash'; libcrypto_aead_omdsha256k256n248tau256v2.a(encrypt.o):.../supercop-data/jasper3/amd64/try/c/clang_-march=native_-O2_-fwrapv_-Qunused-arguments_-fPIC_-fPIE_-gdwarf-4_-Wall/timingleaks/crypto_aead/omdsha256k256n248tau256v2/avx1/work/./omdsha256.h:41: first defined here
try.c: clang: error: linker command failed with exit code 1 (use -v to see invocation)
Number of similar (implementation,compiler) pairs: 1, namely:
Implementation | Compiler |
T:avx1 | clang -march=native -O2 -fwrapv -Qunused-arguments -fPIC -fPIE -gdwarf-4 -Wall (Debian_Clang_11.0.1) |
Compiler output
try.c: /usr/bin/ld: libcrypto_aead_omdsha256k256n248tau256v2.a(omdsha256.o):.../supercop-data/jasper3/amd64/try/c/clang_-march=native_-O3_-fwrapv_-Qunused-arguments_-fPIC_-fPIE_-gdwarf-4_-Wall/timingleaks/crypto_aead/omdsha256k256n248tau256v2/avx1/work/./omdsha256.h:41: multiple definition of `Hash'; libcrypto_aead_omdsha256k256n248tau256v2.a(encrypt.o):.../supercop-data/jasper3/amd64/try/c/clang_-march=native_-O3_-fwrapv_-Qunused-arguments_-fPIC_-fPIE_-gdwarf-4_-Wall/timingleaks/crypto_aead/omdsha256k256n248tau256v2/avx1/work/./omdsha256.h:41: first defined here
try.c: clang: error: linker command failed with exit code 1 (use -v to see invocation)
Number of similar (implementation,compiler) pairs: 1, namely:
Implementation | Compiler |
T:avx1 | clang -march=native -O3 -fwrapv -Qunused-arguments -fPIC -fPIE -gdwarf-4 -Wall (Debian_Clang_11.0.1) |
Compiler output
try.c: /usr/bin/ld: libcrypto_aead_omdsha256k256n248tau256v2.a(omdsha256.o):.../supercop-data/jasper3/amd64/try/c/clang_-march=native_-O_-fwrapv_-Qunused-arguments_-fPIC_-fPIE_-gdwarf-4_-Wall/timingleaks/crypto_aead/omdsha256k256n248tau256v2/avx1/work/./omdsha256.h:41: multiple definition of `Hash'; libcrypto_aead_omdsha256k256n248tau256v2.a(encrypt.o):.../supercop-data/jasper3/amd64/try/c/clang_-march=native_-O_-fwrapv_-Qunused-arguments_-fPIC_-fPIE_-gdwarf-4_-Wall/timingleaks/crypto_aead/omdsha256k256n248tau256v2/avx1/work/./omdsha256.h:41: first defined here
try.c: clang: error: linker command failed with exit code 1 (use -v to see invocation)
Number of similar (implementation,compiler) pairs: 1, namely:
Implementation | Compiler |
T:avx1 | clang -march=native -O -fwrapv -Qunused-arguments -fPIC -fPIE -gdwarf-4 -Wall (Debian_Clang_11.0.1) |
Compiler output
try.c: /usr/bin/ld: libcrypto_aead_omdsha256k256n248tau256v2.a(omdsha256.o):.../supercop-data/jasper3/amd64/try/c/clang_-march=native_-Os_-fwrapv_-Qunused-arguments_-fPIC_-fPIE_-gdwarf-4_-Wall/timingleaks/crypto_aead/omdsha256k256n248tau256v2/avx1/work/./omdsha256.h:41: multiple definition of `Hash'; libcrypto_aead_omdsha256k256n248tau256v2.a(encrypt.o):.../supercop-data/jasper3/amd64/try/c/clang_-march=native_-Os_-fwrapv_-Qunused-arguments_-fPIC_-fPIE_-gdwarf-4_-Wall/timingleaks/crypto_aead/omdsha256k256n248tau256v2/avx1/work/./omdsha256.h:41: first defined here
try.c: clang: error: linker command failed with exit code 1 (use -v to see invocation)
Number of similar (implementation,compiler) pairs: 1, namely:
Implementation | Compiler |
T:avx1 | clang -march=native -Os -fwrapv -Qunused-arguments -fPIC -fPIE -gdwarf-4 -Wall (Debian_Clang_11.0.1) |
Compiler output
try.c: /usr/bin/ld: libcrypto_aead_omdsha256k256n248tau256v2.a(omdsha256.o):.../supercop-data/jasper3/amd64/try/c/clang_-mcpu=native_-O3_-fwrapv_-Qunused-arguments_-fPIC_-fPIE_-gdwarf-4_-Wall/timingleaks/crypto_aead/omdsha256k256n248tau256v2/avx1/work/./omdsha256.h:41: multiple definition of `Hash'; libcrypto_aead_omdsha256k256n248tau256v2.a(encrypt.o):.../supercop-data/jasper3/amd64/try/c/clang_-mcpu=native_-O3_-fwrapv_-Qunused-arguments_-fPIC_-fPIE_-gdwarf-4_-Wall/timingleaks/crypto_aead/omdsha256k256n248tau256v2/avx1/work/./omdsha256.h:41: first defined here
try.c: clang: error: linker command failed with exit code 1 (use -v to see invocation)
Number of similar (implementation,compiler) pairs: 1, namely:
Implementation | Compiler |
T:avx1 | clang -mcpu=native -O3 -fwrapv -Qunused-arguments -fPIC -fPIE -gdwarf-4 -Wall (Debian_Clang_11.0.1) |
Compiler output
try.c: /usr/bin/ld: libcrypto_aead_omdsha256k256n248tau256v2.a(omdsha256.o):.../supercop-data/jasper3/amd64/try/c/gcc_-march=native_-mtune=native_-O2_-fwrapv_-fPIC_-fPIE_-gdwarf-4_-Wall/timingleaks/crypto_aead/omdsha256k256n248tau256v2/avx1/work/omdsha256.h:41: multiple definition of `Hash'; libcrypto_aead_omdsha256k256n248tau256v2.a(encrypt.o):.../supercop-data/jasper3/amd64/try/c/gcc_-march=native_-mtune=native_-O2_-fwrapv_-fPIC_-fPIE_-gdwarf-4_-Wall/timingleaks/crypto_aead/omdsha256k256n248tau256v2/avx1/work/omdsha256.h:41: first defined here
try.c: collect2: error: ld returned 1 exit status
Number of similar (implementation,compiler) pairs: 1, namely:
Implementation | Compiler |
T:avx1 | gcc -march=native -mtune=native -O2 -fwrapv -fPIC -fPIE -gdwarf-4 -Wall (10.2.1_20210110) |
Compiler output
try.c: /usr/bin/ld: libcrypto_aead_omdsha256k256n248tau256v2.a(omdsha256.o):.../supercop-data/jasper3/amd64/try/c/gcc_-march=native_-mtune=native_-O3_-fwrapv_-fPIC_-fPIE_-gdwarf-4_-Wall/timingleaks/crypto_aead/omdsha256k256n248tau256v2/avx1/work/omdsha256.h:41: multiple definition of `Hash'; libcrypto_aead_omdsha256k256n248tau256v2.a(encrypt.o):.../supercop-data/jasper3/amd64/try/c/gcc_-march=native_-mtune=native_-O3_-fwrapv_-fPIC_-fPIE_-gdwarf-4_-Wall/timingleaks/crypto_aead/omdsha256k256n248tau256v2/avx1/work/omdsha256.h:41: first defined here
try.c: collect2: error: ld returned 1 exit status
Number of similar (implementation,compiler) pairs: 1, namely:
Implementation | Compiler |
T:avx1 | gcc -march=native -mtune=native -O3 -fwrapv -fPIC -fPIE -gdwarf-4 -Wall (10.2.1_20210110) |
Compiler output
try.c: /usr/bin/ld: libcrypto_aead_omdsha256k256n248tau256v2.a(omdsha256.o):.../supercop-data/jasper3/amd64/try/c/gcc_-march=native_-mtune=native_-O_-fwrapv_-fPIC_-fPIE_-gdwarf-4_-Wall/timingleaks/crypto_aead/omdsha256k256n248tau256v2/avx1/work/omdsha256.h:41: multiple definition of `Hash'; libcrypto_aead_omdsha256k256n248tau256v2.a(encrypt.o):.../supercop-data/jasper3/amd64/try/c/gcc_-march=native_-mtune=native_-O_-fwrapv_-fPIC_-fPIE_-gdwarf-4_-Wall/timingleaks/crypto_aead/omdsha256k256n248tau256v2/avx1/work/omdsha256.h:41: first defined here
try.c: collect2: error: ld returned 1 exit status
Number of similar (implementation,compiler) pairs: 1, namely:
Implementation | Compiler |
T:avx1 | gcc -march=native -mtune=native -O -fwrapv -fPIC -fPIE -gdwarf-4 -Wall (10.2.1_20210110) |
Compiler output
try.c: /usr/bin/ld: libcrypto_aead_omdsha256k256n248tau256v2.a(omdsha256.o):.../supercop-data/jasper3/amd64/try/c/gcc_-march=native_-mtune=native_-Os_-fwrapv_-fPIC_-fPIE_-gdwarf-4_-Wall/timingleaks/crypto_aead/omdsha256k256n248tau256v2/avx1/work/omdsha256.h:41: multiple definition of `Hash'; libcrypto_aead_omdsha256k256n248tau256v2.a(encrypt.o):.../supercop-data/jasper3/amd64/try/c/gcc_-march=native_-mtune=native_-Os_-fwrapv_-fPIC_-fPIE_-gdwarf-4_-Wall/timingleaks/crypto_aead/omdsha256k256n248tau256v2/avx1/work/omdsha256.h:41: first defined here
try.c: collect2: error: ld returned 1 exit status
Number of similar (implementation,compiler) pairs: 1, namely:
Implementation | Compiler |
T:avx1 | gcc -march=native -mtune=native -Os -fwrapv -fPIC -fPIE -gdwarf-4 -Wall (10.2.1_20210110) |
Compiler output
try.c: /usr/bin/ld: libcrypto_aead_omdsha256k256n248tau256v2.a(omdsha256.o):.../supercop-data/jasper3/amd64/try/c/clang_-march=native_-O2_-fwrapv_-Qunused-arguments_-fPIC_-fPIE_-gdwarf-4_-Wall/timingleaks/crypto_aead/omdsha256k256n248tau256v2/sse4/work/./omdsha256.h:41: multiple definition of `Hash'; libcrypto_aead_omdsha256k256n248tau256v2.a(encrypt.o):.../supercop-data/jasper3/amd64/try/c/clang_-march=native_-O2_-fwrapv_-Qunused-arguments_-fPIC_-fPIE_-gdwarf-4_-Wall/timingleaks/crypto_aead/omdsha256k256n248tau256v2/sse4/work/./omdsha256.h:41: first defined here
try.c: clang: error: linker command failed with exit code 1 (use -v to see invocation)
Number of similar (implementation,compiler) pairs: 1, namely:
Implementation | Compiler |
T:sse4 | clang -march=native -O2 -fwrapv -Qunused-arguments -fPIC -fPIE -gdwarf-4 -Wall (Debian_Clang_11.0.1) |
Compiler output
try.c: /usr/bin/ld: libcrypto_aead_omdsha256k256n248tau256v2.a(omdsha256.o):.../supercop-data/jasper3/amd64/try/c/clang_-march=native_-O3_-fwrapv_-Qunused-arguments_-fPIC_-fPIE_-gdwarf-4_-Wall/timingleaks/crypto_aead/omdsha256k256n248tau256v2/sse4/work/./omdsha256.h:41: multiple definition of `Hash'; libcrypto_aead_omdsha256k256n248tau256v2.a(encrypt.o):.../supercop-data/jasper3/amd64/try/c/clang_-march=native_-O3_-fwrapv_-Qunused-arguments_-fPIC_-fPIE_-gdwarf-4_-Wall/timingleaks/crypto_aead/omdsha256k256n248tau256v2/sse4/work/./omdsha256.h:41: first defined here
try.c: clang: error: linker command failed with exit code 1 (use -v to see invocation)
Number of similar (implementation,compiler) pairs: 1, namely:
Implementation | Compiler |
T:sse4 | clang -march=native -O3 -fwrapv -Qunused-arguments -fPIC -fPIE -gdwarf-4 -Wall (Debian_Clang_11.0.1) |
Compiler output
try.c: /usr/bin/ld: libcrypto_aead_omdsha256k256n248tau256v2.a(omdsha256.o):.../supercop-data/jasper3/amd64/try/c/clang_-march=native_-O_-fwrapv_-Qunused-arguments_-fPIC_-fPIE_-gdwarf-4_-Wall/timingleaks/crypto_aead/omdsha256k256n248tau256v2/sse4/work/./omdsha256.h:41: multiple definition of `Hash'; libcrypto_aead_omdsha256k256n248tau256v2.a(encrypt.o):.../supercop-data/jasper3/amd64/try/c/clang_-march=native_-O_-fwrapv_-Qunused-arguments_-fPIC_-fPIE_-gdwarf-4_-Wall/timingleaks/crypto_aead/omdsha256k256n248tau256v2/sse4/work/./omdsha256.h:41: first defined here
try.c: clang: error: linker command failed with exit code 1 (use -v to see invocation)
Number of similar (implementation,compiler) pairs: 1, namely:
Implementation | Compiler |
T:sse4 | clang -march=native -O -fwrapv -Qunused-arguments -fPIC -fPIE -gdwarf-4 -Wall (Debian_Clang_11.0.1) |
Compiler output
try.c: /usr/bin/ld: libcrypto_aead_omdsha256k256n248tau256v2.a(omdsha256.o):.../supercop-data/jasper3/amd64/try/c/clang_-march=native_-Os_-fwrapv_-Qunused-arguments_-fPIC_-fPIE_-gdwarf-4_-Wall/timingleaks/crypto_aead/omdsha256k256n248tau256v2/sse4/work/./omdsha256.h:41: multiple definition of `Hash'; libcrypto_aead_omdsha256k256n248tau256v2.a(encrypt.o):.../supercop-data/jasper3/amd64/try/c/clang_-march=native_-Os_-fwrapv_-Qunused-arguments_-fPIC_-fPIE_-gdwarf-4_-Wall/timingleaks/crypto_aead/omdsha256k256n248tau256v2/sse4/work/./omdsha256.h:41: first defined here
try.c: clang: error: linker command failed with exit code 1 (use -v to see invocation)
Number of similar (implementation,compiler) pairs: 1, namely:
Implementation | Compiler |
T:sse4 | clang -march=native -Os -fwrapv -Qunused-arguments -fPIC -fPIE -gdwarf-4 -Wall (Debian_Clang_11.0.1) |
Compiler output
try.c: /usr/bin/ld: libcrypto_aead_omdsha256k256n248tau256v2.a(omdsha256.o):.../supercop-data/jasper3/amd64/try/c/clang_-mcpu=native_-O3_-fwrapv_-Qunused-arguments_-fPIC_-fPIE_-gdwarf-4_-Wall/timingleaks/crypto_aead/omdsha256k256n248tau256v2/sse4/work/./omdsha256.h:41: multiple definition of `Hash'; libcrypto_aead_omdsha256k256n248tau256v2.a(encrypt.o):.../supercop-data/jasper3/amd64/try/c/clang_-mcpu=native_-O3_-fwrapv_-Qunused-arguments_-fPIC_-fPIE_-gdwarf-4_-Wall/timingleaks/crypto_aead/omdsha256k256n248tau256v2/sse4/work/./omdsha256.h:41: first defined here
try.c: clang: error: linker command failed with exit code 1 (use -v to see invocation)
Number of similar (implementation,compiler) pairs: 1, namely:
Implementation | Compiler |
T:sse4 | clang -mcpu=native -O3 -fwrapv -Qunused-arguments -fPIC -fPIE -gdwarf-4 -Wall (Debian_Clang_11.0.1) |
Compiler output
try.c: /usr/bin/ld: libcrypto_aead_omdsha256k256n248tau256v2.a(omdsha256.o):.../supercop-data/jasper3/amd64/try/c/gcc_-march=native_-mtune=native_-O2_-fwrapv_-fPIC_-fPIE_-gdwarf-4_-Wall/timingleaks/crypto_aead/omdsha256k256n248tau256v2/sse4/work/omdsha256.h:41: multiple definition of `Hash'; libcrypto_aead_omdsha256k256n248tau256v2.a(encrypt.o):.../supercop-data/jasper3/amd64/try/c/gcc_-march=native_-mtune=native_-O2_-fwrapv_-fPIC_-fPIE_-gdwarf-4_-Wall/timingleaks/crypto_aead/omdsha256k256n248tau256v2/sse4/work/omdsha256.h:41: first defined here
try.c: collect2: error: ld returned 1 exit status
Number of similar (implementation,compiler) pairs: 1, namely:
Implementation | Compiler |
T:sse4 | gcc -march=native -mtune=native -O2 -fwrapv -fPIC -fPIE -gdwarf-4 -Wall (10.2.1_20210110) |
Compiler output
try.c: /usr/bin/ld: libcrypto_aead_omdsha256k256n248tau256v2.a(omdsha256.o):.../supercop-data/jasper3/amd64/try/c/gcc_-march=native_-mtune=native_-O3_-fwrapv_-fPIC_-fPIE_-gdwarf-4_-Wall/timingleaks/crypto_aead/omdsha256k256n248tau256v2/sse4/work/omdsha256.h:41: multiple definition of `Hash'; libcrypto_aead_omdsha256k256n248tau256v2.a(encrypt.o):.../supercop-data/jasper3/amd64/try/c/gcc_-march=native_-mtune=native_-O3_-fwrapv_-fPIC_-fPIE_-gdwarf-4_-Wall/timingleaks/crypto_aead/omdsha256k256n248tau256v2/sse4/work/omdsha256.h:41: first defined here
try.c: collect2: error: ld returned 1 exit status
Number of similar (implementation,compiler) pairs: 1, namely:
Implementation | Compiler |
T:sse4 | gcc -march=native -mtune=native -O3 -fwrapv -fPIC -fPIE -gdwarf-4 -Wall (10.2.1_20210110) |
Compiler output
try.c: /usr/bin/ld: libcrypto_aead_omdsha256k256n248tau256v2.a(omdsha256.o):.../supercop-data/jasper3/amd64/try/c/gcc_-march=native_-mtune=native_-O_-fwrapv_-fPIC_-fPIE_-gdwarf-4_-Wall/timingleaks/crypto_aead/omdsha256k256n248tau256v2/sse4/work/omdsha256.h:41: multiple definition of `Hash'; libcrypto_aead_omdsha256k256n248tau256v2.a(encrypt.o):.../supercop-data/jasper3/amd64/try/c/gcc_-march=native_-mtune=native_-O_-fwrapv_-fPIC_-fPIE_-gdwarf-4_-Wall/timingleaks/crypto_aead/omdsha256k256n248tau256v2/sse4/work/omdsha256.h:41: first defined here
try.c: collect2: error: ld returned 1 exit status
Number of similar (implementation,compiler) pairs: 1, namely:
Implementation | Compiler |
T:sse4 | gcc -march=native -mtune=native -O -fwrapv -fPIC -fPIE -gdwarf-4 -Wall (10.2.1_20210110) |
Compiler output
try.c: /usr/bin/ld: libcrypto_aead_omdsha256k256n248tau256v2.a(omdsha256.o):.../supercop-data/jasper3/amd64/try/c/gcc_-march=native_-mtune=native_-Os_-fwrapv_-fPIC_-fPIE_-gdwarf-4_-Wall/timingleaks/crypto_aead/omdsha256k256n248tau256v2/sse4/work/omdsha256.h:41: multiple definition of `Hash'; libcrypto_aead_omdsha256k256n248tau256v2.a(encrypt.o):.../supercop-data/jasper3/amd64/try/c/gcc_-march=native_-mtune=native_-Os_-fwrapv_-fPIC_-fPIE_-gdwarf-4_-Wall/timingleaks/crypto_aead/omdsha256k256n248tau256v2/sse4/work/omdsha256.h:41: first defined here
try.c: collect2: error: ld returned 1 exit status
Number of similar (implementation,compiler) pairs: 1, namely:
Implementation | Compiler |
T:sse4 | gcc -march=native -mtune=native -Os -fwrapv -fPIC -fPIE -gdwarf-4 -Wall (10.2.1_20210110) |
Namespace violations
omdsha256.o calc_L_i T
omdsha256.o double_block T
omdsha256.o final_masking_associated_data T
omdsha256.o final_masking_message T
omdsha256.o hash T
omdsha256.o increment_masking_associated_data T
omdsha256.o increment_masking_message T
omdsha256.o key_func T
omdsha256.o l2b T
omdsha256.o ntz T
omdsha256.o omdsha256_process T
omdsha256.o triple_block T
omdsha256.o xor_block T
sha256.o sha256_comp T
Number of similar (implementation,compiler) pairs: 9, namely:
Implementation | Compiler |
T:ref | clang -march=native -O2 -fwrapv -Qunused-arguments -fPIC -fPIE -gdwarf-4 -Wall (Debian_Clang_11.0.1) |
T:ref | clang -march=native -O3 -fwrapv -Qunused-arguments -fPIC -fPIE -gdwarf-4 -Wall (Debian_Clang_11.0.1) |
T:ref | clang -march=native -O -fwrapv -Qunused-arguments -fPIC -fPIE -gdwarf-4 -Wall (Debian_Clang_11.0.1) |
T:ref | clang -march=native -Os -fwrapv -Qunused-arguments -fPIC -fPIE -gdwarf-4 -Wall (Debian_Clang_11.0.1) |
T:ref | clang -mcpu=native -O3 -fwrapv -Qunused-arguments -fPIC -fPIE -gdwarf-4 -Wall (Debian_Clang_11.0.1) |
T:ref | gcc -march=native -mtune=native -O2 -fwrapv -fPIC -fPIE -gdwarf-4 -Wall (10.2.1_20210110) |
T:ref | gcc -march=native -mtune=native -O3 -fwrapv -fPIC -fPIE -gdwarf-4 -Wall (10.2.1_20210110) |
T:ref | gcc -march=native -mtune=native -O -fwrapv -fPIC -fPIE -gdwarf-4 -Wall (10.2.1_20210110) |
T:ref | gcc -march=native -mtune=native -Os -fwrapv -fPIC -fPIE -gdwarf-4 -Wall (10.2.1_20210110) |