Implementation notes: amd64, jasper3, crypto_aead/ascon128av12

Computer: jasper3
Microarchitecture: amd64; Tremont (906c0)
Architecture: amd64
CPU ID: GenuineIntel-000906c0-20-bfebfbff
SUPERCOP version: 20231107
Operation: crypto_aead
Primitive: ascon128av12
TimeObject sizeTest sizeImplementationCompilerBenchmark dateSUPERCOP version
6557617338 0 030742 804 1016opt64clang_-march=native_-Os_-fomit-frame-pointer_-fwrapv_-Qunused-arguments_-fPIC_-fPIE2023053020230530
6577717399 0 032680 812 1016opt64clang_-march=native_-O2_-fomit-frame-pointer_-fwrapv_-Qunused-arguments_-fPIC_-fPIE2023053020230530
6591917482 0 033752 812 1016opt64clang_-mcpu=native_-O3_-fomit-frame-pointer_-fwrapv_-Qunused-arguments_-fPIC_-fPIE2023053020230530
6608217399 0 034984 812 1016opt64clang_-march=native_-O3_-fomit-frame-pointer_-fwrapv_-Qunused-arguments_-fPIC_-fPIE2023053020230530
6703117469 0 031422 804 1016opt64clang_-march=native_-O_-fomit-frame-pointer_-fwrapv_-Qunused-arguments_-fPIC_-fPIE2023053020230530
6826218716 0 033176 780 1080opt64gcc_-march=native_-mtune=native_-O2_-fomit-frame-pointer_-fwrapv_-fPIC_-fPIE2023053020230530
6922818732 0 034376 780 1080opt64gcc_-march=native_-mtune=native_-O3_-fomit-frame-pointer_-fwrapv_-fPIC_-fPIE2023053020230530
6961618598 0 031451 756 1048opt64gcc_-march=native_-mtune=native_-Os_-fomit-frame-pointer_-fwrapv_-fPIC_-fPIE2023053020230530
6967525515 0 040600 812 1016refclang_-march=native_-O2_-fomit-frame-pointer_-fwrapv_-Qunused-arguments_-fPIC_-fPIE2023053020230530
7016825595 0 042984 812 1016refclang_-march=native_-O3_-fomit-frame-pointer_-fwrapv_-Qunused-arguments_-fPIC_-fPIE2023053020230530
7036328267 0 044168 812 1016refclang_-mcpu=native_-O3_-fomit-frame-pointer_-fwrapv_-Qunused-arguments_-fPIC_-fPIE2023053020230530
7683614713 0 030368 780 1080refgcc_-march=native_-mtune=native_-O3_-fomit-frame-pointer_-fwrapv_-fPIC_-fPIE2023053020230530
774281867 0 019440 812 1016opt64_lowsizeclang_-march=native_-O3_-fomit-frame-pointer_-fwrapv_-Qunused-arguments_-fPIC_-fPIE2023053020230530
775051844 0 018088 812 1016opt64_lowsizeclang_-mcpu=native_-O3_-fomit-frame-pointer_-fwrapv_-Qunused-arguments_-fPIC_-fPIE2023053020230530
778621702 0 016976 812 1016opt64_lowsizeclang_-march=native_-O2_-fomit-frame-pointer_-fwrapv_-Qunused-arguments_-fPIC_-fPIE2023053020230530
779011524 0 014910 804 1016opt64_lowsizeclang_-march=native_-Os_-fomit-frame-pointer_-fwrapv_-Qunused-arguments_-fPIC_-fPIE2023053020230530
791161464 0 015390 804 1016opt64_lowsizeclang_-march=native_-O_-fomit-frame-pointer_-fwrapv_-Qunused-arguments_-fPIC_-fPIE2023053020230530
811532117 0 017776 780 1080opt64_lowsizegcc_-march=native_-mtune=native_-O3_-fomit-frame-pointer_-fwrapv_-fPIC_-fPIE2023053020230530
817911480 0 014291 756 1048opt64_lowsizegcc_-march=native_-mtune=native_-Os_-fomit-frame-pointer_-fwrapv_-fPIC_-fPIE2023053020230530
8214622596 0 036631 772 1080opt64gcc_-march=native_-mtune=native_-O_-fomit-frame-pointer_-fwrapv_-fPIC_-fPIE2023053020230530
830611712 0 016184 780 1080opt64_lowsizegcc_-march=native_-mtune=native_-O2_-fomit-frame-pointer_-fwrapv_-fPIC_-fPIE2023053020230530
8418722648 0 035499 756 1048opt32gcc_-march=native_-mtune=native_-Os_-fomit-frame-pointer_-fwrapv_-fPIC_-fPIE2023053020230530
8512323084 0 038728 780 1080opt32gcc_-march=native_-mtune=native_-O3_-fomit-frame-pointer_-fwrapv_-fPIC_-fPIE2023053020230530
8552423020 0 037480 780 1080opt32gcc_-march=native_-mtune=native_-O2_-fomit-frame-pointer_-fwrapv_-fPIC_-fPIE2023053020230530
8643822815 0 039080 812 1016opt32clang_-mcpu=native_-O3_-fomit-frame-pointer_-fwrapv_-Qunused-arguments_-fPIC_-fPIE2023053020230530
8657222908 0 040504 812 1016opt32clang_-march=native_-O3_-fomit-frame-pointer_-fwrapv_-Qunused-arguments_-fPIC_-fPIE2023053020230530
8702222829 0 036246 804 1016opt32clang_-march=native_-Os_-fomit-frame-pointer_-fwrapv_-Qunused-arguments_-fPIC_-fPIE2023053020230530
8787822891 0 038184 812 1016opt32clang_-march=native_-O2_-fomit-frame-pointer_-fwrapv_-Qunused-arguments_-fPIC_-fPIE2023053020230530
9101823253 0 037198 804 1016opt32clang_-march=native_-O_-fomit-frame-pointer_-fwrapv_-Qunused-arguments_-fPIC_-fPIE2023053020230530
920231735 0 017024 812 1016opt32_lowsizeclang_-march=native_-O2_-fomit-frame-pointer_-fwrapv_-Qunused-arguments_-fPIC_-fPIE2023053020230530
920241900 0 019488 812 1016opt32_lowsizeclang_-march=native_-O3_-fomit-frame-pointer_-fwrapv_-Qunused-arguments_-fPIC_-fPIE2023053020230530
920451553 0 014926 804 1016opt32_lowsizeclang_-march=native_-Os_-fomit-frame-pointer_-fwrapv_-Qunused-arguments_-fPIC_-fPIE2023053020230530
920591897 0 018152 812 1016opt32_lowsizeclang_-mcpu=native_-O3_-fomit-frame-pointer_-fwrapv_-Qunused-arguments_-fPIC_-fPIE2023053020230530
925141497 0 015438 804 1016opt32_lowsizeclang_-march=native_-O_-fomit-frame-pointer_-fwrapv_-Qunused-arguments_-fPIC_-fPIE2023053020230530
9519513765 0 027807 772 1080refgcc_-march=native_-mtune=native_-O_-fomit-frame-pointer_-fwrapv_-fPIC_-fPIE2023053020230530
961822177 0 017832 780 1080opt32_lowsizegcc_-march=native_-mtune=native_-O3_-fomit-frame-pointer_-fwrapv_-fPIC_-fPIE2023053020230530
9693813957 0 028432 780 1080refgcc_-march=native_-mtune=native_-O2_-fomit-frame-pointer_-fwrapv_-fPIC_-fPIE2023053020230530
9700320730 0 034054 804 1016refclang_-march=native_-Os_-fomit-frame-pointer_-fwrapv_-Qunused-arguments_-fPIC_-fPIE2023053020230530
970101543 0 014347 756 1048opt32_lowsizegcc_-march=native_-mtune=native_-Os_-fomit-frame-pointer_-fwrapv_-fPIC_-fPIE2023053020230530
973192745 0 016751 772 1080opt64_lowsizegcc_-march=native_-mtune=native_-O_-fomit-frame-pointer_-fwrapv_-fPIC_-fPIE2023053020230530
976451772 0 016240 780 1080opt32_lowsizegcc_-march=native_-mtune=native_-O2_-fomit-frame-pointer_-fwrapv_-fPIC_-fPIE2023053020230530
9849927513 0 041543 772 1080opt32gcc_-march=native_-mtune=native_-O_-fomit-frame-pointer_-fwrapv_-fPIC_-fPIE2023053020230530
1117392807 0 016823 772 1080opt32_lowsizegcc_-march=native_-mtune=native_-O_-fomit-frame-pointer_-fwrapv_-fPIC_-fPIE2023053020230530
1277032586 0 015491 756 1048refgcc_-march=native_-mtune=native_-Os_-fomit-frame-pointer_-fwrapv_-fPIC_-fPIE2023053020230530
20269117771 0 032224 780 1080bi32gcc_-march=native_-mtune=native_-O2_-fomit-frame-pointer_-fwrapv_-fPIC_-fPIE2023053020230530
20282917803 0 033432 780 1080bi32gcc_-march=native_-mtune=native_-O3_-fomit-frame-pointer_-fwrapv_-fPIC_-fPIE2023053020230530
20416517478 0 030315 756 1048bi32gcc_-march=native_-mtune=native_-Os_-fomit-frame-pointer_-fwrapv_-fPIC_-fPIE2023053020230530
2082262961 0 016966 804 1016refclang_-march=native_-O_-fomit-frame-pointer_-fwrapv_-Qunused-arguments_-fPIC_-fPIE2023053020230530
21330511074 0 026800 780 1080bi32_lowreggcc_-march=native_-mtune=native_-O3_-fomit-frame-pointer_-fwrapv_-fPIC_-fPIE2023053020230530
21377911074 0 025632 780 1080bi32_lowreggcc_-march=native_-mtune=native_-O2_-fomit-frame-pointer_-fwrapv_-fPIC_-fPIE2023053020230530
21415918921 0 036480 812 1016bi32clang_-march=native_-O3_-fomit-frame-pointer_-fwrapv_-Qunused-arguments_-fPIC_-fPIE2023053020230530
21622118892 0 034160 812 1016bi32clang_-march=native_-O2_-fomit-frame-pointer_-fwrapv_-Qunused-arguments_-fPIC_-fPIE2023053020230530
21662518817 0 032742 804 1016bi32clang_-march=native_-O_-fomit-frame-pointer_-fwrapv_-Qunused-arguments_-fPIC_-fPIE2023053020230530
21754718932 0 035168 812 1016bi32clang_-mcpu=native_-O3_-fomit-frame-pointer_-fwrapv_-Qunused-arguments_-fPIC_-fPIE2023053020230530
21874421239 0 035247 772 1080bi32gcc_-march=native_-mtune=native_-O_-fomit-frame-pointer_-fwrapv_-fPIC_-fPIE2023053020230530
21953619006 0 032398 804 1016bi32clang_-march=native_-Os_-fomit-frame-pointer_-fwrapv_-Qunused-arguments_-fPIC_-fPIE2023053020230530
22277310995 0 023915 756 1048bi32_lowreggcc_-march=native_-mtune=native_-Os_-fomit-frame-pointer_-fwrapv_-fPIC_-fPIE2023053020230530
2240692504 0 016976 780 1080bi32_lowsizegcc_-march=native_-mtune=native_-O2_-fomit-frame-pointer_-fwrapv_-fPIC_-fPIE2023053020230530
2242292991 0 018648 780 1080bi32_lowsizegcc_-march=native_-mtune=native_-O3_-fomit-frame-pointer_-fwrapv_-fPIC_-fPIE2023053020230530
22763111897 0 029560 812 1016bi32_lowregclang_-march=native_-O3_-fomit-frame-pointer_-fwrapv_-Qunused-arguments_-fPIC_-fPIE2023053020230530
22879311888 0 025358 804 1016bi32_lowregclang_-march=native_-Os_-fomit-frame-pointer_-fwrapv_-Qunused-arguments_-fPIC_-fPIE2023053020230530
22888311897 0 027256 812 1016bi32_lowregclang_-march=native_-O2_-fomit-frame-pointer_-fwrapv_-Qunused-arguments_-fPIC_-fPIE2023053020230530
2320682953 0 020536 812 1016bi32_lowsizeclang_-march=native_-O3_-fomit-frame-pointer_-fwrapv_-Qunused-arguments_-fPIC_-fPIE2023053020230530
2334652782 0 018056 812 1016bi32_lowsizeclang_-march=native_-O2_-fomit-frame-pointer_-fwrapv_-Qunused-arguments_-fPIC_-fPIE2023053020230530
23538511945 0 028264 812 1016bi32_lowregclang_-mcpu=native_-O3_-fomit-frame-pointer_-fwrapv_-Qunused-arguments_-fPIC_-fPIE2023053020230530
2356332587 0 015950 804 1016bi32_lowsizeclang_-march=native_-Os_-fomit-frame-pointer_-fwrapv_-Qunused-arguments_-fPIC_-fPIE2023053020230530
2359322258 0 015083 756 1048bi32_lowsizegcc_-march=native_-mtune=native_-Os_-fomit-frame-pointer_-fwrapv_-fPIC_-fPIE2023053020230530
2437992560 0 016494 804 1016bi32_lowsizeclang_-march=native_-O_-fomit-frame-pointer_-fwrapv_-Qunused-arguments_-fPIC_-fPIE2023053020230530
24577913863 0 027999 772 1080bi32_lowreggcc_-march=native_-mtune=native_-O_-fomit-frame-pointer_-fwrapv_-fPIC_-fPIE2023053020230530
25060511737 0 025750 804 1016bi32_lowregclang_-march=native_-O_-fomit-frame-pointer_-fwrapv_-Qunused-arguments_-fPIC_-fPIE2023053020230530
2507692616 0 016639 772 1080bi32_lowsizegcc_-march=native_-mtune=native_-O_-fomit-frame-pointer_-fwrapv_-fPIC_-fPIE2023053020230530
2531612838 0 019072 812 1016bi32_lowsizeclang_-mcpu=native_-O3_-fomit-frame-pointer_-fwrapv_-Qunused-arguments_-fPIC_-fPIE2023053020230530
2976515303 0 020608 812 1016opt8clang_-march=native_-O2_-fomit-frame-pointer_-fwrapv_-Qunused-arguments_-fPIC_-fPIE2023053020230530
3033565151 0 020464 812 1016opt8_lowsizeclang_-march=native_-O2_-fomit-frame-pointer_-fwrapv_-Qunused-arguments_-fPIC_-fPIE2023053020230530
3409203187 0 016590 804 1016opt8_lowsizeclang_-march=native_-Os_-fomit-frame-pointer_-fwrapv_-Qunused-arguments_-fPIC_-fPIE2023053020230530
3420093223 0 016670 804 1016opt8clang_-march=native_-Os_-fomit-frame-pointer_-fwrapv_-Qunused-arguments_-fPIC_-fPIE2023053020230530
5447516831 0 024448 812 1016opt8_lowsizeclang_-march=native_-O3_-fomit-frame-pointer_-fwrapv_-Qunused-arguments_-fPIC_-fPIE2023053020230530
5454476151 0 023760 812 1016opt8clang_-march=native_-O3_-fomit-frame-pointer_-fwrapv_-Qunused-arguments_-fPIC_-fPIE2023053020230530
5581467007 0 023264 812 1016opt8_lowsizeclang_-mcpu=native_-O3_-fomit-frame-pointer_-fwrapv_-Qunused-arguments_-fPIC_-fPIE2023053020230530
5595206258 0 022560 812 1016opt8clang_-mcpu=native_-O3_-fomit-frame-pointer_-fwrapv_-Qunused-arguments_-fPIC_-fPIE2023053020230530
6614103639 0 017622 804 1016opt8clang_-march=native_-O_-fomit-frame-pointer_-fwrapv_-Qunused-arguments_-fPIC_-fPIE2023053020230530
6652083574 0 017526 804 1016opt8_lowsizeclang_-march=native_-O_-fomit-frame-pointer_-fwrapv_-Qunused-arguments_-fPIC_-fPIE2023053020230530
7029409607 0 024360 812 1016bi8clang_-march=native_-O2_-fomit-frame-pointer_-fwrapv_-Qunused-arguments_-fPIC_-fPIE2023053020230530
7057199662 0 026728 812 1016bi8clang_-march=native_-O3_-fomit-frame-pointer_-fwrapv_-Qunused-arguments_-fPIC_-fPIE2023053020230530
7061319726 0 022614 804 1016bi8clang_-march=native_-Os_-fomit-frame-pointer_-fwrapv_-Qunused-arguments_-fPIC_-fPIE2023053020230530
7451059720 0 025480 812 1016bi8clang_-mcpu=native_-O3_-fomit-frame-pointer_-fwrapv_-Qunused-arguments_-fPIC_-fPIE2023053020230530
7472729688 0 023262 804 1016bi8clang_-march=native_-O_-fomit-frame-pointer_-fwrapv_-Qunused-arguments_-fPIC_-fPIE2023053020230530
7617909430 0 024680 780 1080bi8gcc_-march=native_-mtune=native_-O3_-fomit-frame-pointer_-fwrapv_-fPIC_-fPIE2023053020230530
81365514190 0 027847 772 1080bi8gcc_-march=native_-mtune=native_-O_-fomit-frame-pointer_-fwrapv_-fPIC_-fPIE2023053020230530
81639510317 0 024392 780 1080bi8gcc_-march=native_-mtune=native_-O2_-fomit-frame-pointer_-fwrapv_-fPIC_-fPIE2023053020230530
82014110669 0 023147 756 1048bi8gcc_-march=native_-mtune=native_-Os_-fomit-frame-pointer_-fwrapv_-fPIC_-fPIE2023053020230530
12555545609 0 020104 780 1080opt8_lowsizegcc_-march=native_-mtune=native_-O2_-fomit-frame-pointer_-fwrapv_-fPIC_-fPIE2023053020230530
12683405904 0 020400 780 1080opt8gcc_-march=native_-mtune=native_-O2_-fomit-frame-pointer_-fwrapv_-fPIC_-fPIE2023053020230530
12854235545 0 019599 772 1080opt8_lowsizegcc_-march=native_-mtune=native_-O_-fomit-frame-pointer_-fwrapv_-fPIC_-fPIE2023053020230530
13002365701 0 019767 772 1080opt8gcc_-march=native_-mtune=native_-O_-fomit-frame-pointer_-fwrapv_-fPIC_-fPIE2023053020230530
13062677518 0 023200 780 1080opt8gcc_-march=native_-mtune=native_-O3_-fomit-frame-pointer_-fwrapv_-fPIC_-fPIE2023053020230530
13169027381 0 023056 780 1080opt8_lowsizegcc_-march=native_-mtune=native_-O3_-fomit-frame-pointer_-fwrapv_-fPIC_-fPIE2023053020230530
13208485191 0 018083 756 1048opt8gcc_-march=native_-mtune=native_-Os_-fomit-frame-pointer_-fwrapv_-fPIC_-fPIE2023053020230530
13248214975 0 017827 756 1048opt8_lowsizegcc_-march=native_-mtune=native_-Os_-fomit-frame-pointer_-fwrapv_-fPIC_-fPIE2023053020230530

Compiler output

Implementation: T:asm_bi32_rv32b
Security model: timingleaks
Compiler: clang -march=native -O2 -fomit-frame-pointer -fwrapv -Qunused-arguments -fPIC -fPIE
ascon.S: ascon.S:159:5: error: ambiguous instructions require an explicit suffix (could be 'jb', or 'jl')
ascon.S: j .LPloopcond
ascon.S: ^
ascon.S: ascon.S:162:5: error: unknown use of instruction mnemonic without a size suffix
ascon.S: xor s5, s5, t2
ascon.S: ^
ascon.S: ascon.S:163:15: error: expected register here
ascon.S: lbu t2, 1(t1)
ascon.S: ^
ascon.S: ascon.S:164:5: error: unknown use of instruction mnemonic without a size suffix
ascon.S: xor s4, s4, t2
ascon.S: ^
ascon.S: <instantiation>:1:1: error: unknown use of instruction mnemonic without a size suffix
ascon.S: xor t3, s1, s9
ascon.S: ^
ascon.S: ascon.S:167:5: note: while in macro instantiation
ascon.S: sbox s1, s3, s5, s7, s9, t4, t3, t5
ascon.S: ^
ascon.S: <instantiation>:2:5: error: unknown use of instruction mnemonic without a size suffix
ascon.S: xor t5, s7, s9
ascon.S: ^
ascon.S: ascon.S:167:5: note: while in macro instantiation
ascon.S: sbox s1, s3, s5, s7, s9, t4, t3, t5
ascon.S: ^
ascon.S: <instantiation>:3:5: error: unknown use of instruction mnemonic without a size suffix
ascon.S: ...

Number of similar (compiler,implementation) pairs: 5, namely:
CompilerImplementations
clang -march=native -O2 -fomit-frame-pointer -fwrapv -Qunused-arguments -fPIC -fPIE T:asm_bi32_rv32b
clang -march=native -O3 -fomit-frame-pointer -fwrapv -Qunused-arguments -fPIC -fPIE T:asm_bi32_rv32b
clang -march=native -O -fomit-frame-pointer -fwrapv -Qunused-arguments -fPIC -fPIE T:asm_bi32_rv32b
clang -march=native -Os -fomit-frame-pointer -fwrapv -Qunused-arguments -fPIC -fPIE T:asm_bi32_rv32b
clang -mcpu=native -O3 -fomit-frame-pointer -fwrapv -Qunused-arguments -fPIC -fPIE T:asm_bi32_rv32b

Compiler output

Implementation: T:asm_bi32_rv32b
Security model: timingleaks
Compiler: gcc -march=native -mtune=native -O2 -fomit-frame-pointer -fwrapv -fPIC -fPIE
ascon.S: ascon.S: Assembler messages:
ascon.S: ascon.S:159: Error: no such instruction: `j .LPloopcond'
ascon.S: ascon.S:162: Error: too many memory references for `xor'
ascon.S: ascon.S:163: Error: no such instruction: `lbu t2,1(t1)'
ascon.S: ascon.S:164: Error: too many memory references for `xor'
ascon.S: ascon.S:167: Error: too many memory references for `xor'
ascon.S: ascon.S:167: Error: too many memory references for `xor'
ascon.S: ascon.S:167: Error: too many memory references for `xor'
ascon.S: ascon.S:167: Error: no such instruction: `orn s9,s7,s9'
ascon.S: ascon.S:167: Error: too many memory references for `xor'
ascon.S: ascon.S:167: Error: too many memory references for `xor'
ascon.S: ascon.S:167: Error: too many memory references for `or'
ascon.S: ascon.S:167: Error: too many memory references for `xor'
ascon.S: ascon.S:167: Error: too many memory references for `xor'
ascon.S: ascon.S:167: Error: too many memory references for `or'
ascon.S: ascon.S:167: Error: too many memory references for `xor'
ascon.S: ascon.S:167: Error: too many memory references for `or'
ascon.S: ascon.S:167: Error: too many memory references for `xor'
ascon.S: ascon.S:167: Error: too many memory references for `andn'
ascon.S: ascon.S:167: Error: too many memory references for `xor'
ascon.S: ascon.S:168: Error: too many memory references for `xor'
ascon.S: ascon.S:168: Error: too many memory references for `xor'
ascon.S: ascon.S:168: Error: too many memory references for `xor'
ascon.S: ascon.S:168: Error: no such instruction: `orn s8,s6,s8'
ascon.S: ascon.S:168: Error: too many memory references for `xor'
ascon.S: ...

Number of similar (compiler,implementation) pairs: 4, namely:
CompilerImplementations
gcc -march=native -mtune=native -O2 -fomit-frame-pointer -fwrapv -fPIC -fPIE T:asm_bi32_rv32b
gcc -march=native -mtune=native -O3 -fomit-frame-pointer -fwrapv -fPIC -fPIE T:asm_bi32_rv32b
gcc -march=native -mtune=native -O -fomit-frame-pointer -fwrapv -fPIC -fPIE T:asm_bi32_rv32b
gcc -march=native -mtune=native -Os -fomit-frame-pointer -fwrapv -fPIC -fPIE T:asm_bi32_rv32b

Compiler output

Implementation: T:asm_esp32
Security model: timingleaks
Compiler: clang -march=native -O2 -fomit-frame-pointer -fwrapv -Qunused-arguments -fPIC -fPIE
ascon.S: ascon.S:1:10: fatal error: 'xtensa/coreasm.h' file not found
ascon.S: #include <xtensa/coreasm.h>
ascon.S: ^~~~~~~~~~~~~~~~~~
ascon.S: 1 error generated.

Number of similar (compiler,implementation) pairs: 5, namely:
CompilerImplementations
clang -march=native -O2 -fomit-frame-pointer -fwrapv -Qunused-arguments -fPIC -fPIE T:asm_esp32
clang -march=native -O3 -fomit-frame-pointer -fwrapv -Qunused-arguments -fPIC -fPIE T:asm_esp32
clang -march=native -O -fomit-frame-pointer -fwrapv -Qunused-arguments -fPIC -fPIE T:asm_esp32
clang -march=native -Os -fomit-frame-pointer -fwrapv -Qunused-arguments -fPIC -fPIE T:asm_esp32
clang -mcpu=native -O3 -fomit-frame-pointer -fwrapv -Qunused-arguments -fPIC -fPIE T:asm_esp32

Compiler output

Implementation: T:asm_esp32
Security model: timingleaks
Compiler: gcc -march=native -mtune=native -O2 -fomit-frame-pointer -fwrapv -fPIC -fPIE
ascon.S: ascon.S:1:10: fatal error: xtensa/coreasm.h: No such file or directory
ascon.S: 1 | #include <xtensa/coreasm.h>
ascon.S: | ^~~~~~~~~~~~~~~~~~
ascon.S: compilation terminated.

Number of similar (compiler,implementation) pairs: 4, namely:
CompilerImplementations
gcc -march=native -mtune=native -O2 -fomit-frame-pointer -fwrapv -fPIC -fPIE T:asm_esp32
gcc -march=native -mtune=native -O3 -fomit-frame-pointer -fwrapv -fPIC -fPIE T:asm_esp32
gcc -march=native -mtune=native -O -fomit-frame-pointer -fwrapv -fPIC -fPIE T:asm_esp32
gcc -march=native -mtune=native -Os -fomit-frame-pointer -fwrapv -fPIC -fPIE T:asm_esp32

Compiler output

Implementation: T:asm_fsr_rv32b
Security model: timingleaks
Compiler: clang -march=native -O2 -fomit-frame-pointer -fwrapv -Qunused-arguments -fPIC -fPIE
ascon.S: ascon.S:110:5: error: invalid instruction mnemonic 'li'
ascon.S: li t6, 0x4b
ascon.S: ^~
ascon.S: ascon.S:113:5: error: unknown use of instruction mnemonic without a size suffix
ascon.S: xor s5, s5, t1
ascon.S: ^
ascon.S: <instantiation>:1:1: error: unknown use of instruction mnemonic without a size suffix
ascon.S: xor t3, s1, s9
ascon.S: ^
ascon.S: ascon.S:116:5: note: while in macro instantiation
ascon.S: sbox s1, s3, s5, s7, s9, t4, t3, t5
ascon.S: ^
ascon.S: <instantiation>:2:5: error: unknown use of instruction mnemonic without a size suffix
ascon.S: xor t5, s7, s9
ascon.S: ^
ascon.S: ascon.S:116:5: note: while in macro instantiation
ascon.S: sbox s1, s3, s5, s7, s9, t4, t3, t5
ascon.S: ^
ascon.S: <instantiation>:3:5: error: unknown use of instruction mnemonic without a size suffix
ascon.S: xor t4, s3, s5
ascon.S: ^
ascon.S: ascon.S:116:5: note: while in macro instantiation
ascon.S: sbox s1, s3, s5, s7, s9, t4, t3, t5
ascon.S: ^
ascon.S: <instantiation>:4:5: error: invalid instruction mnemonic 'orn'
ascon.S: ...

Number of similar (compiler,implementation) pairs: 5, namely:
CompilerImplementations
clang -march=native -O2 -fomit-frame-pointer -fwrapv -Qunused-arguments -fPIC -fPIE T:asm_fsr_rv32b
clang -march=native -O3 -fomit-frame-pointer -fwrapv -Qunused-arguments -fPIC -fPIE T:asm_fsr_rv32b
clang -march=native -O -fomit-frame-pointer -fwrapv -Qunused-arguments -fPIC -fPIE T:asm_fsr_rv32b
clang -march=native -Os -fomit-frame-pointer -fwrapv -Qunused-arguments -fPIC -fPIE T:asm_fsr_rv32b
clang -mcpu=native -O3 -fomit-frame-pointer -fwrapv -Qunused-arguments -fPIC -fPIE T:asm_fsr_rv32b

Compiler output

Implementation: T:asm_fsr_rv32b
Security model: timingleaks
Compiler: gcc -march=native -mtune=native -O2 -fomit-frame-pointer -fwrapv -fPIC -fPIE
ascon.S: ascon.S: Assembler messages:
ascon.S: ascon.S:110: Error: no such instruction: `li t6,0x4b'
ascon.S: ascon.S:113: Error: too many memory references for `xor'
ascon.S: ascon.S:116: Error: too many memory references for `xor'
ascon.S: ascon.S:116: Error: too many memory references for `xor'
ascon.S: ascon.S:116: Error: too many memory references for `xor'
ascon.S: ascon.S:116: Error: no such instruction: `orn s9,s7,s9'
ascon.S: ascon.S:116: Error: too many memory references for `xor'
ascon.S: ascon.S:116: Error: too many memory references for `xor'
ascon.S: ascon.S:116: Error: too many memory references for `or'
ascon.S: ascon.S:116: Error: too many memory references for `xor'
ascon.S: ascon.S:116: Error: too many memory references for `xor'
ascon.S: ascon.S:116: Error: too many memory references for `or'
ascon.S: ascon.S:116: Error: too many memory references for `xor'
ascon.S: ascon.S:116: Error: too many memory references for `or'
ascon.S: ascon.S:116: Error: too many memory references for `xor'
ascon.S: ascon.S:116: Error: too many memory references for `andn'
ascon.S: ascon.S:116: Error: too many memory references for `xor'
ascon.S: ascon.S:117: Error: too many memory references for `xor'
ascon.S: ascon.S:117: Error: too many memory references for `xor'
ascon.S: ascon.S:117: Error: too many memory references for `xor'
ascon.S: ascon.S:117: Error: no such instruction: `orn s8,s6,s8'
ascon.S: ascon.S:117: Error: too many memory references for `xor'
ascon.S: ascon.S:117: Error: too many memory references for `xor'
ascon.S: ascon.S:117: Error: too many memory references for `or'
ascon.S: ...

Number of similar (compiler,implementation) pairs: 4, namely:
CompilerImplementations
gcc -march=native -mtune=native -O2 -fomit-frame-pointer -fwrapv -fPIC -fPIE T:asm_fsr_rv32b
gcc -march=native -mtune=native -O3 -fomit-frame-pointer -fwrapv -fPIC -fPIE T:asm_fsr_rv32b
gcc -march=native -mtune=native -O -fomit-frame-pointer -fwrapv -fPIC -fPIE T:asm_fsr_rv32b
gcc -march=native -mtune=native -Os -fomit-frame-pointer -fwrapv -fPIC -fPIE T:asm_fsr_rv32b

Compiler output

Implementation: T:asm_rv32b
Security model: timingleaks
Compiler: clang -march=native -O2 -fomit-frame-pointer -fwrapv -Qunused-arguments -fPIC -fPIE
ascon.S: ascon.S:118:5: error: invalid instruction mnemonic 'li'
ascon.S: li t6, 0x4b
ascon.S: ^~
ascon.S: ascon.S:121:5: error: unknown use of instruction mnemonic without a size suffix
ascon.S: xor s5, s5, t1
ascon.S: ^
ascon.S: <instantiation>:1:1: error: unknown use of instruction mnemonic without a size suffix
ascon.S: xor t3, s1, s9
ascon.S: ^
ascon.S: ascon.S:124:5: note: while in macro instantiation
ascon.S: sbox s1, s3, s5, s7, s9, t4, t3, t5
ascon.S: ^
ascon.S: <instantiation>:2:5: error: unknown use of instruction mnemonic without a size suffix
ascon.S: xor t5, s7, s9
ascon.S: ^
ascon.S: ascon.S:124:5: note: while in macro instantiation
ascon.S: sbox s1, s3, s5, s7, s9, t4, t3, t5
ascon.S: ^
ascon.S: <instantiation>:3:5: error: unknown use of instruction mnemonic without a size suffix
ascon.S: xor t4, s3, s5
ascon.S: ^
ascon.S: ascon.S:124:5: note: while in macro instantiation
ascon.S: sbox s1, s3, s5, s7, s9, t4, t3, t5
ascon.S: ^
ascon.S: <instantiation>:4:5: error: invalid instruction mnemonic 'orn'
ascon.S: ...

Number of similar (compiler,implementation) pairs: 5, namely:
CompilerImplementations
clang -march=native -O2 -fomit-frame-pointer -fwrapv -Qunused-arguments -fPIC -fPIE T:asm_rv32b
clang -march=native -O3 -fomit-frame-pointer -fwrapv -Qunused-arguments -fPIC -fPIE T:asm_rv32b
clang -march=native -O -fomit-frame-pointer -fwrapv -Qunused-arguments -fPIC -fPIE T:asm_rv32b
clang -march=native -Os -fomit-frame-pointer -fwrapv -Qunused-arguments -fPIC -fPIE T:asm_rv32b
clang -mcpu=native -O3 -fomit-frame-pointer -fwrapv -Qunused-arguments -fPIC -fPIE T:asm_rv32b

Compiler output

Implementation: T:asm_rv32b
Security model: timingleaks
Compiler: gcc -march=native -mtune=native -O2 -fomit-frame-pointer -fwrapv -fPIC -fPIE
ascon.S: ascon.S: Assembler messages:
ascon.S: ascon.S:118: Error: no such instruction: `li t6,0x4b'
ascon.S: ascon.S:121: Error: too many memory references for `xor'
ascon.S: ascon.S:124: Error: too many memory references for `xor'
ascon.S: ascon.S:124: Error: too many memory references for `xor'
ascon.S: ascon.S:124: Error: too many memory references for `xor'
ascon.S: ascon.S:124: Error: no such instruction: `orn s9,s7,s9'
ascon.S: ascon.S:124: Error: too many memory references for `xor'
ascon.S: ascon.S:124: Error: too many memory references for `xor'
ascon.S: ascon.S:124: Error: too many memory references for `or'
ascon.S: ascon.S:124: Error: too many memory references for `xor'
ascon.S: ascon.S:124: Error: too many memory references for `xor'
ascon.S: ascon.S:124: Error: too many memory references for `or'
ascon.S: ascon.S:124: Error: too many memory references for `xor'
ascon.S: ascon.S:124: Error: too many memory references for `or'
ascon.S: ascon.S:124: Error: too many memory references for `xor'
ascon.S: ascon.S:124: Error: too many memory references for `andn'
ascon.S: ascon.S:124: Error: too many memory references for `xor'
ascon.S: ascon.S:125: Error: too many memory references for `xor'
ascon.S: ascon.S:125: Error: too many memory references for `xor'
ascon.S: ascon.S:125: Error: too many memory references for `xor'
ascon.S: ascon.S:125: Error: no such instruction: `orn s8,s6,s8'
ascon.S: ascon.S:125: Error: too many memory references for `xor'
ascon.S: ascon.S:125: Error: too many memory references for `xor'
ascon.S: ascon.S:125: Error: too many memory references for `or'
ascon.S: ...

Number of similar (compiler,implementation) pairs: 4, namely:
CompilerImplementations
gcc -march=native -mtune=native -O2 -fomit-frame-pointer -fwrapv -fPIC -fPIE T:asm_rv32b
gcc -march=native -mtune=native -O3 -fomit-frame-pointer -fwrapv -fPIC -fPIE T:asm_rv32b
gcc -march=native -mtune=native -O -fomit-frame-pointer -fwrapv -fPIC -fPIE T:asm_rv32b
gcc -march=native -mtune=native -Os -fomit-frame-pointer -fwrapv -fPIC -fPIE T:asm_rv32b

Compiler output

Implementation: T:asm_rv32i
Security model: timingleaks
Compiler: clang -march=native -O2 -fomit-frame-pointer -fwrapv -Qunused-arguments -fPIC -fPIE
ascon.S: ascon.S:120:5: error: invalid instruction mnemonic 'li'
ascon.S: li t6, 0x4b
ascon.S: ^~
ascon.S: ascon.S:123:5: error: unknown use of instruction mnemonic without a size suffix
ascon.S: xor s5, s5, t1
ascon.S: ^
ascon.S: <instantiation>:1:1: error: unknown use of instruction mnemonic without a size suffix
ascon.S: xor t3, s1, s9
ascon.S: ^
ascon.S: ascon.S:126:5: note: while in macro instantiation
ascon.S: sbox s1, s3, s5, s7, s9, t4, t3, t5
ascon.S: ^
ascon.S: <instantiation>:2:5: error: unknown use of instruction mnemonic without a size suffix
ascon.S: xor t5, s7, s9
ascon.S: ^
ascon.S: ascon.S:126:5: note: while in macro instantiation
ascon.S: sbox s1, s3, s5, s7, s9, t4, t3, t5
ascon.S: ^
ascon.S: <instantiation>:3:5: error: invalid instruction mnemonic 'xori'
ascon.S: xori s9, s9, -1
ascon.S: ^~~~
ascon.S: ascon.S:126:5: note: while in macro instantiation
ascon.S: sbox s1, s3, s5, s7, s9, t4, t3, t5
ascon.S: ^
ascon.S: <instantiation>:4:5: error: unknown use of instruction mnemonic without a size suffix
ascon.S: ...

Number of similar (compiler,implementation) pairs: 5, namely:
CompilerImplementations
clang -march=native -O2 -fomit-frame-pointer -fwrapv -Qunused-arguments -fPIC -fPIE T:asm_rv32i
clang -march=native -O3 -fomit-frame-pointer -fwrapv -Qunused-arguments -fPIC -fPIE T:asm_rv32i
clang -march=native -O -fomit-frame-pointer -fwrapv -Qunused-arguments -fPIC -fPIE T:asm_rv32i
clang -march=native -Os -fomit-frame-pointer -fwrapv -Qunused-arguments -fPIC -fPIE T:asm_rv32i
clang -mcpu=native -O3 -fomit-frame-pointer -fwrapv -Qunused-arguments -fPIC -fPIE T:asm_rv32i

Compiler output

Implementation: T:asm_rv32i
Security model: timingleaks
Compiler: gcc -march=native -mtune=native -O2 -fomit-frame-pointer -fwrapv -fPIC -fPIE
ascon.S: ascon.S: Assembler messages:
ascon.S: ascon.S:120: Error: no such instruction: `li t6,0x4b'
ascon.S: ascon.S:123: Error: too many memory references for `xor'
ascon.S: ascon.S:126: Error: too many memory references for `xor'
ascon.S: ascon.S:126: Error: too many memory references for `xor'
ascon.S: ascon.S:126: Error: no such instruction: `xori s9,s9,-1'
ascon.S: ascon.S:126: Error: too many memory references for `xor'
ascon.S: ascon.S:126: Error: too many memory references for `or'
ascon.S: ascon.S:126: Error: too many memory references for `xor'
ascon.S: ascon.S:126: Error: too many memory references for `xor'
ascon.S: ascon.S:126: Error: too many memory references for `or'
ascon.S: ascon.S:126: Error: too many memory references for `xor'
ascon.S: ascon.S:126: Error: too many memory references for `xor'
ascon.S: ascon.S:126: Error: too many memory references for `or'
ascon.S: ascon.S:126: Error: too many memory references for `xor'
ascon.S: ascon.S:126: Error: too many memory references for `or'
ascon.S: ascon.S:126: Error: too many memory references for `xor'
ascon.S: ascon.S:126: Error: no such instruction: `xori t3,t3,-1'
ascon.S: ascon.S:126: Error: too many memory references for `and'
ascon.S: ascon.S:126: Error: too many memory references for `xor'
ascon.S: ascon.S:127: Error: too many memory references for `xor'
ascon.S: ascon.S:127: Error: too many memory references for `xor'
ascon.S: ascon.S:127: Error: no such instruction: `xori s8,s8,-1'
ascon.S: ascon.S:127: Error: too many memory references for `xor'
ascon.S: ascon.S:127: Error: too many memory references for `or'
ascon.S: ...

Number of similar (compiler,implementation) pairs: 4, namely:
CompilerImplementations
gcc -march=native -mtune=native -O2 -fomit-frame-pointer -fwrapv -fPIC -fPIE T:asm_rv32i
gcc -march=native -mtune=native -O3 -fomit-frame-pointer -fwrapv -fPIC -fPIE T:asm_rv32i
gcc -march=native -mtune=native -O -fomit-frame-pointer -fwrapv -fPIC -fPIE T:asm_rv32i
gcc -march=native -mtune=native -Os -fomit-frame-pointer -fwrapv -fPIC -fPIE T:asm_rv32i

Compiler output

Implementation: avr
Security model: constbranchindex
Compiler: clang -march=native -O2 -fomit-frame-pointer -fwrapv -Qunused-arguments -fPIC -fPIE
permutations.S: permutations.S:29:10: fatal error: 'avr/io.h' file not found
permutations.S: #include "avr/io.h"
permutations.S: ^~~~~~~~~~
permutations.S: 1 error generated.

Number of similar (compiler,implementation) pairs: 10, namely:
CompilerImplementations
clang -march=native -O2 -fomit-frame-pointer -fwrapv -Qunused-arguments -fPIC -fPIE avr
clang -march=native -O3 -fomit-frame-pointer -fwrapv -Qunused-arguments -fPIC -fPIE avr
clang -march=native -O -fomit-frame-pointer -fwrapv -Qunused-arguments -fPIC -fPIE avr
clang -march=native -Os -fomit-frame-pointer -fwrapv -Qunused-arguments -fPIC -fPIE avr
clang -mcpu=native -O3 -fomit-frame-pointer -fwrapv -Qunused-arguments -fPIC -fPIE avr
clang -march=native -O2 -fomit-frame-pointer -fwrapv -Qunused-arguments -fPIC -fPIE avr_lowsize
clang -march=native -O3 -fomit-frame-pointer -fwrapv -Qunused-arguments -fPIC -fPIE avr_lowsize
clang -march=native -O -fomit-frame-pointer -fwrapv -Qunused-arguments -fPIC -fPIE avr_lowsize
clang -march=native -Os -fomit-frame-pointer -fwrapv -Qunused-arguments -fPIC -fPIE avr_lowsize
clang -mcpu=native -O3 -fomit-frame-pointer -fwrapv -Qunused-arguments -fPIC -fPIE avr_lowsize

Compiler output

Implementation: avr
Security model: constbranchindex
Compiler: gcc -march=native -mtune=native -O2 -fomit-frame-pointer -fwrapv -fPIC -fPIE
permutations.S: permutations.S:29:10: fatal error: avr/io.h: No such file or directory
permutations.S: 29 | #include "avr/io.h"
permutations.S: | ^~~~~~~~~~
permutations.S: compilation terminated.

Number of similar (compiler,implementation) pairs: 8, namely:
CompilerImplementations
gcc -march=native -mtune=native -O2 -fomit-frame-pointer -fwrapv -fPIC -fPIE avr
gcc -march=native -mtune=native -O3 -fomit-frame-pointer -fwrapv -fPIC -fPIE avr
gcc -march=native -mtune=native -O -fomit-frame-pointer -fwrapv -fPIC -fPIE avr
gcc -march=native -mtune=native -Os -fomit-frame-pointer -fwrapv -fPIC -fPIE avr
gcc -march=native -mtune=native -O2 -fomit-frame-pointer -fwrapv -fPIC -fPIE avr_lowsize
gcc -march=native -mtune=native -O3 -fomit-frame-pointer -fwrapv -fPIC -fPIE avr_lowsize
gcc -march=native -mtune=native -O -fomit-frame-pointer -fwrapv -fPIC -fPIE avr_lowsize
gcc -march=native -mtune=native -Os -fomit-frame-pointer -fwrapv -fPIC -fPIE avr_lowsize

Compiler output

Implementation: avx512
Security model: constbranchindex
Compiler: clang -march=native -O2 -fomit-frame-pointer -fwrapv -Qunused-arguments -fPIC -fPIE
aead.c: aead.c:59:26: error: always_inline function '_mm512_set_epi8' requires target feature 'avx512f', but would be inlined into function 'ascon_adata' that is compiled without support for 'avx512f'
aead.c: const __m512i u64big = AVX512_SHUFFLE_U64BIG;
aead.c: ^
aead.c: aead.c:8:3: note: expanded from macro 'AVX512_SHUFFLE_U64BIG'
aead.c: _mm512_set_epi8(-1, -1, -1, -1, -1, -1, -1, -1, /* word 7 */ \
aead.c: ^
aead.c: aead.c:59:26: error: AVX vector return of type '__m512i' (vector of 8 'long long' values) without 'avx512f' enabled changes the ABI
aead.c: aead.c:8:3: note: expanded from macro 'AVX512_SHUFFLE_U64BIG'
aead.c: _mm512_set_epi8(-1, -1, -1, -1, -1, -1, -1, -1, /* word 7 */ \
aead.c: ^
aead.c: aead.c:66:13: error: always_inline function '_mm512_maskz_loadu_epi8' requires target feature 'avx512bw', but would be inlined into function 'ascon_adata' that is compiled without support for 'avx512bw'
aead.c: t.z = _mm512_maskz_loadu_epi8(mask, ad);
aead.c: ^
aead.c: aead.c:66:13: error: AVX vector return of type '__m512i' (vector of 8 'long long' values) without 'avx512f' enabled changes the ABI
aead.c: aead.c:67:13: error: always_inline function '_mm512_maskz_shuffle_epi8' requires target feature 'avx512bw', but would be inlined into function 'ascon_adata' that is compiled without support for 'avx512bw'
aead.c: t.z = _mm512_maskz_shuffle_epi8(mask, t.z, u64big);
aead.c: ^
aead.c: aead.c:67:13: error: AVX vector argument of type '__m512i' (vector of 8 'long long' values) without 'avx512f' enabled changes the ABI
aead.c: aead.c:68:13: error: always_inline function '_mm512_xor_epi64' requires target feature 'avx512f', but would be inlined into function 'ascon_adata' that is compiled without support for 'avx512f'
aead.c: r.z = _mm512_xor_epi64(r.z, t.z);
aead.c: ^
aead.c: aead.c:68:13: error: AVX vector argument of type '__m512i' (vector of 8 'long long' values) without 'avx512f' enabled changes the ABI
aead.c: 8 errors generated.

Number of similar (compiler,implementation) pairs: 5, namely:
CompilerImplementations
clang -march=native -O2 -fomit-frame-pointer -fwrapv -Qunused-arguments -fPIC -fPIE avx512
clang -march=native -O3 -fomit-frame-pointer -fwrapv -Qunused-arguments -fPIC -fPIE avx512
clang -march=native -O -fomit-frame-pointer -fwrapv -Qunused-arguments -fPIC -fPIE avx512
clang -march=native -Os -fomit-frame-pointer -fwrapv -Qunused-arguments -fPIC -fPIE avx512
clang -mcpu=native -O3 -fomit-frame-pointer -fwrapv -Qunused-arguments -fPIC -fPIE avx512

Compiler output

Implementation: avx512
Security model: constbranchindex
Compiler: gcc -march=native -mtune=native -O2 -fomit-frame-pointer -fwrapv -fPIC -fPIE
aead.c: In file included from permutations.h:11,
aead.c: from aead.c:4:
aead.c: round.h: In function 'ROUND':
aead.c: round.h:12:11: warning: AVX512F vector return without AVX512F enabled changes the ABI [-Wpsabi]
aead.c: 12 | __m512i pxor1 = _mm512_set_epi64(x, x, x, 3, x, 1, x, 4);
aead.c: | ^~~~~
aead.c: In file included from /usr/lib/gcc/x86_64-linux-gnu/10/include/immintrin.h:55,
aead.c: from ascon.h:4,
aead.c: from aead.c:2:
aead.c: /usr/lib/gcc/x86_64-linux-gnu/10/include/avx512fintrin.h:1650:1: error: inlining failed in call to 'always_inline' '_mm512_ternarylogic_epi64': target specific option mismatch
aead.c: 1650 | _mm512_ternarylogic_epi64 (__m512i __A, __m512i __B, __m512i __C,
aead.c: | ^~~~~~~~~~~~~~~~~~~~~~~~~
aead.c: In file included from permutations.h:11,
aead.c: from aead.c:4:
aead.c: round.h:34:10: note: called from here
aead.c: 34 | s->z = _mm512_ternarylogic_epi64(t0, t1, t2, 0x96);
aead.c: | ^~~~~~~~~~~~~~~~~~~~~~~~~~~~~~~~~~~~~~~~~~~
aead.c: In file included from /usr/lib/gcc/x86_64-linux-gnu/10/include/immintrin.h:55,
aead.c: from ascon.h:4,
aead.c: from aead.c:2:
aead.c: /usr/lib/gcc/x86_64-linux-gnu/10/include/avx512fintrin.h:4721:1: error: inlining failed in call to 'always_inline' '_mm512_rorv_epi64': target specific option mismatch
aead.c: 4721 | _mm512_rorv_epi64 (__m512i __A, __m512i __B)
aead.c: | ^~~~~~~~~~~~~~~~~
aead.c: In file included from permutations.h:11,
aead.c: from aead.c:4:
aead.c: ...

Number of similar (compiler,implementation) pairs: 4, namely:
CompilerImplementations
gcc -march=native -mtune=native -O2 -fomit-frame-pointer -fwrapv -fPIC -fPIE avx512
gcc -march=native -mtune=native -O3 -fomit-frame-pointer -fwrapv -fPIC -fPIE avx512
gcc -march=native -mtune=native -O -fomit-frame-pointer -fwrapv -fPIC -fPIE avx512
gcc -march=native -mtune=native -Os -fomit-frame-pointer -fwrapv -fPIC -fPIE avx512

Compiler output

Implementation: T:esp32
Security model: timingleaks
Compiler: clang -march=native -O2 -fomit-frame-pointer -fwrapv -Qunused-arguments -fPIC -fPIE
try.c: /usr/bin/ld: /tmp/try-small-0e62c1.o: in function `doit':
try.c: try-small.c:(.text+0x...): undefined reference to `crypto_aead_ascon128av12_esp32_timingleaks_encrypt'
try.c: /usr/bin/ld: try-small.c:(.text+0x...): undefined reference to `crypto_aead_ascon128av12_esp32_timingleaks_decrypt'
try.c: /usr/bin/ld: /tmp/try-small-0e62c1.o: in function `test':
try.c: try-small.c:(.text+0x...): undefined reference to `crypto_aead_ascon128av12_esp32_timingleaks_encrypt'
try.c: /usr/bin/ld: try-small.c:(.text+0x...): undefined reference to `crypto_aead_ascon128av12_esp32_timingleaks_encrypt'
try.c: /usr/bin/ld: try-small.c:(.text+0x...): undefined reference to `crypto_aead_ascon128av12_esp32_timingleaks_decrypt'
try.c: /usr/bin/ld: try-small.c:(.text+0x...): undefined reference to `crypto_aead_ascon128av12_esp32_timingleaks_decrypt'
try.c: /usr/bin/ld: try-small.c:(.text+0x...): undefined reference to `crypto_aead_ascon128av12_esp32_timingleaks_decrypt'
try.c: /usr/bin/ld: try-small.c:(.text+0x...): undefined reference to `crypto_aead_ascon128av12_esp32_timingleaks_decrypt'
try.c: /usr/bin/ld: try-small.c:(.text+0x...): undefined reference to `crypto_aead_ascon128av12_esp32_timingleaks_decrypt'
try.c: clang: error: linker command failed with exit code 1 (use -v to see invocation)

Number of similar (compiler,implementation) pairs: 1, namely:
CompilerImplementations
clang -march=native -O2 -fomit-frame-pointer -fwrapv -Qunused-arguments -fPIC -fPIE T:esp32

Compiler output

Implementation: T:esp32
Security model: timingleaks
Compiler: clang -march=native -O3 -fomit-frame-pointer -fwrapv -Qunused-arguments -fPIC -fPIE
try.c: /usr/bin/ld: /tmp/try-small-48bb2f.o: in function `doit':
try.c: try-small.c:(.text+0x...): undefined reference to `crypto_aead_ascon128av12_esp32_timingleaks_encrypt'
try.c: /usr/bin/ld: try-small.c:(.text+0x...): undefined reference to `crypto_aead_ascon128av12_esp32_timingleaks_decrypt'
try.c: /usr/bin/ld: /tmp/try-small-48bb2f.o: in function `test':
try.c: try-small.c:(.text+0x...): undefined reference to `crypto_aead_ascon128av12_esp32_timingleaks_encrypt'
try.c: /usr/bin/ld: try-small.c:(.text+0x...): undefined reference to `crypto_aead_ascon128av12_esp32_timingleaks_encrypt'
try.c: /usr/bin/ld: try-small.c:(.text+0x...): undefined reference to `crypto_aead_ascon128av12_esp32_timingleaks_decrypt'
try.c: /usr/bin/ld: try-small.c:(.text+0x...): undefined reference to `crypto_aead_ascon128av12_esp32_timingleaks_decrypt'
try.c: /usr/bin/ld: try-small.c:(.text+0x...): undefined reference to `crypto_aead_ascon128av12_esp32_timingleaks_decrypt'
try.c: /usr/bin/ld: try-small.c:(.text+0x...): undefined reference to `crypto_aead_ascon128av12_esp32_timingleaks_decrypt'
try.c: /usr/bin/ld: try-small.c:(.text+0x...): undefined reference to `crypto_aead_ascon128av12_esp32_timingleaks_decrypt'
try.c: clang: error: linker command failed with exit code 1 (use -v to see invocation)

Number of similar (compiler,implementation) pairs: 1, namely:
CompilerImplementations
clang -march=native -O3 -fomit-frame-pointer -fwrapv -Qunused-arguments -fPIC -fPIE T:esp32

Compiler output

Implementation: T:esp32
Security model: timingleaks
Compiler: clang -march=native -O -fomit-frame-pointer -fwrapv -Qunused-arguments -fPIC -fPIE
try.c: /usr/bin/ld: /tmp/try-small-0132b9.o: in function `doit':
try.c: try-small.c:(.text+0x...): undefined reference to `crypto_aead_ascon128av12_esp32_timingleaks_encrypt'
try.c: /usr/bin/ld: try-small.c:(.text+0x...): undefined reference to `crypto_aead_ascon128av12_esp32_timingleaks_decrypt'
try.c: /usr/bin/ld: /tmp/try-small-0132b9.o: in function `test':
try.c: try-small.c:(.text+0x...): undefined reference to `crypto_aead_ascon128av12_esp32_timingleaks_encrypt'
try.c: /usr/bin/ld: try-small.c:(.text+0x...): undefined reference to `crypto_aead_ascon128av12_esp32_timingleaks_encrypt'
try.c: /usr/bin/ld: try-small.c:(.text+0x...): undefined reference to `crypto_aead_ascon128av12_esp32_timingleaks_decrypt'
try.c: /usr/bin/ld: try-small.c:(.text+0x...): undefined reference to `crypto_aead_ascon128av12_esp32_timingleaks_decrypt'
try.c: /usr/bin/ld: try-small.c:(.text+0x...): undefined reference to `crypto_aead_ascon128av12_esp32_timingleaks_decrypt'
try.c: /usr/bin/ld: try-small.c:(.text+0x...): undefined reference to `crypto_aead_ascon128av12_esp32_timingleaks_decrypt'
try.c: /usr/bin/ld: try-small.c:(.text+0x...): undefined reference to `crypto_aead_ascon128av12_esp32_timingleaks_decrypt'
try.c: clang: error: linker command failed with exit code 1 (use -v to see invocation)

Number of similar (compiler,implementation) pairs: 1, namely:
CompilerImplementations
clang -march=native -O -fomit-frame-pointer -fwrapv -Qunused-arguments -fPIC -fPIE T:esp32

Compiler output

Implementation: T:esp32
Security model: timingleaks
Compiler: clang -march=native -Os -fomit-frame-pointer -fwrapv -Qunused-arguments -fPIC -fPIE
try.c: /usr/bin/ld: /tmp/try-small-e9edf7.o: in function `doit':
try.c: try-small.c:(.text+0x...): undefined reference to `crypto_aead_ascon128av12_esp32_timingleaks_encrypt'
try.c: /usr/bin/ld: try-small.c:(.text+0x...): undefined reference to `crypto_aead_ascon128av12_esp32_timingleaks_decrypt'
try.c: /usr/bin/ld: /tmp/try-small-e9edf7.o: in function `test':
try.c: try-small.c:(.text+0x...): undefined reference to `crypto_aead_ascon128av12_esp32_timingleaks_encrypt'
try.c: /usr/bin/ld: try-small.c:(.text+0x...): undefined reference to `crypto_aead_ascon128av12_esp32_timingleaks_encrypt'
try.c: /usr/bin/ld: try-small.c:(.text+0x...): undefined reference to `crypto_aead_ascon128av12_esp32_timingleaks_decrypt'
try.c: /usr/bin/ld: try-small.c:(.text+0x...): undefined reference to `crypto_aead_ascon128av12_esp32_timingleaks_decrypt'
try.c: /usr/bin/ld: try-small.c:(.text+0x...): undefined reference to `crypto_aead_ascon128av12_esp32_timingleaks_decrypt'
try.c: /usr/bin/ld: try-small.c:(.text+0x...): undefined reference to `crypto_aead_ascon128av12_esp32_timingleaks_decrypt'
try.c: /usr/bin/ld: try-small.c:(.text+0x...): undefined reference to `crypto_aead_ascon128av12_esp32_timingleaks_decrypt'
try.c: clang: error: linker command failed with exit code 1 (use -v to see invocation)

Number of similar (compiler,implementation) pairs: 1, namely:
CompilerImplementations
clang -march=native -Os -fomit-frame-pointer -fwrapv -Qunused-arguments -fPIC -fPIE T:esp32

Compiler output

Implementation: T:esp32
Security model: timingleaks
Compiler: clang -mcpu=native -O3 -fomit-frame-pointer -fwrapv -Qunused-arguments -fPIC -fPIE
try.c: /usr/bin/ld: /tmp/try-small-496b92.o: in function `doit':
try.c: try-small.c:(.text+0x...): undefined reference to `crypto_aead_ascon128av12_esp32_timingleaks_encrypt'
try.c: /usr/bin/ld: try-small.c:(.text+0x...): undefined reference to `crypto_aead_ascon128av12_esp32_timingleaks_decrypt'
try.c: /usr/bin/ld: /tmp/try-small-496b92.o: in function `test':
try.c: try-small.c:(.text+0x...): undefined reference to `crypto_aead_ascon128av12_esp32_timingleaks_encrypt'
try.c: /usr/bin/ld: try-small.c:(.text+0x...): undefined reference to `crypto_aead_ascon128av12_esp32_timingleaks_encrypt'
try.c: /usr/bin/ld: try-small.c:(.text+0x...): undefined reference to `crypto_aead_ascon128av12_esp32_timingleaks_decrypt'
try.c: /usr/bin/ld: try-small.c:(.text+0x...): undefined reference to `crypto_aead_ascon128av12_esp32_timingleaks_decrypt'
try.c: /usr/bin/ld: try-small.c:(.text+0x...): undefined reference to `crypto_aead_ascon128av12_esp32_timingleaks_decrypt'
try.c: /usr/bin/ld: try-small.c:(.text+0x...): undefined reference to `crypto_aead_ascon128av12_esp32_timingleaks_decrypt'
try.c: /usr/bin/ld: try-small.c:(.text+0x...): undefined reference to `crypto_aead_ascon128av12_esp32_timingleaks_decrypt'
try.c: clang: error: linker command failed with exit code 1 (use -v to see invocation)

Number of similar (compiler,implementation) pairs: 1, namely:
CompilerImplementations
clang -mcpu=native -O3 -fomit-frame-pointer -fwrapv -Qunused-arguments -fPIC -fPIE T:esp32

Compiler output

Implementation: T:esp32
Security model: timingleaks
Compiler: gcc -march=native -mtune=native -O2 -fomit-frame-pointer -fwrapv -fPIC -fPIE
try.c: /usr/bin/ld: /tmp/ccSpfBcb.o: in function `doit':
try.c: try-small.c:(.text+0x...): undefined reference to `crypto_aead_ascon128av12_esp32_timingleaks_encrypt'
try.c: /usr/bin/ld: try-small.c:(.text+0x...): undefined reference to `crypto_aead_ascon128av12_esp32_timingleaks_decrypt'
try.c: /usr/bin/ld: /tmp/ccSpfBcb.o: in function `test':
try.c: try-small.c:(.text+0x...): undefined reference to `crypto_aead_ascon128av12_esp32_timingleaks_encrypt'
try.c: /usr/bin/ld: try-small.c:(.text+0x...): undefined reference to `crypto_aead_ascon128av12_esp32_timingleaks_decrypt'
try.c: /usr/bin/ld: try-small.c:(.text+0x...): undefined reference to `crypto_aead_ascon128av12_esp32_timingleaks_decrypt'
try.c: /usr/bin/ld: try-small.c:(.text+0x...): undefined reference to `crypto_aead_ascon128av12_esp32_timingleaks_decrypt'
try.c: /usr/bin/ld: try-small.c:(.text+0x...): undefined reference to `crypto_aead_ascon128av12_esp32_timingleaks_decrypt'
try.c: /usr/bin/ld: try-small.c:(.text+0x...): undefined reference to `crypto_aead_ascon128av12_esp32_timingleaks_decrypt'
try.c: /usr/bin/ld: try-small.c:(.text+0x...): undefined reference to `crypto_aead_ascon128av12_esp32_timingleaks_encrypt'
try.c: collect2: error: ld returned 1 exit status

Number of similar (compiler,implementation) pairs: 1, namely:
CompilerImplementations
gcc -march=native -mtune=native -O2 -fomit-frame-pointer -fwrapv -fPIC -fPIE T:esp32

Compiler output

Implementation: T:esp32
Security model: timingleaks
Compiler: gcc -march=native -mtune=native -O3 -fomit-frame-pointer -fwrapv -fPIC -fPIE
try.c: /usr/bin/ld: /tmp/ccpUq7DH.o: in function `doit':
try.c: try-small.c:(.text+0x...): undefined reference to `crypto_aead_ascon128av12_esp32_timingleaks_encrypt'
try.c: /usr/bin/ld: try-small.c:(.text+0x...): undefined reference to `crypto_aead_ascon128av12_esp32_timingleaks_decrypt'
try.c: /usr/bin/ld: /tmp/ccpUq7DH.o: in function `test':
try.c: try-small.c:(.text+0x...): undefined reference to `crypto_aead_ascon128av12_esp32_timingleaks_encrypt'
try.c: /usr/bin/ld: try-small.c:(.text+0x...): undefined reference to `crypto_aead_ascon128av12_esp32_timingleaks_decrypt'
try.c: /usr/bin/ld: try-small.c:(.text+0x...): undefined reference to `crypto_aead_ascon128av12_esp32_timingleaks_decrypt'
try.c: /usr/bin/ld: try-small.c:(.text+0x...): undefined reference to `crypto_aead_ascon128av12_esp32_timingleaks_decrypt'
try.c: /usr/bin/ld: try-small.c:(.text+0x...): undefined reference to `crypto_aead_ascon128av12_esp32_timingleaks_decrypt'
try.c: /usr/bin/ld: try-small.c:(.text+0x...): undefined reference to `crypto_aead_ascon128av12_esp32_timingleaks_decrypt'
try.c: /usr/bin/ld: try-small.c:(.text+0x...): undefined reference to `crypto_aead_ascon128av12_esp32_timingleaks_encrypt'
try.c: collect2: error: ld returned 1 exit status

Number of similar (compiler,implementation) pairs: 1, namely:
CompilerImplementations
gcc -march=native -mtune=native -O3 -fomit-frame-pointer -fwrapv -fPIC -fPIE T:esp32

Compiler output

Implementation: T:esp32
Security model: timingleaks
Compiler: gcc -march=native -mtune=native -O -fomit-frame-pointer -fwrapv -fPIC -fPIE
try.c: /usr/bin/ld: /tmp/ccVUc0XW.o: in function `doit':
try.c: try-small.c:(.text+0x...): undefined reference to `crypto_aead_ascon128av12_esp32_timingleaks_encrypt'
try.c: /usr/bin/ld: try-small.c:(.text+0x...): undefined reference to `crypto_aead_ascon128av12_esp32_timingleaks_decrypt'
try.c: /usr/bin/ld: /tmp/ccVUc0XW.o: in function `test':
try.c: try-small.c:(.text+0x...): undefined reference to `crypto_aead_ascon128av12_esp32_timingleaks_encrypt'
try.c: /usr/bin/ld: try-small.c:(.text+0x...): undefined reference to `crypto_aead_ascon128av12_esp32_timingleaks_encrypt'
try.c: /usr/bin/ld: try-small.c:(.text+0x...): undefined reference to `crypto_aead_ascon128av12_esp32_timingleaks_decrypt'
try.c: /usr/bin/ld: try-small.c:(.text+0x...): undefined reference to `crypto_aead_ascon128av12_esp32_timingleaks_decrypt'
try.c: /usr/bin/ld: try-small.c:(.text+0x...): undefined reference to `crypto_aead_ascon128av12_esp32_timingleaks_decrypt'
try.c: /usr/bin/ld: try-small.c:(.text+0x...): undefined reference to `crypto_aead_ascon128av12_esp32_timingleaks_decrypt'
try.c: /usr/bin/ld: try-small.c:(.text+0x...): undefined reference to `crypto_aead_ascon128av12_esp32_timingleaks_decrypt'
try.c: collect2: error: ld returned 1 exit status

Number of similar (compiler,implementation) pairs: 1, namely:
CompilerImplementations
gcc -march=native -mtune=native -O -fomit-frame-pointer -fwrapv -fPIC -fPIE T:esp32

Compiler output

Implementation: T:esp32
Security model: timingleaks
Compiler: gcc -march=native -mtune=native -Os -fomit-frame-pointer -fwrapv -fPIC -fPIE
try.c: /usr/bin/ld: /tmp/cc5iRsTp.o: in function `doit':
try.c: try-small.c:(.text+0x...): undefined reference to `crypto_aead_ascon128av12_esp32_timingleaks_encrypt'
try.c: /usr/bin/ld: try-small.c:(.text+0x...): undefined reference to `crypto_aead_ascon128av12_esp32_timingleaks_decrypt'
try.c: /usr/bin/ld: /tmp/cc5iRsTp.o: in function `test':
try.c: try-small.c:(.text+0x...): undefined reference to `crypto_aead_ascon128av12_esp32_timingleaks_encrypt'
try.c: /usr/bin/ld: try-small.c:(.text+0x...): undefined reference to `crypto_aead_ascon128av12_esp32_timingleaks_encrypt'
try.c: /usr/bin/ld: try-small.c:(.text+0x...): undefined reference to `crypto_aead_ascon128av12_esp32_timingleaks_decrypt'
try.c: /usr/bin/ld: try-small.c:(.text+0x...): undefined reference to `crypto_aead_ascon128av12_esp32_timingleaks_decrypt'
try.c: /usr/bin/ld: try-small.c:(.text+0x...): undefined reference to `crypto_aead_ascon128av12_esp32_timingleaks_decrypt'
try.c: /usr/bin/ld: try-small.c:(.text+0x...): undefined reference to `crypto_aead_ascon128av12_esp32_timingleaks_decrypt'
try.c: /usr/bin/ld: try-small.c:(.text+0x...): undefined reference to `crypto_aead_ascon128av12_esp32_timingleaks_decrypt'
try.c: collect2: error: ld returned 1 exit status

Number of similar (compiler,implementation) pairs: 1, namely:
CompilerImplementations
gcc -march=native -mtune=native -Os -fomit-frame-pointer -fwrapv -fPIC -fPIE T:esp32