Implementation notes: amd64, jasper2, crypto_aead/aegis128

Computer: jasper2
Microarchitecture: amd64; Tremont (906c0)
Architecture: amd64
CPU ID: GenuineIntel-000906c0-20-bfebfbff
SUPERCOP version: 20240625
Operation: crypto_aead
Primitive: aegis128
TimeObject sizeTest sizeImplementationCompilerBenchmark dateSUPERCOP version
43554307 0 021856 812 1016T:aesniclang_-march=native_-O3_-fwrapv_-Qunused-arguments_-fPIC_-fPIE_-gdwarf-4_-Wall2024062820240625
43794291 0 019536 812 1016T:aesniclang_-march=native_-O2_-fwrapv_-Qunused-arguments_-fPIC_-fPIE_-gdwarf-4_-Wall2024062820240625
45112848 0 016222 804 1016T:aesniclang_-march=native_-Os_-fwrapv_-Qunused-arguments_-fPIC_-fPIE_-gdwarf-4_-Wall2024062820240625
49385300 0 020960 780 1080T:aesnigcc_-march=native_-mtune=native_-O3_-fwrapv_-fPIC_-fPIE_-gdwarf-4_-Wall2024062820240625
50953823 0 018304 780 1080T:aesnigcc_-march=native_-mtune=native_-O2_-fwrapv_-fPIC_-fPIE_-gdwarf-4_-Wall2024062820240625
51133582 0 017647 772 1080T:aesnigcc_-march=native_-mtune=native_-O_-fwrapv_-fPIC_-fPIE_-gdwarf-4_-Wall2024062820240625
529314932 4096 021264 4916 1016T:refclang_-mcpu=native_-O3_-fwrapv_-Qunused-arguments_-fPIC_-fPIE_-gdwarf-4_-Wall2024062820240625
541245349 4096 020992 4884 1080T:refgcc_-march=native_-mtune=native_-O3_-fwrapv_-fPIC_-fPIE_-gdwarf-4_-Wall2024062820240625
548764774 4096 018815 4876 1080T:refgcc_-march=native_-mtune=native_-O_-fwrapv_-fPIC_-fPIE_-gdwarf-4_-Wall2024062820240625
549373548 4096 018864 4916 1016T:refclang_-march=native_-O2_-fwrapv_-Qunused-arguments_-fPIC_-fPIE_-gdwarf-4_-Wall2024062820240625
549443496 4096 016918 4908 1016T:refclang_-march=native_-Os_-fwrapv_-Qunused-arguments_-fPIC_-fPIE_-gdwarf-4_-Wall2024062820240625
558245584 4096 020048 4884 1080T:refgcc_-march=native_-mtune=native_-O2_-fwrapv_-fPIC_-fPIE_-gdwarf-4_-Wall2024062820240625
574934852 4096 022472 4916 1016T:refclang_-march=native_-O3_-fwrapv_-Qunused-arguments_-fPIC_-fPIE_-gdwarf-4_-Wall2024062820240625

Compiler output


try.c: /usr/bin/ld: libcrypto_aead_aegis128.a(encrypt.o): in function `crypto_aead_aegis128_aesni_timingleaks_encrypt':
try.c: .../supercop-data/jasper2/amd64/try/c/clang_-march=native_-O_-fwrapv_-Qunused-arguments_-fPIC_-fPIE_-gdwarf-4_-Wall/timingleaks/crypto_aead/aegis128/aesni/work/encrypt.c:160: undefined reference to `aegis128_enc_aut_step'
try.c: /usr/bin/ld: .../supercop-data/jasper2/amd64/try/c/clang_-march=native_-O_-fwrapv_-Qunused-arguments_-fPIC_-fPIE_-gdwarf-4_-Wall/timingleaks/crypto_aead/aegis128/aesni/work/encrypt.c:168: undefined reference to `aegis128_enc_aut_step'
try.c: /usr/bin/ld: .../supercop-data/jasper2/amd64/try/c/clang_-march=native_-O_-fwrapv_-Qunused-arguments_-fPIC_-fPIE_-gdwarf-4_-Wall/timingleaks/crypto_aead/aegis128/aesni/work/encrypt.c:173: undefined reference to `aegis128_enc_aut_step'
try.c: /usr/bin/ld: .../supercop-data/jasper2/amd64/try/c/clang_-march=native_-O_-fwrapv_-Qunused-arguments_-fPIC_-fPIE_-gdwarf-4_-Wall/timingleaks/crypto_aead/aegis128/aesni/work/encrypt.c:181: undefined reference to `aegis128_enc_aut_step'
try.c: /usr/bin/ld: libcrypto_aead_aegis128.a(encrypt.o): in function `crypto_aead_aegis128_aesni_timingleaks_decrypt':
try.c: .../supercop-data/jasper2/amd64/try/c/clang_-march=native_-O_-fwrapv_-Qunused-arguments_-fPIC_-fPIE_-gdwarf-4_-Wall/timingleaks/crypto_aead/aegis128/aesni/work/encrypt.c:214: undefined reference to `aegis128_enc_aut_step'
try.c: /usr/bin/ld: libcrypto_aead_aegis128.a(encrypt.o):.../supercop-data/jasper2/amd64/try/c/clang_-march=native_-O_-fwrapv_-Qunused-arguments_-fPIC_-fPIE_-gdwarf-4_-Wall/timingleaks/crypto_aead/aegis128/aesni/work/encrypt.c:222: more undefined references to `aegis128_enc_aut_step' follow
try.c: /usr/bin/ld: libcrypto_aead_aegis128.a(encrypt.o): in function `crypto_aead_aegis128_aesni_timingleaks_decrypt':
try.c: .../supercop-data/jasper2/amd64/try/c/clang_-march=native_-O_-fwrapv_-Qunused-arguments_-fPIC_-fPIE_-gdwarf-4_-Wall/timingleaks/crypto_aead/aegis128/aesni/work/encrypt.c:228: undefined reference to `aegis128_dec_aut_step'
try.c: /usr/bin/ld: .../supercop-data/jasper2/amd64/try/c/clang_-march=native_-O_-fwrapv_-Qunused-arguments_-fPIC_-fPIE_-gdwarf-4_-Wall/timingleaks/crypto_aead/aegis128/aesni/work/encrypt.c:236: undefined reference to `aegis128_dec_aut_step'
try.c: clang: error: linker command failed with exit code 1 (use -v to see invocation)

Number of similar (implementation,compiler) pairs: 1, namely:
ImplementationCompiler
T:aesniclang -march=native -O -fwrapv -Qunused-arguments -fPIC -fPIE -gdwarf-4 -Wall (Debian_Clang_11.0.1)

Compiler output


encrypt.c: encrypt.c:34:25: error: always_inline function '_mm_aesenc_si128' requires target feature 'aes', but would be inlined into function 'aegis128_initialization' that is compiled without support for 'aes'
encrypt.c:              state[4] = _mm_aesenc_si128(state[3], state[4]);
encrypt.c:                         ^
encrypt.c: encrypt.c:35:25: error: always_inline function '_mm_aesenc_si128' requires target feature 'aes', but would be inlined into function 'aegis128_initialization' that is compiled without support for 'aes'
encrypt.c:              state[3] = _mm_aesenc_si128(state[2], state[3]);
encrypt.c:                         ^
encrypt.c: encrypt.c:36:25: error: always_inline function '_mm_aesenc_si128' requires target feature 'aes', but would be inlined into function 'aegis128_initialization' that is compiled without support for 'aes'
encrypt.c:              state[2] = _mm_aesenc_si128(state[1], state[2]);
encrypt.c:                         ^
encrypt.c: encrypt.c:37:25: error: always_inline function '_mm_aesenc_si128' requires target feature 'aes', but would be inlined into function 'aegis128_initialization' that is compiled without support for 'aes'
encrypt.c:              state[1] = _mm_aesenc_si128(state[0], state[1]);
encrypt.c:                         ^
encrypt.c: encrypt.c:38:25: error: always_inline function '_mm_aesenc_si128' requires target feature 'aes', but would be inlined into function 'aegis128_initialization' that is compiled without support for 'aes'
encrypt.c:              state[0] = _mm_aesenc_si128(tmp, state[0]);
encrypt.c:                         ^
encrypt.c: 5 errors generated.

Number of similar (implementation,compiler) pairs: 1, namely:
ImplementationCompiler
T:aesniclang -mcpu=native -O3 -fwrapv -Qunused-arguments -fPIC -fPIE -gdwarf-4 -Wall (Debian_Clang_11.0.1)

Compiler output


try.c: /usr/bin/ld: libcrypto_aead_aegis128.a(encrypt.o): in function `crypto_aead_aegis128_aesni_timingleaks_encrypt':
try.c: .../supercop-data/jasper2/amd64/try/c/gcc_-march=native_-mtune=native_-Os_-fwrapv_-fPIC_-fPIE_-gdwarf-4_-Wall/timingleaks/crypto_aead/aegis128/aesni/work/encrypt.c:160: undefined reference to `aegis128_enc_aut_step'
try.c: /usr/bin/ld: .../supercop-data/jasper2/amd64/try/c/gcc_-march=native_-mtune=native_-Os_-fwrapv_-fPIC_-fPIE_-gdwarf-4_-Wall/timingleaks/crypto_aead/aegis128/aesni/work/encrypt.c:168: undefined reference to `aegis128_enc_aut_step'
try.c: /usr/bin/ld: .../supercop-data/jasper2/amd64/try/c/gcc_-march=native_-mtune=native_-Os_-fwrapv_-fPIC_-fPIE_-gdwarf-4_-Wall/timingleaks/crypto_aead/aegis128/aesni/work/encrypt.c:173: undefined reference to `aegis128_enc_aut_step'
try.c: /usr/bin/ld: .../supercop-data/jasper2/amd64/try/c/gcc_-march=native_-mtune=native_-Os_-fwrapv_-fPIC_-fPIE_-gdwarf-4_-Wall/timingleaks/crypto_aead/aegis128/aesni/work/encrypt.c:181: undefined reference to `aegis128_enc_aut_step'
try.c: /usr/bin/ld: libcrypto_aead_aegis128.a(encrypt.o): in function `crypto_aead_aegis128_aesni_timingleaks_decrypt':
try.c: .../supercop-data/jasper2/amd64/try/c/gcc_-march=native_-mtune=native_-Os_-fwrapv_-fPIC_-fPIE_-gdwarf-4_-Wall/timingleaks/crypto_aead/aegis128/aesni/work/encrypt.c:214: undefined reference to `aegis128_enc_aut_step'
try.c: /usr/bin/ld: libcrypto_aead_aegis128.a(encrypt.o):.../supercop-data/jasper2/amd64/try/c/gcc_-march=native_-mtune=native_-Os_-fwrapv_-fPIC_-fPIE_-gdwarf-4_-Wall/timingleaks/crypto_aead/aegis128/aesni/work/encrypt.c:222: more undefined references to `aegis128_enc_aut_step' follow
try.c: /usr/bin/ld: libcrypto_aead_aegis128.a(encrypt.o): in function `crypto_aead_aegis128_aesni_timingleaks_decrypt':
try.c: .../supercop-data/jasper2/amd64/try/c/gcc_-march=native_-mtune=native_-Os_-fwrapv_-fPIC_-fPIE_-gdwarf-4_-Wall/timingleaks/crypto_aead/aegis128/aesni/work/encrypt.c:228: undefined reference to `aegis128_dec_aut_step'
try.c: /usr/bin/ld: .../supercop-data/jasper2/amd64/try/c/gcc_-march=native_-mtune=native_-Os_-fwrapv_-fPIC_-fPIE_-gdwarf-4_-Wall/timingleaks/crypto_aead/aegis128/aesni/work/encrypt.c:236: undefined reference to `aegis128_dec_aut_step'
try.c: collect2: error: ld returned 1 exit status

Number of similar (implementation,compiler) pairs: 1, namely:
ImplementationCompiler
T:aesnigcc -march=native -mtune=native -Os -fwrapv -fPIC -fPIE -gdwarf-4 -Wall (10.2.1_20210110)

Compiler output


try.c: /usr/bin/ld: libcrypto_aead_aegis128.a(encrypt.o): in function `crypto_aead_aegis128_ref_timingleaks_encrypt':
try.c: .../supercop-data/jasper2/amd64/try/c/clang_-march=native_-O_-fwrapv_-Qunused-arguments_-fPIC_-fPIE_-gdwarf-4_-Wall/timingleaks/crypto_aead/aegis128/ref/work/encrypt.c:164: undefined reference to `aegis128_enc_aut_step'
try.c: /usr/bin/ld: .../supercop-data/jasper2/amd64/try/c/clang_-march=native_-O_-fwrapv_-Qunused-arguments_-fPIC_-fPIE_-gdwarf-4_-Wall/timingleaks/crypto_aead/aegis128/ref/work/encrypt.c:172: undefined reference to `aegis128_enc_aut_step'
try.c: /usr/bin/ld: .../supercop-data/jasper2/amd64/try/c/clang_-march=native_-O_-fwrapv_-Qunused-arguments_-fPIC_-fPIE_-gdwarf-4_-Wall/timingleaks/crypto_aead/aegis128/ref/work/encrypt.c:178: undefined reference to `aegis128_enc_aut_step'
try.c: /usr/bin/ld: .../supercop-data/jasper2/amd64/try/c/clang_-march=native_-O_-fwrapv_-Qunused-arguments_-fPIC_-fPIE_-gdwarf-4_-Wall/timingleaks/crypto_aead/aegis128/ref/work/encrypt.c:186: undefined reference to `aegis128_enc_aut_step'
try.c: /usr/bin/ld: libcrypto_aead_aegis128.a(encrypt.o): in function `crypto_aead_aegis128_ref_timingleaks_decrypt':
try.c: .../supercop-data/jasper2/amd64/try/c/clang_-march=native_-O_-fwrapv_-Qunused-arguments_-fPIC_-fPIE_-gdwarf-4_-Wall/timingleaks/crypto_aead/aegis128/ref/work/encrypt.c:220: undefined reference to `aegis128_enc_aut_step'
try.c: /usr/bin/ld: libcrypto_aead_aegis128.a(encrypt.o):.../supercop-data/jasper2/amd64/try/c/clang_-march=native_-O_-fwrapv_-Qunused-arguments_-fPIC_-fPIE_-gdwarf-4_-Wall/timingleaks/crypto_aead/aegis128/ref/work/encrypt.c:228: more undefined references to `aegis128_enc_aut_step' follow
try.c: /usr/bin/ld: libcrypto_aead_aegis128.a(encrypt.o): in function `crypto_aead_aegis128_ref_timingleaks_decrypt':
try.c: .../supercop-data/jasper2/amd64/try/c/clang_-march=native_-O_-fwrapv_-Qunused-arguments_-fPIC_-fPIE_-gdwarf-4_-Wall/timingleaks/crypto_aead/aegis128/ref/work/encrypt.c:236: undefined reference to `aegis128_dec_aut_step'
try.c: /usr/bin/ld: .../supercop-data/jasper2/amd64/try/c/clang_-march=native_-O_-fwrapv_-Qunused-arguments_-fPIC_-fPIE_-gdwarf-4_-Wall/timingleaks/crypto_aead/aegis128/ref/work/encrypt.c:244: undefined reference to `aegis128_dec_aut_step'
try.c: clang: error: linker command failed with exit code 1 (use -v to see invocation)

Number of similar (implementation,compiler) pairs: 1, namely:
ImplementationCompiler
T:refclang -march=native -O -fwrapv -Qunused-arguments -fPIC -fPIE -gdwarf-4 -Wall (Debian_Clang_11.0.1)

Compiler output


try.c: /usr/bin/ld: libcrypto_aead_aegis128.a(encrypt.o): in function `crypto_aead_aegis128_ref_timingleaks_encrypt':
try.c: .../supercop-data/jasper2/amd64/try/c/gcc_-march=native_-mtune=native_-Os_-fwrapv_-fPIC_-fPIE_-gdwarf-4_-Wall/timingleaks/crypto_aead/aegis128/ref/work/encrypt.c:164: undefined reference to `aegis128_enc_aut_step'
try.c: /usr/bin/ld: .../supercop-data/jasper2/amd64/try/c/gcc_-march=native_-mtune=native_-Os_-fwrapv_-fPIC_-fPIE_-gdwarf-4_-Wall/timingleaks/crypto_aead/aegis128/ref/work/encrypt.c:172: undefined reference to `aegis128_enc_aut_step'
try.c: /usr/bin/ld: .../supercop-data/jasper2/amd64/try/c/gcc_-march=native_-mtune=native_-Os_-fwrapv_-fPIC_-fPIE_-gdwarf-4_-Wall/timingleaks/crypto_aead/aegis128/ref/work/encrypt.c:178: undefined reference to `aegis128_enc_aut_step'
try.c: /usr/bin/ld: .../supercop-data/jasper2/amd64/try/c/gcc_-march=native_-mtune=native_-Os_-fwrapv_-fPIC_-fPIE_-gdwarf-4_-Wall/timingleaks/crypto_aead/aegis128/ref/work/encrypt.c:186: undefined reference to `aegis128_enc_aut_step'
try.c: /usr/bin/ld: libcrypto_aead_aegis128.a(encrypt.o): in function `crypto_aead_aegis128_ref_timingleaks_decrypt':
try.c: .../supercop-data/jasper2/amd64/try/c/gcc_-march=native_-mtune=native_-Os_-fwrapv_-fPIC_-fPIE_-gdwarf-4_-Wall/timingleaks/crypto_aead/aegis128/ref/work/encrypt.c:220: undefined reference to `aegis128_enc_aut_step'
try.c: /usr/bin/ld: libcrypto_aead_aegis128.a(encrypt.o):.../supercop-data/jasper2/amd64/try/c/gcc_-march=native_-mtune=native_-Os_-fwrapv_-fPIC_-fPIE_-gdwarf-4_-Wall/timingleaks/crypto_aead/aegis128/ref/work/encrypt.c:228: more undefined references to `aegis128_enc_aut_step' follow
try.c: /usr/bin/ld: libcrypto_aead_aegis128.a(encrypt.o): in function `crypto_aead_aegis128_ref_timingleaks_decrypt':
try.c: .../supercop-data/jasper2/amd64/try/c/gcc_-march=native_-mtune=native_-Os_-fwrapv_-fPIC_-fPIE_-gdwarf-4_-Wall/timingleaks/crypto_aead/aegis128/ref/work/encrypt.c:236: undefined reference to `aegis128_dec_aut_step'
try.c: /usr/bin/ld: .../supercop-data/jasper2/amd64/try/c/gcc_-march=native_-mtune=native_-Os_-fwrapv_-fPIC_-fPIE_-gdwarf-4_-Wall/timingleaks/crypto_aead/aegis128/ref/work/encrypt.c:244: undefined reference to `aegis128_dec_aut_step'
try.c: collect2: error: ld returned 1 exit status

Number of similar (implementation,compiler) pairs: 1, namely:
ImplementationCompiler
T:refgcc -march=native -mtune=native -Os -fwrapv -fPIC -fPIE -gdwarf-4 -Wall (10.2.1_20210110)