Implementation notes: amd64, jasper, crypto_aead/omdsha256k128n96tau64v1

Computer: jasper
Microarchitecture: amd64; Tremont (906c0)
Architecture: amd64
CPU ID: GenuineIntel-000906c0-20-bfebfbff
SUPERCOP version: 20240625
Operation: crypto_aead
Primitive: omdsha256k128n96tau64v1
TimeObject sizeTest sizeImplementationCompilerBenchmark dateSUPERCOP version
26632922780 0 044776 780 1080T:refgcc_-march=native_-mtune=native_-O3_-fwrapv_-fPIC_-fPIE_-gdwarf-4_-Wall2024062720240625
28332710385 0 031728 812 1016T:refclang_-march=native_-O2_-fwrapv_-Qunused-arguments_-fPIC_-fPIE_-gdwarf-4_-Wall2024062720240625
2894728467 0 032240 812 1016T:refclang_-march=native_-O3_-fwrapv_-Qunused-arguments_-fPIC_-fPIE_-gdwarf-4_-Wall2024062720240625
3019418889 0 031272 812 1016T:refclang_-mcpu=native_-O3_-fwrapv_-Qunused-arguments_-fPIC_-fPIE_-gdwarf-4_-Wall2024062720240625
3042714713 0 024278 804 1016T:refclang_-march=native_-Os_-fwrapv_-Qunused-arguments_-fPIC_-fPIE_-gdwarf-4_-Wall2024062720240625
3087356651 0 027496 780 1080T:refgcc_-march=native_-mtune=native_-O2_-fwrapv_-fPIC_-fPIE_-gdwarf-4_-Wall2024062720240625
3184636041 0 026335 772 1080T:refgcc_-march=native_-mtune=native_-O_-fwrapv_-fPIC_-fPIE_-gdwarf-4_-Wall2024062720240625
3246194442 0 024470 804 1016T:refclang_-march=native_-O_-fwrapv_-Qunused-arguments_-fPIC_-fPIE_-gdwarf-4_-Wall2024062720240625
3336174059 0 022899 756 1048T:refgcc_-march=native_-mtune=native_-Os_-fwrapv_-fPIC_-fPIE_-gdwarf-4_-Wall2024062720240625

Compiler output


try.c: /usr/bin/ld: libcrypto_aead_omdsha256k128n96tau64v1.a(omdsha256.o):.../supercop-data/jasper/amd64/try/c/clang_-march=native_-O2_-fwrapv_-Qunused-arguments_-fPIC_-fPIE_-gdwarf-4_-Wall/timingleaks/crypto_aead/omdsha256k128n96tau64v1/avx1/work/./omdsha256.h:137: multiple definition of `Hash'; libcrypto_aead_omdsha256k128n96tau64v1.a(encrypt.o):.../supercop-data/jasper/amd64/try/c/clang_-march=native_-O2_-fwrapv_-Qunused-arguments_-fPIC_-fPIE_-gdwarf-4_-Wall/timingleaks/crypto_aead/omdsha256k128n96tau64v1/avx1/work/./omdsha256.h:137: first defined here
try.c: clang: error: linker command failed with exit code 1 (use -v to see invocation)

Number of similar (implementation,compiler) pairs: 1, namely:
ImplementationCompiler
T:avx1clang -march=native -O2 -fwrapv -Qunused-arguments -fPIC -fPIE -gdwarf-4 -Wall (Debian_Clang_11.0.1)

Compiler output


try.c: /usr/bin/ld: libcrypto_aead_omdsha256k128n96tau64v1.a(omdsha256.o):.../supercop-data/jasper/amd64/try/c/clang_-march=native_-O3_-fwrapv_-Qunused-arguments_-fPIC_-fPIE_-gdwarf-4_-Wall/timingleaks/crypto_aead/omdsha256k128n96tau64v1/avx1/work/./omdsha256.h:137: multiple definition of `Hash'; libcrypto_aead_omdsha256k128n96tau64v1.a(encrypt.o):.../supercop-data/jasper/amd64/try/c/clang_-march=native_-O3_-fwrapv_-Qunused-arguments_-fPIC_-fPIE_-gdwarf-4_-Wall/timingleaks/crypto_aead/omdsha256k128n96tau64v1/avx1/work/./omdsha256.h:137: first defined here
try.c: clang: error: linker command failed with exit code 1 (use -v to see invocation)

Number of similar (implementation,compiler) pairs: 1, namely:
ImplementationCompiler
T:avx1clang -march=native -O3 -fwrapv -Qunused-arguments -fPIC -fPIE -gdwarf-4 -Wall (Debian_Clang_11.0.1)

Compiler output


try.c: /usr/bin/ld: libcrypto_aead_omdsha256k128n96tau64v1.a(omdsha256.o):.../supercop-data/jasper/amd64/try/c/clang_-march=native_-O_-fwrapv_-Qunused-arguments_-fPIC_-fPIE_-gdwarf-4_-Wall/timingleaks/crypto_aead/omdsha256k128n96tau64v1/avx1/work/./omdsha256.h:137: multiple definition of `Hash'; libcrypto_aead_omdsha256k128n96tau64v1.a(encrypt.o):.../supercop-data/jasper/amd64/try/c/clang_-march=native_-O_-fwrapv_-Qunused-arguments_-fPIC_-fPIE_-gdwarf-4_-Wall/timingleaks/crypto_aead/omdsha256k128n96tau64v1/avx1/work/./omdsha256.h:137: first defined here
try.c: clang: error: linker command failed with exit code 1 (use -v to see invocation)

Number of similar (implementation,compiler) pairs: 1, namely:
ImplementationCompiler
T:avx1clang -march=native -O -fwrapv -Qunused-arguments -fPIC -fPIE -gdwarf-4 -Wall (Debian_Clang_11.0.1)

Compiler output


try.c: /usr/bin/ld: libcrypto_aead_omdsha256k128n96tau64v1.a(omdsha256.o):.../supercop-data/jasper/amd64/try/c/clang_-march=native_-Os_-fwrapv_-Qunused-arguments_-fPIC_-fPIE_-gdwarf-4_-Wall/timingleaks/crypto_aead/omdsha256k128n96tau64v1/avx1/work/./omdsha256.h:137: multiple definition of `Hash'; libcrypto_aead_omdsha256k128n96tau64v1.a(encrypt.o):.../supercop-data/jasper/amd64/try/c/clang_-march=native_-Os_-fwrapv_-Qunused-arguments_-fPIC_-fPIE_-gdwarf-4_-Wall/timingleaks/crypto_aead/omdsha256k128n96tau64v1/avx1/work/./omdsha256.h:137: first defined here
try.c: clang: error: linker command failed with exit code 1 (use -v to see invocation)

Number of similar (implementation,compiler) pairs: 1, namely:
ImplementationCompiler
T:avx1clang -march=native -Os -fwrapv -Qunused-arguments -fPIC -fPIE -gdwarf-4 -Wall (Debian_Clang_11.0.1)

Compiler output


try.c: /usr/bin/ld: libcrypto_aead_omdsha256k128n96tau64v1.a(omdsha256.o):.../supercop-data/jasper/amd64/try/c/clang_-mcpu=native_-O3_-fwrapv_-Qunused-arguments_-fPIC_-fPIE_-gdwarf-4_-Wall/timingleaks/crypto_aead/omdsha256k128n96tau64v1/avx1/work/./omdsha256.h:137: multiple definition of `Hash'; libcrypto_aead_omdsha256k128n96tau64v1.a(encrypt.o):.../supercop-data/jasper/amd64/try/c/clang_-mcpu=native_-O3_-fwrapv_-Qunused-arguments_-fPIC_-fPIE_-gdwarf-4_-Wall/timingleaks/crypto_aead/omdsha256k128n96tau64v1/avx1/work/./omdsha256.h:137: first defined here
try.c: clang: error: linker command failed with exit code 1 (use -v to see invocation)

Number of similar (implementation,compiler) pairs: 1, namely:
ImplementationCompiler
T:avx1clang -mcpu=native -O3 -fwrapv -Qunused-arguments -fPIC -fPIE -gdwarf-4 -Wall (Debian_Clang_11.0.1)

Compiler output


encrypt.c: /tmp/ccBrfo1Y.s: Assembler messages:
encrypt.c: /tmp/ccBrfo1Y.s:5287: Error: can't resolve `.data' {.data section} - `.Ltext0' {.text section}
encrypt.c: /tmp/ccBrfo1Y.s:5288: Error: can't resolve `.data' {.data section} - `.Ltext0' {.text section}
encrypt.c: /tmp/ccBrfo1Y.s:5291: Error: can't resolve `.data' {.data section} - `.Ltext0' {.text section}
encrypt.c: /tmp/ccBrfo1Y.s:5292: Error: can't resolve `.data' {.data section} - `.Ltext0' {.text section}
encrypt.c: /tmp/ccBrfo1Y.s:5308: Error: can't resolve `.data' {.data section} - `.Ltext0' {.text section}
encrypt.c: /tmp/ccBrfo1Y.s:5309: Error: can't resolve `.data' {.data section} - `.Ltext0' {.text section}
encrypt.c: /tmp/ccBrfo1Y.s:5312: Error: can't resolve `.data' {.data section} - `.Ltext0' {.text section}
encrypt.c: /tmp/ccBrfo1Y.s:5313: Error: can't resolve `.data' {.data section} - `.Ltext0' {.text section}
encrypt.c: /tmp/ccBrfo1Y.s:5316: Error: can't resolve `.data' {.data section} - `.Ltext0' {.text section}
encrypt.c: /tmp/ccBrfo1Y.s:5317: Error: can't resolve `.data' {.data section} - `.Ltext0' {.text section}
encrypt.c: /tmp/ccBrfo1Y.s:5331: Error: can't resolve `.data' {.data section} - `.Ltext0' {.text section}
encrypt.c: /tmp/ccBrfo1Y.s:5332: Error: can't resolve `.data' {.data section} - `.Ltext0' {.text section}
encrypt.c: /tmp/ccBrfo1Y.s:5335: Error: can't resolve `.data' {.data section} - `.Ltext0' {.text section}
encrypt.c: /tmp/ccBrfo1Y.s:5336: Error: can't resolve `.data' {.data section} - `.Ltext0' {.text section}
encrypt.c: /tmp/ccBrfo1Y.s:5352: Error: can't resolve `.data' {.data section} - `.Ltext0' {.text section}
encrypt.c: /tmp/ccBrfo1Y.s:5353: Error: can't resolve `.data' {.data section} - `.Ltext0' {.text section}
encrypt.c: /tmp/ccBrfo1Y.s:5356: Error: can't resolve `.data' {.data section} - `.Ltext0' {.text section}
encrypt.c: /tmp/ccBrfo1Y.s:5357: Error: can't resolve `.data' {.data section} - `.Ltext0' {.text section}
encrypt.c: /tmp/ccBrfo1Y.s:5360: Error: can't resolve `.data' {.data section} - `.Ltext0' {.text section}
encrypt.c: /tmp/ccBrfo1Y.s:5361: Error: can't resolve `.data' {.data section} - `.Ltext0' {.text section}
encrypt.c: /tmp/ccBrfo1Y.s:5379: Error: can't resolve `.data' {.data section} - `.Ltext0' {.text section}
encrypt.c: /tmp/ccBrfo1Y.s:5380: Error: can't resolve `.data' {.data section} - `.Ltext0' {.text section}
encrypt.c: /tmp/ccBrfo1Y.s:5383: Error: can't resolve `.data' {.data section} - `.Ltext0' {.text section}
encrypt.c: /tmp/ccBrfo1Y.s:5384: Error: can't resolve `.data' {.data section} - `.Ltext0' {.text section}
encrypt.c: ...

Number of similar (implementation,compiler) pairs: 1, namely:
ImplementationCompiler
T:avx1gcc -march=native -mtune=native -O2 -fwrapv -fPIC -fPIE -gdwarf-4 -Wall (10.2.1_20210110)

Compiler output


encrypt.c: /tmp/ccFBUIT9.s: Assembler messages:
encrypt.c: /tmp/ccFBUIT9.s:5287: Error: can't resolve `.data' {.data section} - `.Ltext0' {.text section}
encrypt.c: /tmp/ccFBUIT9.s:5288: Error: can't resolve `.data' {.data section} - `.Ltext0' {.text section}
encrypt.c: /tmp/ccFBUIT9.s:5291: Error: can't resolve `.data' {.data section} - `.Ltext0' {.text section}
encrypt.c: /tmp/ccFBUIT9.s:5292: Error: can't resolve `.data' {.data section} - `.Ltext0' {.text section}
encrypt.c: /tmp/ccFBUIT9.s:5308: Error: can't resolve `.data' {.data section} - `.Ltext0' {.text section}
encrypt.c: /tmp/ccFBUIT9.s:5309: Error: can't resolve `.data' {.data section} - `.Ltext0' {.text section}
encrypt.c: /tmp/ccFBUIT9.s:5312: Error: can't resolve `.data' {.data section} - `.Ltext0' {.text section}
encrypt.c: /tmp/ccFBUIT9.s:5313: Error: can't resolve `.data' {.data section} - `.Ltext0' {.text section}
encrypt.c: /tmp/ccFBUIT9.s:5316: Error: can't resolve `.data' {.data section} - `.Ltext0' {.text section}
encrypt.c: /tmp/ccFBUIT9.s:5317: Error: can't resolve `.data' {.data section} - `.Ltext0' {.text section}
encrypt.c: /tmp/ccFBUIT9.s:5331: Error: can't resolve `.data' {.data section} - `.Ltext0' {.text section}
encrypt.c: /tmp/ccFBUIT9.s:5332: Error: can't resolve `.data' {.data section} - `.Ltext0' {.text section}
encrypt.c: /tmp/ccFBUIT9.s:5335: Error: can't resolve `.data' {.data section} - `.Ltext0' {.text section}
encrypt.c: /tmp/ccFBUIT9.s:5336: Error: can't resolve `.data' {.data section} - `.Ltext0' {.text section}
encrypt.c: /tmp/ccFBUIT9.s:5352: Error: can't resolve `.data' {.data section} - `.Ltext0' {.text section}
encrypt.c: /tmp/ccFBUIT9.s:5353: Error: can't resolve `.data' {.data section} - `.Ltext0' {.text section}
encrypt.c: /tmp/ccFBUIT9.s:5356: Error: can't resolve `.data' {.data section} - `.Ltext0' {.text section}
encrypt.c: /tmp/ccFBUIT9.s:5357: Error: can't resolve `.data' {.data section} - `.Ltext0' {.text section}
encrypt.c: /tmp/ccFBUIT9.s:5360: Error: can't resolve `.data' {.data section} - `.Ltext0' {.text section}
encrypt.c: /tmp/ccFBUIT9.s:5361: Error: can't resolve `.data' {.data section} - `.Ltext0' {.text section}
encrypt.c: /tmp/ccFBUIT9.s:5379: Error: can't resolve `.data' {.data section} - `.Ltext0' {.text section}
encrypt.c: /tmp/ccFBUIT9.s:5380: Error: can't resolve `.data' {.data section} - `.Ltext0' {.text section}
encrypt.c: /tmp/ccFBUIT9.s:5383: Error: can't resolve `.data' {.data section} - `.Ltext0' {.text section}
encrypt.c: /tmp/ccFBUIT9.s:5384: Error: can't resolve `.data' {.data section} - `.Ltext0' {.text section}
encrypt.c: ...

Number of similar (implementation,compiler) pairs: 1, namely:
ImplementationCompiler
T:avx1gcc -march=native -mtune=native -O3 -fwrapv -fPIC -fPIE -gdwarf-4 -Wall (10.2.1_20210110)

Compiler output


encrypt.c: /tmp/ccWecYdl.s: Assembler messages:
encrypt.c: /tmp/ccWecYdl.s:5283: Error: can't resolve `.data' {.data section} - `.Ltext0' {.text section}
encrypt.c: /tmp/ccWecYdl.s:5284: Error: can't resolve `.data' {.data section} - `.Ltext0' {.text section}
encrypt.c: /tmp/ccWecYdl.s:5287: Error: can't resolve `.data' {.data section} - `.Ltext0' {.text section}
encrypt.c: /tmp/ccWecYdl.s:5288: Error: can't resolve `.data' {.data section} - `.Ltext0' {.text section}
encrypt.c: /tmp/ccWecYdl.s:5304: Error: can't resolve `.data' {.data section} - `.Ltext0' {.text section}
encrypt.c: /tmp/ccWecYdl.s:5305: Error: can't resolve `.data' {.data section} - `.Ltext0' {.text section}
encrypt.c: /tmp/ccWecYdl.s:5308: Error: can't resolve `.data' {.data section} - `.Ltext0' {.text section}
encrypt.c: /tmp/ccWecYdl.s:5309: Error: can't resolve `.data' {.data section} - `.Ltext0' {.text section}
encrypt.c: /tmp/ccWecYdl.s:5312: Error: can't resolve `.data' {.data section} - `.Ltext0' {.text section}
encrypt.c: /tmp/ccWecYdl.s:5313: Error: can't resolve `.data' {.data section} - `.Ltext0' {.text section}
encrypt.c: /tmp/ccWecYdl.s:5327: Error: can't resolve `.data' {.data section} - `.Ltext0' {.text section}
encrypt.c: /tmp/ccWecYdl.s:5328: Error: can't resolve `.data' {.data section} - `.Ltext0' {.text section}
encrypt.c: /tmp/ccWecYdl.s:5331: Error: can't resolve `.data' {.data section} - `.Ltext0' {.text section}
encrypt.c: /tmp/ccWecYdl.s:5332: Error: can't resolve `.data' {.data section} - `.Ltext0' {.text section}
encrypt.c: /tmp/ccWecYdl.s:5348: Error: can't resolve `.data' {.data section} - `.Ltext0' {.text section}
encrypt.c: /tmp/ccWecYdl.s:5349: Error: can't resolve `.data' {.data section} - `.Ltext0' {.text section}
encrypt.c: /tmp/ccWecYdl.s:5352: Error: can't resolve `.data' {.data section} - `.Ltext0' {.text section}
encrypt.c: /tmp/ccWecYdl.s:5353: Error: can't resolve `.data' {.data section} - `.Ltext0' {.text section}
encrypt.c: /tmp/ccWecYdl.s:5356: Error: can't resolve `.data' {.data section} - `.Ltext0' {.text section}
encrypt.c: /tmp/ccWecYdl.s:5357: Error: can't resolve `.data' {.data section} - `.Ltext0' {.text section}
encrypt.c: /tmp/ccWecYdl.s:5375: Error: can't resolve `.data' {.data section} - `.Ltext0' {.text section}
encrypt.c: /tmp/ccWecYdl.s:5376: Error: can't resolve `.data' {.data section} - `.Ltext0' {.text section}
encrypt.c: /tmp/ccWecYdl.s:5379: Error: can't resolve `.data' {.data section} - `.Ltext0' {.text section}
encrypt.c: /tmp/ccWecYdl.s:5380: Error: can't resolve `.data' {.data section} - `.Ltext0' {.text section}
encrypt.c: ...

Number of similar (implementation,compiler) pairs: 1, namely:
ImplementationCompiler
T:avx1gcc -march=native -mtune=native -O -fwrapv -fPIC -fPIE -gdwarf-4 -Wall (10.2.1_20210110)

Compiler output


encrypt.c: /tmp/cc4p2TK2.s: Assembler messages:
encrypt.c: /tmp/cc4p2TK2.s:5267: Error: can't resolve `.data' {.data section} - `.Ltext0' {.text section}
encrypt.c: /tmp/cc4p2TK2.s:5268: Error: can't resolve `.data' {.data section} - `.Ltext0' {.text section}
encrypt.c: /tmp/cc4p2TK2.s:5271: Error: can't resolve `.data' {.data section} - `.Ltext0' {.text section}
encrypt.c: /tmp/cc4p2TK2.s:5272: Error: can't resolve `.data' {.data section} - `.Ltext0' {.text section}
encrypt.c: /tmp/cc4p2TK2.s:5288: Error: can't resolve `.data' {.data section} - `.Ltext0' {.text section}
encrypt.c: /tmp/cc4p2TK2.s:5289: Error: can't resolve `.data' {.data section} - `.Ltext0' {.text section}
encrypt.c: /tmp/cc4p2TK2.s:5292: Error: can't resolve `.data' {.data section} - `.Ltext0' {.text section}
encrypt.c: /tmp/cc4p2TK2.s:5293: Error: can't resolve `.data' {.data section} - `.Ltext0' {.text section}
encrypt.c: /tmp/cc4p2TK2.s:5296: Error: can't resolve `.data' {.data section} - `.Ltext0' {.text section}
encrypt.c: /tmp/cc4p2TK2.s:5297: Error: can't resolve `.data' {.data section} - `.Ltext0' {.text section}
encrypt.c: /tmp/cc4p2TK2.s:5311: Error: can't resolve `.data' {.data section} - `.Ltext0' {.text section}
encrypt.c: /tmp/cc4p2TK2.s:5312: Error: can't resolve `.data' {.data section} - `.Ltext0' {.text section}
encrypt.c: /tmp/cc4p2TK2.s:5315: Error: can't resolve `.data' {.data section} - `.Ltext0' {.text section}
encrypt.c: /tmp/cc4p2TK2.s:5316: Error: can't resolve `.data' {.data section} - `.Ltext0' {.text section}
encrypt.c: /tmp/cc4p2TK2.s:5332: Error: can't resolve `.data' {.data section} - `.Ltext0' {.text section}
encrypt.c: /tmp/cc4p2TK2.s:5333: Error: can't resolve `.data' {.data section} - `.Ltext0' {.text section}
encrypt.c: /tmp/cc4p2TK2.s:5336: Error: can't resolve `.data' {.data section} - `.Ltext0' {.text section}
encrypt.c: /tmp/cc4p2TK2.s:5337: Error: can't resolve `.data' {.data section} - `.Ltext0' {.text section}
encrypt.c: /tmp/cc4p2TK2.s:5340: Error: can't resolve `.data' {.data section} - `.Ltext0' {.text section}
encrypt.c: /tmp/cc4p2TK2.s:5341: Error: can't resolve `.data' {.data section} - `.Ltext0' {.text section}
encrypt.c: /tmp/cc4p2TK2.s:5359: Error: can't resolve `.data' {.data section} - `.Ltext0' {.text section}
encrypt.c: /tmp/cc4p2TK2.s:5360: Error: can't resolve `.data' {.data section} - `.Ltext0' {.text section}
encrypt.c: /tmp/cc4p2TK2.s:5363: Error: can't resolve `.data' {.data section} - `.Ltext0' {.text section}
encrypt.c: /tmp/cc4p2TK2.s:5364: Error: can't resolve `.data' {.data section} - `.Ltext0' {.text section}
encrypt.c: ...

Number of similar (implementation,compiler) pairs: 1, namely:
ImplementationCompiler
T:avx1gcc -march=native -mtune=native -Os -fwrapv -fPIC -fPIE -gdwarf-4 -Wall (10.2.1_20210110)

Compiler output


try.c: /usr/bin/ld: libcrypto_aead_omdsha256k128n96tau64v1.a(omdsha256.o):.../supercop-data/jasper/amd64/try/c/clang_-march=native_-O2_-fwrapv_-Qunused-arguments_-fPIC_-fPIE_-gdwarf-4_-Wall/timingleaks/crypto_aead/omdsha256k128n96tau64v1/sse4/work/./omdsha256.h:137: multiple definition of `Hash'; libcrypto_aead_omdsha256k128n96tau64v1.a(encrypt.o):.../supercop-data/jasper/amd64/try/c/clang_-march=native_-O2_-fwrapv_-Qunused-arguments_-fPIC_-fPIE_-gdwarf-4_-Wall/timingleaks/crypto_aead/omdsha256k128n96tau64v1/sse4/work/./omdsha256.h:137: first defined here
try.c: clang: error: linker command failed with exit code 1 (use -v to see invocation)

Number of similar (implementation,compiler) pairs: 1, namely:
ImplementationCompiler
T:sse4clang -march=native -O2 -fwrapv -Qunused-arguments -fPIC -fPIE -gdwarf-4 -Wall (Debian_Clang_11.0.1)

Compiler output


try.c: /usr/bin/ld: libcrypto_aead_omdsha256k128n96tau64v1.a(omdsha256.o):.../supercop-data/jasper/amd64/try/c/clang_-march=native_-O3_-fwrapv_-Qunused-arguments_-fPIC_-fPIE_-gdwarf-4_-Wall/timingleaks/crypto_aead/omdsha256k128n96tau64v1/sse4/work/./omdsha256.h:137: multiple definition of `Hash'; libcrypto_aead_omdsha256k128n96tau64v1.a(encrypt.o):.../supercop-data/jasper/amd64/try/c/clang_-march=native_-O3_-fwrapv_-Qunused-arguments_-fPIC_-fPIE_-gdwarf-4_-Wall/timingleaks/crypto_aead/omdsha256k128n96tau64v1/sse4/work/./omdsha256.h:137: first defined here
try.c: clang: error: linker command failed with exit code 1 (use -v to see invocation)

Number of similar (implementation,compiler) pairs: 1, namely:
ImplementationCompiler
T:sse4clang -march=native -O3 -fwrapv -Qunused-arguments -fPIC -fPIE -gdwarf-4 -Wall (Debian_Clang_11.0.1)

Compiler output


try.c: /usr/bin/ld: libcrypto_aead_omdsha256k128n96tau64v1.a(omdsha256.o):.../supercop-data/jasper/amd64/try/c/clang_-march=native_-O_-fwrapv_-Qunused-arguments_-fPIC_-fPIE_-gdwarf-4_-Wall/timingleaks/crypto_aead/omdsha256k128n96tau64v1/sse4/work/./omdsha256.h:137: multiple definition of `Hash'; libcrypto_aead_omdsha256k128n96tau64v1.a(encrypt.o):.../supercop-data/jasper/amd64/try/c/clang_-march=native_-O_-fwrapv_-Qunused-arguments_-fPIC_-fPIE_-gdwarf-4_-Wall/timingleaks/crypto_aead/omdsha256k128n96tau64v1/sse4/work/./omdsha256.h:137: first defined here
try.c: clang: error: linker command failed with exit code 1 (use -v to see invocation)

Number of similar (implementation,compiler) pairs: 1, namely:
ImplementationCompiler
T:sse4clang -march=native -O -fwrapv -Qunused-arguments -fPIC -fPIE -gdwarf-4 -Wall (Debian_Clang_11.0.1)

Compiler output


try.c: /usr/bin/ld: libcrypto_aead_omdsha256k128n96tau64v1.a(omdsha256.o):.../supercop-data/jasper/amd64/try/c/clang_-march=native_-Os_-fwrapv_-Qunused-arguments_-fPIC_-fPIE_-gdwarf-4_-Wall/timingleaks/crypto_aead/omdsha256k128n96tau64v1/sse4/work/./omdsha256.h:137: multiple definition of `Hash'; libcrypto_aead_omdsha256k128n96tau64v1.a(encrypt.o):.../supercop-data/jasper/amd64/try/c/clang_-march=native_-Os_-fwrapv_-Qunused-arguments_-fPIC_-fPIE_-gdwarf-4_-Wall/timingleaks/crypto_aead/omdsha256k128n96tau64v1/sse4/work/./omdsha256.h:137: first defined here
try.c: clang: error: linker command failed with exit code 1 (use -v to see invocation)

Number of similar (implementation,compiler) pairs: 1, namely:
ImplementationCompiler
T:sse4clang -march=native -Os -fwrapv -Qunused-arguments -fPIC -fPIE -gdwarf-4 -Wall (Debian_Clang_11.0.1)

Compiler output


try.c: /usr/bin/ld: libcrypto_aead_omdsha256k128n96tau64v1.a(omdsha256.o):.../supercop-data/jasper/amd64/try/c/clang_-mcpu=native_-O3_-fwrapv_-Qunused-arguments_-fPIC_-fPIE_-gdwarf-4_-Wall/timingleaks/crypto_aead/omdsha256k128n96tau64v1/sse4/work/./omdsha256.h:137: multiple definition of `Hash'; libcrypto_aead_omdsha256k128n96tau64v1.a(encrypt.o):.../supercop-data/jasper/amd64/try/c/clang_-mcpu=native_-O3_-fwrapv_-Qunused-arguments_-fPIC_-fPIE_-gdwarf-4_-Wall/timingleaks/crypto_aead/omdsha256k128n96tau64v1/sse4/work/./omdsha256.h:137: first defined here
try.c: clang: error: linker command failed with exit code 1 (use -v to see invocation)

Number of similar (implementation,compiler) pairs: 1, namely:
ImplementationCompiler
T:sse4clang -mcpu=native -O3 -fwrapv -Qunused-arguments -fPIC -fPIE -gdwarf-4 -Wall (Debian_Clang_11.0.1)

Compiler output


encrypt.c: /tmp/ccBBdQ8b.s: Assembler messages:
encrypt.c: /tmp/ccBBdQ8b.s:5326: Error: can't resolve `.data' {.data section} - `.Ltext0' {.text section}
encrypt.c: /tmp/ccBBdQ8b.s:5327: Error: can't resolve `.data' {.data section} - `.Ltext0' {.text section}
encrypt.c: /tmp/ccBBdQ8b.s:5330: Error: can't resolve `.data' {.data section} - `.Ltext0' {.text section}
encrypt.c: /tmp/ccBBdQ8b.s:5331: Error: can't resolve `.data' {.data section} - `.Ltext0' {.text section}
encrypt.c: /tmp/ccBBdQ8b.s:5347: Error: can't resolve `.data' {.data section} - `.Ltext0' {.text section}
encrypt.c: /tmp/ccBBdQ8b.s:5348: Error: can't resolve `.data' {.data section} - `.Ltext0' {.text section}
encrypt.c: /tmp/ccBBdQ8b.s:5351: Error: can't resolve `.data' {.data section} - `.Ltext0' {.text section}
encrypt.c: /tmp/ccBBdQ8b.s:5352: Error: can't resolve `.data' {.data section} - `.Ltext0' {.text section}
encrypt.c: /tmp/ccBBdQ8b.s:5355: Error: can't resolve `.data' {.data section} - `.Ltext0' {.text section}
encrypt.c: /tmp/ccBBdQ8b.s:5356: Error: can't resolve `.data' {.data section} - `.Ltext0' {.text section}
encrypt.c: /tmp/ccBBdQ8b.s:5370: Error: can't resolve `.data' {.data section} - `.Ltext0' {.text section}
encrypt.c: /tmp/ccBBdQ8b.s:5371: Error: can't resolve `.data' {.data section} - `.Ltext0' {.text section}
encrypt.c: /tmp/ccBBdQ8b.s:5374: Error: can't resolve `.data' {.data section} - `.Ltext0' {.text section}
encrypt.c: /tmp/ccBBdQ8b.s:5375: Error: can't resolve `.data' {.data section} - `.Ltext0' {.text section}
encrypt.c: /tmp/ccBBdQ8b.s:5391: Error: can't resolve `.data' {.data section} - `.Ltext0' {.text section}
encrypt.c: /tmp/ccBBdQ8b.s:5392: Error: can't resolve `.data' {.data section} - `.Ltext0' {.text section}
encrypt.c: /tmp/ccBBdQ8b.s:5395: Error: can't resolve `.data' {.data section} - `.Ltext0' {.text section}
encrypt.c: /tmp/ccBBdQ8b.s:5396: Error: can't resolve `.data' {.data section} - `.Ltext0' {.text section}
encrypt.c: /tmp/ccBBdQ8b.s:5399: Error: can't resolve `.data' {.data section} - `.Ltext0' {.text section}
encrypt.c: /tmp/ccBBdQ8b.s:5400: Error: can't resolve `.data' {.data section} - `.Ltext0' {.text section}
encrypt.c: /tmp/ccBBdQ8b.s:5418: Error: can't resolve `.data' {.data section} - `.Ltext0' {.text section}
encrypt.c: /tmp/ccBBdQ8b.s:5419: Error: can't resolve `.data' {.data section} - `.Ltext0' {.text section}
encrypt.c: /tmp/ccBBdQ8b.s:5422: Error: can't resolve `.data' {.data section} - `.Ltext0' {.text section}
encrypt.c: /tmp/ccBBdQ8b.s:5423: Error: can't resolve `.data' {.data section} - `.Ltext0' {.text section}
encrypt.c: ...

Number of similar (implementation,compiler) pairs: 1, namely:
ImplementationCompiler
T:sse4gcc -march=native -mtune=native -O2 -fwrapv -fPIC -fPIE -gdwarf-4 -Wall (10.2.1_20210110)

Compiler output


encrypt.c: /tmp/ccZ78hLe.s: Assembler messages:
encrypt.c: /tmp/ccZ78hLe.s:5326: Error: can't resolve `.data' {.data section} - `.Ltext0' {.text section}
encrypt.c: /tmp/ccZ78hLe.s:5327: Error: can't resolve `.data' {.data section} - `.Ltext0' {.text section}
encrypt.c: /tmp/ccZ78hLe.s:5330: Error: can't resolve `.data' {.data section} - `.Ltext0' {.text section}
encrypt.c: /tmp/ccZ78hLe.s:5331: Error: can't resolve `.data' {.data section} - `.Ltext0' {.text section}
encrypt.c: /tmp/ccZ78hLe.s:5347: Error: can't resolve `.data' {.data section} - `.Ltext0' {.text section}
encrypt.c: /tmp/ccZ78hLe.s:5348: Error: can't resolve `.data' {.data section} - `.Ltext0' {.text section}
encrypt.c: /tmp/ccZ78hLe.s:5351: Error: can't resolve `.data' {.data section} - `.Ltext0' {.text section}
encrypt.c: /tmp/ccZ78hLe.s:5352: Error: can't resolve `.data' {.data section} - `.Ltext0' {.text section}
encrypt.c: /tmp/ccZ78hLe.s:5355: Error: can't resolve `.data' {.data section} - `.Ltext0' {.text section}
encrypt.c: /tmp/ccZ78hLe.s:5356: Error: can't resolve `.data' {.data section} - `.Ltext0' {.text section}
encrypt.c: /tmp/ccZ78hLe.s:5370: Error: can't resolve `.data' {.data section} - `.Ltext0' {.text section}
encrypt.c: /tmp/ccZ78hLe.s:5371: Error: can't resolve `.data' {.data section} - `.Ltext0' {.text section}
encrypt.c: /tmp/ccZ78hLe.s:5374: Error: can't resolve `.data' {.data section} - `.Ltext0' {.text section}
encrypt.c: /tmp/ccZ78hLe.s:5375: Error: can't resolve `.data' {.data section} - `.Ltext0' {.text section}
encrypt.c: /tmp/ccZ78hLe.s:5391: Error: can't resolve `.data' {.data section} - `.Ltext0' {.text section}
encrypt.c: /tmp/ccZ78hLe.s:5392: Error: can't resolve `.data' {.data section} - `.Ltext0' {.text section}
encrypt.c: /tmp/ccZ78hLe.s:5395: Error: can't resolve `.data' {.data section} - `.Ltext0' {.text section}
encrypt.c: /tmp/ccZ78hLe.s:5396: Error: can't resolve `.data' {.data section} - `.Ltext0' {.text section}
encrypt.c: /tmp/ccZ78hLe.s:5399: Error: can't resolve `.data' {.data section} - `.Ltext0' {.text section}
encrypt.c: /tmp/ccZ78hLe.s:5400: Error: can't resolve `.data' {.data section} - `.Ltext0' {.text section}
encrypt.c: /tmp/ccZ78hLe.s:5418: Error: can't resolve `.data' {.data section} - `.Ltext0' {.text section}
encrypt.c: /tmp/ccZ78hLe.s:5419: Error: can't resolve `.data' {.data section} - `.Ltext0' {.text section}
encrypt.c: /tmp/ccZ78hLe.s:5422: Error: can't resolve `.data' {.data section} - `.Ltext0' {.text section}
encrypt.c: /tmp/ccZ78hLe.s:5423: Error: can't resolve `.data' {.data section} - `.Ltext0' {.text section}
encrypt.c: ...

Number of similar (implementation,compiler) pairs: 1, namely:
ImplementationCompiler
T:sse4gcc -march=native -mtune=native -O3 -fwrapv -fPIC -fPIE -gdwarf-4 -Wall (10.2.1_20210110)

Compiler output


encrypt.c: /tmp/cck1IyUW.s: Assembler messages:
encrypt.c: /tmp/cck1IyUW.s:5322: Error: can't resolve `.data' {.data section} - `.Ltext0' {.text section}
encrypt.c: /tmp/cck1IyUW.s:5323: Error: can't resolve `.data' {.data section} - `.Ltext0' {.text section}
encrypt.c: /tmp/cck1IyUW.s:5326: Error: can't resolve `.data' {.data section} - `.Ltext0' {.text section}
encrypt.c: /tmp/cck1IyUW.s:5327: Error: can't resolve `.data' {.data section} - `.Ltext0' {.text section}
encrypt.c: /tmp/cck1IyUW.s:5343: Error: can't resolve `.data' {.data section} - `.Ltext0' {.text section}
encrypt.c: /tmp/cck1IyUW.s:5344: Error: can't resolve `.data' {.data section} - `.Ltext0' {.text section}
encrypt.c: /tmp/cck1IyUW.s:5347: Error: can't resolve `.data' {.data section} - `.Ltext0' {.text section}
encrypt.c: /tmp/cck1IyUW.s:5348: Error: can't resolve `.data' {.data section} - `.Ltext0' {.text section}
encrypt.c: /tmp/cck1IyUW.s:5351: Error: can't resolve `.data' {.data section} - `.Ltext0' {.text section}
encrypt.c: /tmp/cck1IyUW.s:5352: Error: can't resolve `.data' {.data section} - `.Ltext0' {.text section}
encrypt.c: /tmp/cck1IyUW.s:5366: Error: can't resolve `.data' {.data section} - `.Ltext0' {.text section}
encrypt.c: /tmp/cck1IyUW.s:5367: Error: can't resolve `.data' {.data section} - `.Ltext0' {.text section}
encrypt.c: /tmp/cck1IyUW.s:5370: Error: can't resolve `.data' {.data section} - `.Ltext0' {.text section}
encrypt.c: /tmp/cck1IyUW.s:5371: Error: can't resolve `.data' {.data section} - `.Ltext0' {.text section}
encrypt.c: /tmp/cck1IyUW.s:5387: Error: can't resolve `.data' {.data section} - `.Ltext0' {.text section}
encrypt.c: /tmp/cck1IyUW.s:5388: Error: can't resolve `.data' {.data section} - `.Ltext0' {.text section}
encrypt.c: /tmp/cck1IyUW.s:5391: Error: can't resolve `.data' {.data section} - `.Ltext0' {.text section}
encrypt.c: /tmp/cck1IyUW.s:5392: Error: can't resolve `.data' {.data section} - `.Ltext0' {.text section}
encrypt.c: /tmp/cck1IyUW.s:5395: Error: can't resolve `.data' {.data section} - `.Ltext0' {.text section}
encrypt.c: /tmp/cck1IyUW.s:5396: Error: can't resolve `.data' {.data section} - `.Ltext0' {.text section}
encrypt.c: /tmp/cck1IyUW.s:5414: Error: can't resolve `.data' {.data section} - `.Ltext0' {.text section}
encrypt.c: /tmp/cck1IyUW.s:5415: Error: can't resolve `.data' {.data section} - `.Ltext0' {.text section}
encrypt.c: /tmp/cck1IyUW.s:5418: Error: can't resolve `.data' {.data section} - `.Ltext0' {.text section}
encrypt.c: /tmp/cck1IyUW.s:5419: Error: can't resolve `.data' {.data section} - `.Ltext0' {.text section}
encrypt.c: ...

Number of similar (implementation,compiler) pairs: 1, namely:
ImplementationCompiler
T:sse4gcc -march=native -mtune=native -O -fwrapv -fPIC -fPIE -gdwarf-4 -Wall (10.2.1_20210110)

Compiler output


encrypt.c: /tmp/cc3WHJZ6.s: Assembler messages:
encrypt.c: /tmp/cc3WHJZ6.s:5306: Error: can't resolve `.data' {.data section} - `.Ltext0' {.text section}
encrypt.c: /tmp/cc3WHJZ6.s:5307: Error: can't resolve `.data' {.data section} - `.Ltext0' {.text section}
encrypt.c: /tmp/cc3WHJZ6.s:5310: Error: can't resolve `.data' {.data section} - `.Ltext0' {.text section}
encrypt.c: /tmp/cc3WHJZ6.s:5311: Error: can't resolve `.data' {.data section} - `.Ltext0' {.text section}
encrypt.c: /tmp/cc3WHJZ6.s:5327: Error: can't resolve `.data' {.data section} - `.Ltext0' {.text section}
encrypt.c: /tmp/cc3WHJZ6.s:5328: Error: can't resolve `.data' {.data section} - `.Ltext0' {.text section}
encrypt.c: /tmp/cc3WHJZ6.s:5331: Error: can't resolve `.data' {.data section} - `.Ltext0' {.text section}
encrypt.c: /tmp/cc3WHJZ6.s:5332: Error: can't resolve `.data' {.data section} - `.Ltext0' {.text section}
encrypt.c: /tmp/cc3WHJZ6.s:5335: Error: can't resolve `.data' {.data section} - `.Ltext0' {.text section}
encrypt.c: /tmp/cc3WHJZ6.s:5336: Error: can't resolve `.data' {.data section} - `.Ltext0' {.text section}
encrypt.c: /tmp/cc3WHJZ6.s:5350: Error: can't resolve `.data' {.data section} - `.Ltext0' {.text section}
encrypt.c: /tmp/cc3WHJZ6.s:5351: Error: can't resolve `.data' {.data section} - `.Ltext0' {.text section}
encrypt.c: /tmp/cc3WHJZ6.s:5354: Error: can't resolve `.data' {.data section} - `.Ltext0' {.text section}
encrypt.c: /tmp/cc3WHJZ6.s:5355: Error: can't resolve `.data' {.data section} - `.Ltext0' {.text section}
encrypt.c: /tmp/cc3WHJZ6.s:5371: Error: can't resolve `.data' {.data section} - `.Ltext0' {.text section}
encrypt.c: /tmp/cc3WHJZ6.s:5372: Error: can't resolve `.data' {.data section} - `.Ltext0' {.text section}
encrypt.c: /tmp/cc3WHJZ6.s:5375: Error: can't resolve `.data' {.data section} - `.Ltext0' {.text section}
encrypt.c: /tmp/cc3WHJZ6.s:5376: Error: can't resolve `.data' {.data section} - `.Ltext0' {.text section}
encrypt.c: /tmp/cc3WHJZ6.s:5379: Error: can't resolve `.data' {.data section} - `.Ltext0' {.text section}
encrypt.c: /tmp/cc3WHJZ6.s:5380: Error: can't resolve `.data' {.data section} - `.Ltext0' {.text section}
encrypt.c: /tmp/cc3WHJZ6.s:5398: Error: can't resolve `.data' {.data section} - `.Ltext0' {.text section}
encrypt.c: /tmp/cc3WHJZ6.s:5399: Error: can't resolve `.data' {.data section} - `.Ltext0' {.text section}
encrypt.c: /tmp/cc3WHJZ6.s:5402: Error: can't resolve `.data' {.data section} - `.Ltext0' {.text section}
encrypt.c: /tmp/cc3WHJZ6.s:5403: Error: can't resolve `.data' {.data section} - `.Ltext0' {.text section}
encrypt.c: ...

Number of similar (implementation,compiler) pairs: 1, namely:
ImplementationCompiler
T:sse4gcc -march=native -mtune=native -Os -fwrapv -fPIC -fPIE -gdwarf-4 -Wall (10.2.1_20210110)