Implementation notes: amd64, intelnuci7, crypto_dh/prjfp128bk

Computer: intelnuci7
Architecture: amd64
CPU ID: GenuineIntel-000806e9-bfebfbff
SUPERCOP version: 20191017
Operation: crypto_dh
Primitive: prjfp128bk

Compiler output

Implementation: v01/varglv4
Security model: unknown
Compiler: clang -march=native -O2 -fomit-frame-pointer -fwrapv -Qunused-arguments -fPIC -fPIE
divisor.c: In file included from divisor.c:13:
divisor.c: ./finite128.h:363:13: warning: inline function 'hec_fp_add_2e128mc_g2i_x8664_asm' is not defined [-Wundefined-inline]
divisor.c: inline void hec_fp_add_2e128mc_g2i_x8664_asm(TEMP_hec_fp_2e128mc t, DIV_hec_fp_2e128mc D2);
divisor.c: ^
divisor.c: divisor.c:41:3: note: used here
divisor.c: hec_fp_add_2e128mc_g2i_x8664_asm(t, D2);
divisor.c: ^
divisor.c: In file included from divisor.c:13:
divisor.c: ./finite128.h:364:13: warning: inline function 'hec_fp_aadd_2e128mc_g2i_x8664_asm' is not defined [-Wundefined-inline]
divisor.c: inline void hec_fp_aadd_2e128mc_g2i_x8664_asm(TEMP_hec_fp_2e128mc t, DIV_hec_fp_2e128mc D2);
divisor.c: ^
divisor.c: divisor.c:180:3: note: used here
divisor.c: hec_fp_aadd_2e128mc_g2i_x8664_asm(t, D2);
divisor.c: ^
divisor.c: In file included from divisor.c:13:
divisor.c: ./finite128.h:365:13: warning: inline function 'hec_fp_madd_2e128mc_g2i_x8664_asm' is not defined [-Wundefined-inline]
divisor.c: inline void hec_fp_madd_2e128mc_g2i_x8664_asm(TEMP_hec_fp_2e128mc t, DIV_hec_fp_2e128mc D2);
divisor.c: ^
divisor.c: divisor.c:263:3: note: used here
divisor.c: hec_fp_madd_2e128mc_g2i_x8664_asm(t, D2);
divisor.c: ^
divisor.c: In file included from divisor.c:13:
divisor.c: ./finite128.h:366:13: warning: inline function 'hec_fp_dbl_2e128mc_g2i_x8664_asm' is not defined [-Wundefined-inline]
divisor.c: inline void hec_fp_dbl_2e128mc_g2i_x8664_asm(TEMP_hec_fp_2e128mc t);
divisor.c: ^
divisor.c: ...
fp_2e128mc_x8664.c: In file included from fp_2e128mc_x8664.c:7:
fp_2e128mc_x8664.c: In file included from ./finite128.h:5:
fp_2e128mc_x8664.c: ./fpx.h:23:13: warning: inline function 'fp_cnt_bits' is not defined [-Wundefined-inline]
fp_2e128mc_x8664.c: inline void fp_cnt_bits(int *bc, const uni an, const uni_t al);
fp_2e128mc_x8664.c: ^
fp_2e128mc_x8664.c: fp_2e128mc_x8664.c:88:2: note: used here
fp_2e128mc_x8664.c: fp_cnt_bits(&i, n01, 1);
fp_2e128mc_x8664.c: ^
fp_2e128mc_x8664.c: 1 warning generated.
io.c: io.c:352:14: warning: equality comparison with extraneous parentheses [-Wparentheses-equality]
io.c: if((buf[i] == -1)){
io.c: ~~~~~~~^~~~~
io.c: io.c:352:14: note: remove extraneous parentheses around the comparison to silence this warning
io.c: if((buf[i] == -1)){
io.c: ~ ^ ~
io.c: io.c:352:14: note: use '=' to turn this equality comparison into an assignment
io.c: if((buf[i] == -1)){
io.c: ^~
io.c: =
io.c: io.c:379:14: warning: equality comparison with extraneous parentheses [-Wparentheses-equality]
io.c: if((buf[i] == -1)){
io.c: ~~~~~~~^~~~~
io.c: io.c:379:14: note: remove extraneous parentheses around the comparison to silence this warning
io.c: if((buf[i] == -1)){
io.c: ~ ^ ~
io.c: io.c:379:14: note: use '=' to turn this equality comparison into an assignment
io.c: if((buf[i] == -1)){
io.c: ^~
io.c: =
io.c: 2 warnings generated.
smul.c: In file included from smul.c:13:
smul.c: In file included from ./finite128.h:5:
smul.c: ./fpx.h:23:13: warning: inline function 'fp_cnt_bits' is not defined [-Wundefined-inline]
smul.c: inline void fp_cnt_bits(int *bc, const uni an, const uni_t al);
smul.c: ^
smul.c: smul.c:29:2: note: used here
smul.c: fp_cnt_bits(&i, kn, FP_LEN*2); /*printf("%d ", i);*/
smul.c: ^
smul.c: In file included from smul.c:13:
smul.c: In file included from ./finite128.h:5:
smul.c: ./fpx.h:24:13: warning: inline function 'find_nextwindow' is not defined [-Wundefined-inline]
smul.c: inline void find_nextwindow(int *v, int *k, uni_t kl, int *wd, const uni en, const int i, uni_t WINDOW_SIZE_LTR, uni_t TABLE_SIZE_LTR);
smul.c: ^
smul.c: smul.c:70:3: note: used here
smul.c: find_nextwindow(&ni, &k, 2*FP_LEN, &wd, kn, i, WINDOW_SIZE_LTR, TABLE_SIZE_LTR);
smul.c: ^
smul.c: 2 warnings generated.
smul_a2a3is0.c: In file included from smul_a2a3is0.c:13:
smul_a2a3is0.c: In file included from ./finite128.h:5:
smul_a2a3is0.c: ./fpx.h:23:13: warning: inline function 'fp_cnt_bits' is not defined [-Wundefined-inline]
smul_a2a3is0.c: inline void fp_cnt_bits(int *bc, const uni an, const uni_t al);
smul_a2a3is0.c: ^
smul_a2a3is0.c: smul_a2a3is0.c:29:2: note: used here
smul_a2a3is0.c: fp_cnt_bits(&i, kn, FP_LEN*2); /*printf("%d ", i);*/
smul_a2a3is0.c: ^
smul_a2a3is0.c: In file included from smul_a2a3is0.c:13:
smul_a2a3is0.c: In file included from ./finite128.h:5:
smul_a2a3is0.c: ./fpx.h:24:13: warning: inline function 'find_nextwindow' is not defined [-Wundefined-inline]
smul_a2a3is0.c: inline void find_nextwindow(int *v, int *k, uni_t kl, int *wd, const uni en, const int i, uni_t WINDOW_SIZE_LTR, uni_t TABLE_SIZE_LTR);
smul_a2a3is0.c: ^
smul_a2a3is0.c: smul_a2a3is0.c:70:3: note: used here
smul_a2a3is0.c: find_nextwindow(&ni, &k, 2*FP_LEN, &wd, kn, i, WINDOW_SIZE_LTR, TABLE_SIZE_LTR);
smul_a2a3is0.c: ^
smul_a2a3is0.c: 2 warnings generated.
smul_glv4.c: In file included from smul_glv4.c:11:
smul_glv4.c: In file included from ./finite128.h:5:
smul_glv4.c: ./fpx.h:23:13: warning: inline function 'fp_cnt_bits' is not defined [-Wundefined-inline]
smul_glv4.c: inline void fp_cnt_bits(int *bc, const uni an, const uni_t al);
smul_glv4.c: ^
smul_glv4.c: smul_glv4.c:223:2: note: used here
smul_glv4.c: fp_cnt_bits(&bt, k0->v->n, k0->v->l);
smul_glv4.c: ^
smul_glv4.c: 1 warning generated.
try.c: crypto_dh_prjfp128bk.a(fp_2e128mc_x8664.o): In function `fp_inv_2e128mc_x8664':
try.c: fp_2e128mc_x8664.c:(.text+0x...): undefined reference to `fp_cnt_bits'
try.c: crypto_dh_prjfp128bk.a(smul_glv4.o): In function `hec_fp_smul_2e128mc_bk_glv4':
try.c: smul_glv4.c:(.text+0x...): undefined reference to `fp_cnt_bits'
try.c: smul_glv4.c:(.text+0x...): undefined reference to `fp_cnt_bits'
try.c: smul_glv4.c:(.text+0x...): undefined reference to `fp_cnt_bits'
try.c: smul_glv4.c:(.text+0x...): undefined reference to `fp_cnt_bits'
try.c: clang: error: linker command failed with exit code 1 (use -v to see invocation)

Number of similar (compiler,implementation) pairs: 5, namely:
CompilerImplementations
clang -march=native -O2 -fomit-frame-pointer -fwrapv -Qunused-arguments -fPIC -fPIE v01/varglv4
clang -march=native -O3 -fomit-frame-pointer -fwrapv -Qunused-arguments -fPIC -fPIE v01/varglv4
clang -march=native -O -fomit-frame-pointer -fwrapv -Qunused-arguments -fPIC -fPIE v01/varglv4
clang -march=native -Os -fomit-frame-pointer -fwrapv -Qunused-arguments -fPIC -fPIE v01/varglv4
clang -mcpu=native -O3 -fomit-frame-pointer -fwrapv -Qunused-arguments -fPIC -fPIE v01/varglv4

Compiler output

Implementation: v01/varglv4
Security model: unknown
Compiler: gcc -march=native -mtune=native -O2 -fomit-frame-pointer -fwrapv -fPIC -fPIE
divisor.c: In file included from divisor.c:13:0:
divisor.c: finite128.h:895:13: warning: inline function 'kum_fp_dbladd_2e064mce2_g_x8664_asm' declared but never defined
divisor.c: inline void kum_fp_dbladd_2e064mce2_g_x8664_asm(uni TMP, uni kn, uni_t i, uni d1, uni d2, uni CNS);
divisor.c: ^~~~~~~~~~~~~~~~~~~~~~~~~~~~~~~~~~~
divisor.c: finite128.h:894:13: warning: inline function 'kum_fp_dbl_2e064mce2_g_x8664_asm' declared but never defined
divisor.c: inline void kum_fp_dbl_2e064mce2_g_x8664_asm(uni TMP, void *NOPARAM1, void *NOPARAM2, uni d1, void *NOPARAM3, uni CNS);
divisor.c: ^~~~~~~~~~~~~~~~~~~~~~~~~~~~~~~~
divisor.c: finite128.h:874:13: warning: inline function 'hec_fp_aadd_2e064mce2_g2i_x8664_asm' declared but never defined
divisor.c: inline void hec_fp_aadd_2e064mce2_g2i_x8664_asm(uni TMP, uni_t prm, void *NOPARAM, uni D3, uni d1, uni d2);
divisor.c: ^~~~~~~~~~~~~~~~~~~~~~~~~~~~~~~~~~~
divisor.c: finite128.h:873:13: warning: inline function 'hec_fp_madd_2e064mce2_g2i_x8664_asm' declared but never defined
divisor.c: inline void hec_fp_madd_2e064mce2_g2i_x8664_asm(uni TMP, uni_t prm, void *NOPARAM, uni D3, uni d1, uni d2);
divisor.c: ^~~~~~~~~~~~~~~~~~~~~~~~~~~~~~~~~~~
divisor.c: finite128.h:872:13: warning: inline function 'hec_fp_add_2e064mce2_g2i_x8664_asm' declared but never defined
divisor.c: inline void hec_fp_add_2e064mce2_g2i_x8664_asm(uni TMP, uni_t prm, void *NOPARAM, uni D3, uni d1, uni d2);
divisor.c: ^~~~~~~~~~~~~~~~~~~~~~~~~~~~~~~~~~
divisor.c: finite128.h:871:13: warning: inline function 'hec_fp_dbl_2e064mce2_g2i_a2a3is0_x8664_asm' declared but never defined
divisor.c: inline void hec_fp_dbl_2e064mce2_g2i_a2a3is0_x8664_asm(uni TMP, uni_t prm, void *NOPARAM, uni D3, uni d1, uni CNS);
divisor.c: ^~~~~~~~~~~~~~~~~~~~~~~~~~~~~~~~~~~~~~~~~~
divisor.c: finite128.h:870:13: warning: inline function 'hec_fp_dbl_2e064mce2_g2i_x8664_asm' declared but never defined
divisor.c: inline void hec_fp_dbl_2e064mce2_g2i_x8664_asm(uni TMP, uni_t prm, void *NOPARAM, uni D3, uni d1, uni CNS);
divisor.c: ^~~~~~~~~~~~~~~~~~~~~~~~~~~~~~~~~~
divisor.c: finite128.h:647:13: warning: inline function 'kum_fp_dbladd_2e061m1e2_g_x8664_asm' declared but never defined
divisor.c: inline void kum_fp_dbladd_2e061m1e2_g_x8664_asm(uni TMP, uni kn, uni_t i, uni d1, uni d2, uni CNS);
divisor.c: ^~~~~~~~~~~~~~~~~~~~~~~~~~~~~~~~~~~
divisor.c: ...
fp_2e128mc_x8664.c: In file included from fp_2e128mc_x8664.c:7:0:
fp_2e128mc_x8664.c: finite128.h:895:13: warning: inline function 'kum_fp_dbladd_2e064mce2_g_x8664_asm' declared but never defined
fp_2e128mc_x8664.c: inline void kum_fp_dbladd_2e064mce2_g_x8664_asm(uni TMP, uni kn, uni_t i, uni d1, uni d2, uni CNS);
fp_2e128mc_x8664.c: ^~~~~~~~~~~~~~~~~~~~~~~~~~~~~~~~~~~
fp_2e128mc_x8664.c: finite128.h:894:13: warning: inline function 'kum_fp_dbl_2e064mce2_g_x8664_asm' declared but never defined
fp_2e128mc_x8664.c: inline void kum_fp_dbl_2e064mce2_g_x8664_asm(uni TMP, void *NOPARAM1, void *NOPARAM2, uni d1, void *NOPARAM3, uni CNS);
fp_2e128mc_x8664.c: ^~~~~~~~~~~~~~~~~~~~~~~~~~~~~~~~
fp_2e128mc_x8664.c: finite128.h:874:13: warning: inline function 'hec_fp_aadd_2e064mce2_g2i_x8664_asm' declared but never defined
fp_2e128mc_x8664.c: inline void hec_fp_aadd_2e064mce2_g2i_x8664_asm(uni TMP, uni_t prm, void *NOPARAM, uni D3, uni d1, uni d2);
fp_2e128mc_x8664.c: ^~~~~~~~~~~~~~~~~~~~~~~~~~~~~~~~~~~
fp_2e128mc_x8664.c: finite128.h:873:13: warning: inline function 'hec_fp_madd_2e064mce2_g2i_x8664_asm' declared but never defined
fp_2e128mc_x8664.c: inline void hec_fp_madd_2e064mce2_g2i_x8664_asm(uni TMP, uni_t prm, void *NOPARAM, uni D3, uni d1, uni d2);
fp_2e128mc_x8664.c: ^~~~~~~~~~~~~~~~~~~~~~~~~~~~~~~~~~~
fp_2e128mc_x8664.c: finite128.h:872:13: warning: inline function 'hec_fp_add_2e064mce2_g2i_x8664_asm' declared but never defined
fp_2e128mc_x8664.c: inline void hec_fp_add_2e064mce2_g2i_x8664_asm(uni TMP, uni_t prm, void *NOPARAM, uni D3, uni d1, uni d2);
fp_2e128mc_x8664.c: ^~~~~~~~~~~~~~~~~~~~~~~~~~~~~~~~~~
fp_2e128mc_x8664.c: finite128.h:871:13: warning: inline function 'hec_fp_dbl_2e064mce2_g2i_a2a3is0_x8664_asm' declared but never defined
fp_2e128mc_x8664.c: inline void hec_fp_dbl_2e064mce2_g2i_a2a3is0_x8664_asm(uni TMP, uni_t prm, void *NOPARAM, uni D3, uni d1, uni CNS);
fp_2e128mc_x8664.c: ^~~~~~~~~~~~~~~~~~~~~~~~~~~~~~~~~~~~~~~~~~
fp_2e128mc_x8664.c: finite128.h:870:13: warning: inline function 'hec_fp_dbl_2e064mce2_g2i_x8664_asm' declared but never defined
fp_2e128mc_x8664.c: inline void hec_fp_dbl_2e064mce2_g2i_x8664_asm(uni TMP, uni_t prm, void *NOPARAM, uni D3, uni d1, uni CNS);
fp_2e128mc_x8664.c: ^~~~~~~~~~~~~~~~~~~~~~~~~~~~~~~~~~
fp_2e128mc_x8664.c: finite128.h:647:13: warning: inline function 'kum_fp_dbladd_2e061m1e2_g_x8664_asm' declared but never defined
fp_2e128mc_x8664.c: inline void kum_fp_dbladd_2e061m1e2_g_x8664_asm(uni TMP, uni kn, uni_t i, uni d1, uni d2, uni CNS);
fp_2e128mc_x8664.c: ^~~~~~~~~~~~~~~~~~~~~~~~~~~~~~~~~~~
fp_2e128mc_x8664.c: ...
smul.c: In file included from smul.c:13:0:
smul.c: finite128.h:895:13: warning: inline function 'kum_fp_dbladd_2e064mce2_g_x8664_asm' declared but never defined
smul.c: inline void kum_fp_dbladd_2e064mce2_g_x8664_asm(uni TMP, uni kn, uni_t i, uni d1, uni d2, uni CNS);
smul.c: ^~~~~~~~~~~~~~~~~~~~~~~~~~~~~~~~~~~
smul.c: finite128.h:894:13: warning: inline function 'kum_fp_dbl_2e064mce2_g_x8664_asm' declared but never defined
smul.c: inline void kum_fp_dbl_2e064mce2_g_x8664_asm(uni TMP, void *NOPARAM1, void *NOPARAM2, uni d1, void *NOPARAM3, uni CNS);
smul.c: ^~~~~~~~~~~~~~~~~~~~~~~~~~~~~~~~
smul.c: finite128.h:874:13: warning: inline function 'hec_fp_aadd_2e064mce2_g2i_x8664_asm' declared but never defined
smul.c: inline void hec_fp_aadd_2e064mce2_g2i_x8664_asm(uni TMP, uni_t prm, void *NOPARAM, uni D3, uni d1, uni d2);
smul.c: ^~~~~~~~~~~~~~~~~~~~~~~~~~~~~~~~~~~
smul.c: finite128.h:873:13: warning: inline function 'hec_fp_madd_2e064mce2_g2i_x8664_asm' declared but never defined
smul.c: inline void hec_fp_madd_2e064mce2_g2i_x8664_asm(uni TMP, uni_t prm, void *NOPARAM, uni D3, uni d1, uni d2);
smul.c: ^~~~~~~~~~~~~~~~~~~~~~~~~~~~~~~~~~~
smul.c: finite128.h:872:13: warning: inline function 'hec_fp_add_2e064mce2_g2i_x8664_asm' declared but never defined
smul.c: inline void hec_fp_add_2e064mce2_g2i_x8664_asm(uni TMP, uni_t prm, void *NOPARAM, uni D3, uni d1, uni d2);
smul.c: ^~~~~~~~~~~~~~~~~~~~~~~~~~~~~~~~~~
smul.c: finite128.h:871:13: warning: inline function 'hec_fp_dbl_2e064mce2_g2i_a2a3is0_x8664_asm' declared but never defined
smul.c: inline void hec_fp_dbl_2e064mce2_g2i_a2a3is0_x8664_asm(uni TMP, uni_t prm, void *NOPARAM, uni D3, uni d1, uni CNS);
smul.c: ^~~~~~~~~~~~~~~~~~~~~~~~~~~~~~~~~~~~~~~~~~
smul.c: finite128.h:870:13: warning: inline function 'hec_fp_dbl_2e064mce2_g2i_x8664_asm' declared but never defined
smul.c: inline void hec_fp_dbl_2e064mce2_g2i_x8664_asm(uni TMP, uni_t prm, void *NOPARAM, uni D3, uni d1, uni CNS);
smul.c: ^~~~~~~~~~~~~~~~~~~~~~~~~~~~~~~~~~
smul.c: finite128.h:647:13: warning: inline function 'kum_fp_dbladd_2e061m1e2_g_x8664_asm' declared but never defined
smul.c: inline void kum_fp_dbladd_2e061m1e2_g_x8664_asm(uni TMP, uni kn, uni_t i, uni d1, uni d2, uni CNS);
smul.c: ^~~~~~~~~~~~~~~~~~~~~~~~~~~~~~~~~~~
smul.c: ...
smul_a2a3is0.c: In file included from smul_a2a3is0.c:13:0:
smul_a2a3is0.c: finite128.h:895:13: warning: inline function 'kum_fp_dbladd_2e064mce2_g_x8664_asm' declared but never defined
smul_a2a3is0.c: inline void kum_fp_dbladd_2e064mce2_g_x8664_asm(uni TMP, uni kn, uni_t i, uni d1, uni d2, uni CNS);
smul_a2a3is0.c: ^~~~~~~~~~~~~~~~~~~~~~~~~~~~~~~~~~~
smul_a2a3is0.c: finite128.h:894:13: warning: inline function 'kum_fp_dbl_2e064mce2_g_x8664_asm' declared but never defined
smul_a2a3is0.c: inline void kum_fp_dbl_2e064mce2_g_x8664_asm(uni TMP, void *NOPARAM1, void *NOPARAM2, uni d1, void *NOPARAM3, uni CNS);
smul_a2a3is0.c: ^~~~~~~~~~~~~~~~~~~~~~~~~~~~~~~~
smul_a2a3is0.c: finite128.h:874:13: warning: inline function 'hec_fp_aadd_2e064mce2_g2i_x8664_asm' declared but never defined
smul_a2a3is0.c: inline void hec_fp_aadd_2e064mce2_g2i_x8664_asm(uni TMP, uni_t prm, void *NOPARAM, uni D3, uni d1, uni d2);
smul_a2a3is0.c: ^~~~~~~~~~~~~~~~~~~~~~~~~~~~~~~~~~~
smul_a2a3is0.c: finite128.h:873:13: warning: inline function 'hec_fp_madd_2e064mce2_g2i_x8664_asm' declared but never defined
smul_a2a3is0.c: inline void hec_fp_madd_2e064mce2_g2i_x8664_asm(uni TMP, uni_t prm, void *NOPARAM, uni D3, uni d1, uni d2);
smul_a2a3is0.c: ^~~~~~~~~~~~~~~~~~~~~~~~~~~~~~~~~~~
smul_a2a3is0.c: finite128.h:872:13: warning: inline function 'hec_fp_add_2e064mce2_g2i_x8664_asm' declared but never defined
smul_a2a3is0.c: inline void hec_fp_add_2e064mce2_g2i_x8664_asm(uni TMP, uni_t prm, void *NOPARAM, uni D3, uni d1, uni d2);
smul_a2a3is0.c: ^~~~~~~~~~~~~~~~~~~~~~~~~~~~~~~~~~
smul_a2a3is0.c: finite128.h:871:13: warning: inline function 'hec_fp_dbl_2e064mce2_g2i_a2a3is0_x8664_asm' declared but never defined
smul_a2a3is0.c: inline void hec_fp_dbl_2e064mce2_g2i_a2a3is0_x8664_asm(uni TMP, uni_t prm, void *NOPARAM, uni D3, uni d1, uni CNS);
smul_a2a3is0.c: ^~~~~~~~~~~~~~~~~~~~~~~~~~~~~~~~~~~~~~~~~~
smul_a2a3is0.c: finite128.h:870:13: warning: inline function 'hec_fp_dbl_2e064mce2_g2i_x8664_asm' declared but never defined
smul_a2a3is0.c: inline void hec_fp_dbl_2e064mce2_g2i_x8664_asm(uni TMP, uni_t prm, void *NOPARAM, uni D3, uni d1, uni CNS);
smul_a2a3is0.c: ^~~~~~~~~~~~~~~~~~~~~~~~~~~~~~~~~~
smul_a2a3is0.c: finite128.h:647:13: warning: inline function 'kum_fp_dbladd_2e061m1e2_g_x8664_asm' declared but never defined
smul_a2a3is0.c: inline void kum_fp_dbladd_2e061m1e2_g_x8664_asm(uni TMP, uni kn, uni_t i, uni d1, uni d2, uni CNS);
smul_a2a3is0.c: ^~~~~~~~~~~~~~~~~~~~~~~~~~~~~~~~~~~
smul_a2a3is0.c: ...
smul_glv4.c: In file included from smul_glv4.c:11:0:
smul_glv4.c: finite128.h:895:13: warning: inline function 'kum_fp_dbladd_2e064mce2_g_x8664_asm' declared but never defined
smul_glv4.c: inline void kum_fp_dbladd_2e064mce2_g_x8664_asm(uni TMP, uni kn, uni_t i, uni d1, uni d2, uni CNS);
smul_glv4.c: ^~~~~~~~~~~~~~~~~~~~~~~~~~~~~~~~~~~
smul_glv4.c: finite128.h:894:13: warning: inline function 'kum_fp_dbl_2e064mce2_g_x8664_asm' declared but never defined
smul_glv4.c: inline void kum_fp_dbl_2e064mce2_g_x8664_asm(uni TMP, void *NOPARAM1, void *NOPARAM2, uni d1, void *NOPARAM3, uni CNS);
smul_glv4.c: ^~~~~~~~~~~~~~~~~~~~~~~~~~~~~~~~
smul_glv4.c: finite128.h:874:13: warning: inline function 'hec_fp_aadd_2e064mce2_g2i_x8664_asm' declared but never defined
smul_glv4.c: inline void hec_fp_aadd_2e064mce2_g2i_x8664_asm(uni TMP, uni_t prm, void *NOPARAM, uni D3, uni d1, uni d2);
smul_glv4.c: ^~~~~~~~~~~~~~~~~~~~~~~~~~~~~~~~~~~
smul_glv4.c: finite128.h:873:13: warning: inline function 'hec_fp_madd_2e064mce2_g2i_x8664_asm' declared but never defined
smul_glv4.c: inline void hec_fp_madd_2e064mce2_g2i_x8664_asm(uni TMP, uni_t prm, void *NOPARAM, uni D3, uni d1, uni d2);
smul_glv4.c: ^~~~~~~~~~~~~~~~~~~~~~~~~~~~~~~~~~~
smul_glv4.c: finite128.h:872:13: warning: inline function 'hec_fp_add_2e064mce2_g2i_x8664_asm' declared but never defined
smul_glv4.c: inline void hec_fp_add_2e064mce2_g2i_x8664_asm(uni TMP, uni_t prm, void *NOPARAM, uni D3, uni d1, uni d2);
smul_glv4.c: ^~~~~~~~~~~~~~~~~~~~~~~~~~~~~~~~~~
smul_glv4.c: finite128.h:871:13: warning: inline function 'hec_fp_dbl_2e064mce2_g2i_a2a3is0_x8664_asm' declared but never defined
smul_glv4.c: inline void hec_fp_dbl_2e064mce2_g2i_a2a3is0_x8664_asm(uni TMP, uni_t prm, void *NOPARAM, uni D3, uni d1, uni CNS);
smul_glv4.c: ^~~~~~~~~~~~~~~~~~~~~~~~~~~~~~~~~~~~~~~~~~
smul_glv4.c: finite128.h:870:13: warning: inline function 'hec_fp_dbl_2e064mce2_g2i_x8664_asm' declared but never defined
smul_glv4.c: inline void hec_fp_dbl_2e064mce2_g2i_x8664_asm(uni TMP, uni_t prm, void *NOPARAM, uni D3, uni d1, uni CNS);
smul_glv4.c: ^~~~~~~~~~~~~~~~~~~~~~~~~~~~~~~~~~
smul_glv4.c: finite128.h:647:13: warning: inline function 'kum_fp_dbladd_2e061m1e2_g_x8664_asm' declared but never defined
smul_glv4.c: inline void kum_fp_dbladd_2e061m1e2_g_x8664_asm(uni TMP, uni kn, uni_t i, uni d1, uni d2, uni CNS);
smul_glv4.c: ^~~~~~~~~~~~~~~~~~~~~~~~~~~~~~~~~~~
smul_glv4.c: ...
test.c: In file included from test.c:11:0:
test.c: finite128.h:895:13: warning: inline function 'kum_fp_dbladd_2e064mce2_g_x8664_asm' declared but never defined
test.c: inline void kum_fp_dbladd_2e064mce2_g_x8664_asm(uni TMP, uni kn, uni_t i, uni d1, uni d2, uni CNS);
test.c: ^~~~~~~~~~~~~~~~~~~~~~~~~~~~~~~~~~~
test.c: finite128.h:894:13: warning: inline function 'kum_fp_dbl_2e064mce2_g_x8664_asm' declared but never defined
test.c: inline void kum_fp_dbl_2e064mce2_g_x8664_asm(uni TMP, void *NOPARAM1, void *NOPARAM2, uni d1, void *NOPARAM3, uni CNS);
test.c: ^~~~~~~~~~~~~~~~~~~~~~~~~~~~~~~~
test.c: finite128.h:874:13: warning: inline function 'hec_fp_aadd_2e064mce2_g2i_x8664_asm' declared but never defined
test.c: inline void hec_fp_aadd_2e064mce2_g2i_x8664_asm(uni TMP, uni_t prm, void *NOPARAM, uni D3, uni d1, uni d2);
test.c: ^~~~~~~~~~~~~~~~~~~~~~~~~~~~~~~~~~~
test.c: finite128.h:873:13: warning: inline function 'hec_fp_madd_2e064mce2_g2i_x8664_asm' declared but never defined
test.c: inline void hec_fp_madd_2e064mce2_g2i_x8664_asm(uni TMP, uni_t prm, void *NOPARAM, uni D3, uni d1, uni d2);
test.c: ^~~~~~~~~~~~~~~~~~~~~~~~~~~~~~~~~~~
test.c: finite128.h:872:13: warning: inline function 'hec_fp_add_2e064mce2_g2i_x8664_asm' declared but never defined
test.c: inline void hec_fp_add_2e064mce2_g2i_x8664_asm(uni TMP, uni_t prm, void *NOPARAM, uni D3, uni d1, uni d2);
test.c: ^~~~~~~~~~~~~~~~~~~~~~~~~~~~~~~~~~
test.c: finite128.h:871:13: warning: inline function 'hec_fp_dbl_2e064mce2_g2i_a2a3is0_x8664_asm' declared but never defined
test.c: inline void hec_fp_dbl_2e064mce2_g2i_a2a3is0_x8664_asm(uni TMP, uni_t prm, void *NOPARAM, uni D3, uni d1, uni CNS);
test.c: ^~~~~~~~~~~~~~~~~~~~~~~~~~~~~~~~~~~~~~~~~~
test.c: finite128.h:870:13: warning: inline function 'hec_fp_dbl_2e064mce2_g2i_x8664_asm' declared but never defined
test.c: inline void hec_fp_dbl_2e064mce2_g2i_x8664_asm(uni TMP, uni_t prm, void *NOPARAM, uni D3, uni d1, uni CNS);
test.c: ^~~~~~~~~~~~~~~~~~~~~~~~~~~~~~~~~~
test.c: finite128.h:647:13: warning: inline function 'kum_fp_dbladd_2e061m1e2_g_x8664_asm' declared but never defined
test.c: inline void kum_fp_dbladd_2e061m1e2_g_x8664_asm(uni TMP, uni kn, uni_t i, uni d1, uni d2, uni CNS);
test.c: ^~~~~~~~~~~~~~~~~~~~~~~~~~~~~~~~~~~
test.c: ...
try.c: crypto_dh_prjfp128bk.a(fp_2e128mc_x8664.o): In function `fp_inv_2e128mc_x8664':
try.c: fp_2e128mc_x8664.c:(.text+0x...): undefined reference to `fp_cnt_bits'
try.c: crypto_dh_prjfp128bk.a(smul_glv4.o): In function `hec_fp_smul_2e128mc_bk_glv4':
try.c: smul_glv4.c:(.text+0x...): undefined reference to `fp_cnt_bits'
try.c: smul_glv4.c:(.text+0x...): undefined reference to `fp_cnt_bits'
try.c: smul_glv4.c:(.text+0x...): undefined reference to `fp_cnt_bits'
try.c: smul_glv4.c:(.text+0x...): undefined reference to `fp_cnt_bits'
try.c: collect2: error: ld returned 1 exit status

Number of similar (compiler,implementation) pairs: 4, namely:
CompilerImplementations
gcc -march=native -mtune=native -O2 -fomit-frame-pointer -fwrapv -fPIC -fPIE v01/varglv4
gcc -march=native -mtune=native -O3 -fomit-frame-pointer -fwrapv -fPIC -fPIE v01/varglv4
gcc -march=native -mtune=native -O -fomit-frame-pointer -fwrapv -fPIC -fPIE v01/varglv4
gcc -march=native -mtune=native -Os -fomit-frame-pointer -fwrapv -fPIC -fPIE v01/varglv4

Compiler output

Implementation: v01/w4s01glv4
Security model: unknown
Compiler: clang -march=native -O2 -fomit-frame-pointer -fwrapv -Qunused-arguments -fPIC -fPIE
divisor.c: In file included from divisor.c:13:
divisor.c: ./finite128.h:363:13: warning: inline function 'hec_fp_add_2e128mc_g2i_x8664_asm' is not defined [-Wundefined-inline]
divisor.c: inline void hec_fp_add_2e128mc_g2i_x8664_asm(TEMP_hec_fp_2e128mc t, DIV_hec_fp_2e128mc D2);
divisor.c: ^
divisor.c: divisor.c:41:3: note: used here
divisor.c: hec_fp_add_2e128mc_g2i_x8664_asm(t, D2);
divisor.c: ^
divisor.c: In file included from divisor.c:13:
divisor.c: ./finite128.h:364:13: warning: inline function 'hec_fp_aadd_2e128mc_g2i_x8664_asm' is not defined [-Wundefined-inline]
divisor.c: inline void hec_fp_aadd_2e128mc_g2i_x8664_asm(TEMP_hec_fp_2e128mc t, DIV_hec_fp_2e128mc D2);
divisor.c: ^
divisor.c: divisor.c:180:3: note: used here
divisor.c: hec_fp_aadd_2e128mc_g2i_x8664_asm(t, D2);
divisor.c: ^
divisor.c: In file included from divisor.c:13:
divisor.c: ./finite128.h:365:13: warning: inline function 'hec_fp_madd_2e128mc_g2i_x8664_asm' is not defined [-Wundefined-inline]
divisor.c: inline void hec_fp_madd_2e128mc_g2i_x8664_asm(TEMP_hec_fp_2e128mc t, DIV_hec_fp_2e128mc D2);
divisor.c: ^
divisor.c: divisor.c:263:3: note: used here
divisor.c: hec_fp_madd_2e128mc_g2i_x8664_asm(t, D2);
divisor.c: ^
divisor.c: In file included from divisor.c:13:
divisor.c: ./finite128.h:366:13: warning: inline function 'hec_fp_dbl_2e128mc_g2i_x8664_asm' is not defined [-Wundefined-inline]
divisor.c: inline void hec_fp_dbl_2e128mc_g2i_x8664_asm(TEMP_hec_fp_2e128mc t);
divisor.c: ^
divisor.c: ...
fp_2e128mc_x8664.c: In file included from fp_2e128mc_x8664.c:7:
fp_2e128mc_x8664.c: In file included from ./finite128.h:5:
fp_2e128mc_x8664.c: ./fpx.h:23:13: warning: inline function 'fp_cnt_bits' is not defined [-Wundefined-inline]
fp_2e128mc_x8664.c: inline void fp_cnt_bits(int *bc, const uni an, const uni_t al);
fp_2e128mc_x8664.c: ^
fp_2e128mc_x8664.c: fp_2e128mc_x8664.c:88:2: note: used here
fp_2e128mc_x8664.c: fp_cnt_bits(&i, n01, 1);
fp_2e128mc_x8664.c: ^
fp_2e128mc_x8664.c: 1 warning generated.
io.c: io.c:352:14: warning: equality comparison with extraneous parentheses [-Wparentheses-equality]
io.c: if((buf[i] == -1)){
io.c: ~~~~~~~^~~~~
io.c: io.c:352:14: note: remove extraneous parentheses around the comparison to silence this warning
io.c: if((buf[i] == -1)){
io.c: ~ ^ ~
io.c: io.c:352:14: note: use '=' to turn this equality comparison into an assignment
io.c: if((buf[i] == -1)){
io.c: ^~
io.c: =
io.c: io.c:379:14: warning: equality comparison with extraneous parentheses [-Wparentheses-equality]
io.c: if((buf[i] == -1)){
io.c: ~~~~~~~^~~~~
io.c: io.c:379:14: note: remove extraneous parentheses around the comparison to silence this warning
io.c: if((buf[i] == -1)){
io.c: ~ ^ ~
io.c: io.c:379:14: note: use '=' to turn this equality comparison into an assignment
io.c: if((buf[i] == -1)){
io.c: ^~
io.c: =
io.c: 2 warnings generated.
smul.c: In file included from smul.c:13:
smul.c: In file included from ./finite128.h:5:
smul.c: ./fpx.h:23:13: warning: inline function 'fp_cnt_bits' is not defined [-Wundefined-inline]
smul.c: inline void fp_cnt_bits(int *bc, const uni an, const uni_t al);
smul.c: ^
smul.c: smul.c:29:2: note: used here
smul.c: fp_cnt_bits(&i, kn, FP_LEN*2); /*printf("%d ", i);*/
smul.c: ^
smul.c: In file included from smul.c:13:
smul.c: In file included from ./finite128.h:5:
smul.c: ./fpx.h:24:13: warning: inline function 'find_nextwindow' is not defined [-Wundefined-inline]
smul.c: inline void find_nextwindow(int *v, int *k, uni_t kl, int *wd, const uni en, const int i, uni_t WINDOW_SIZE_LTR, uni_t TABLE_SIZE_LTR);
smul.c: ^
smul.c: smul.c:70:3: note: used here
smul.c: find_nextwindow(&ni, &k, 2*FP_LEN, &wd, kn, i, WINDOW_SIZE_LTR, TABLE_SIZE_LTR);
smul.c: ^
smul.c: 2 warnings generated.
smul_a2a3is0.c: In file included from smul_a2a3is0.c:13:
smul_a2a3is0.c: In file included from ./finite128.h:5:
smul_a2a3is0.c: ./fpx.h:23:13: warning: inline function 'fp_cnt_bits' is not defined [-Wundefined-inline]
smul_a2a3is0.c: inline void fp_cnt_bits(int *bc, const uni an, const uni_t al);
smul_a2a3is0.c: ^
smul_a2a3is0.c: smul_a2a3is0.c:29:2: note: used here
smul_a2a3is0.c: fp_cnt_bits(&i, kn, FP_LEN*2); /*printf("%d ", i);*/
smul_a2a3is0.c: ^
smul_a2a3is0.c: In file included from smul_a2a3is0.c:13:
smul_a2a3is0.c: In file included from ./finite128.h:5:
smul_a2a3is0.c: ./fpx.h:24:13: warning: inline function 'find_nextwindow' is not defined [-Wundefined-inline]
smul_a2a3is0.c: inline void find_nextwindow(int *v, int *k, uni_t kl, int *wd, const uni en, const int i, uni_t WINDOW_SIZE_LTR, uni_t TABLE_SIZE_LTR);
smul_a2a3is0.c: ^
smul_a2a3is0.c: smul_a2a3is0.c:70:3: note: used here
smul_a2a3is0.c: find_nextwindow(&ni, &k, 2*FP_LEN, &wd, kn, i, WINDOW_SIZE_LTR, TABLE_SIZE_LTR);
smul_a2a3is0.c: ^
smul_a2a3is0.c: 2 warnings generated.
smul_glv4.c: In file included from smul_glv4.c:11:
smul_glv4.c: In file included from ./finite128.h:5:
smul_glv4.c: ./fpx.h:23:13: warning: inline function 'fp_cnt_bits' is not defined [-Wundefined-inline]
smul_glv4.c: inline void fp_cnt_bits(int *bc, const uni an, const uni_t al);
smul_glv4.c: ^
smul_glv4.c: smul_glv4.c:223:2: note: used here
smul_glv4.c: fp_cnt_bits(&bt, k0->v->n, k0->v->l);
smul_glv4.c: ^
smul_glv4.c: 1 warning generated.
try.c: crypto_dh_prjfp128bk.a(fp_2e128mc_x8664.o): In function `fp_inv_2e128mc_x8664':
try.c: fp_2e128mc_x8664.c:(.text+0x...): undefined reference to `fp_cnt_bits'
try.c: crypto_dh_prjfp128bk.a(smul_a2a3is0.o): In function `hec_fp_smul_2e128mc_g2i_a2a3is0':
try.c: smul_a2a3is0.c:(.text+0x...): undefined reference to `fp_cnt_bits'
try.c: smul_a2a3is0.c:(.text+0x...): undefined reference to `find_nextwindow'
try.c: smul_a2a3is0.c:(.text+0x...): undefined reference to `find_nextwindow'
try.c: crypto_dh_prjfp128bk.a(smul_glv4.o): In function `hec_fp_smul_2e128mc_bk_glv4':
try.c: smul_glv4.c:(.text+0x...): undefined reference to `fp_cnt_bits'
try.c: smul_glv4.c:(.text+0x...): undefined reference to `fp_cnt_bits'
try.c: smul_glv4.c:(.text+0x...): undefined reference to `fp_cnt_bits'
try.c: smul_glv4.c:(.text+0x...): undefined reference to `fp_cnt_bits'
try.c: clang: error: linker command failed with exit code 1 (use -v to see invocation)

Number of similar (compiler,implementation) pairs: 60, namely:
CompilerImplementations
clang -march=native -O2 -fomit-frame-pointer -fwrapv -Qunused-arguments -fPIC -fPIE v01/w4s01glv4
clang -march=native -O3 -fomit-frame-pointer -fwrapv -Qunused-arguments -fPIC -fPIE v01/w4s01glv4
clang -march=native -O -fomit-frame-pointer -fwrapv -Qunused-arguments -fPIC -fPIE v01/w4s01glv4
clang -march=native -Os -fomit-frame-pointer -fwrapv -Qunused-arguments -fPIC -fPIE v01/w4s01glv4
clang -mcpu=native -O3 -fomit-frame-pointer -fwrapv -Qunused-arguments -fPIC -fPIE v01/w4s01glv4
clang -march=native -O2 -fomit-frame-pointer -fwrapv -Qunused-arguments -fPIC -fPIE v01/w4s02glv4
clang -march=native -O3 -fomit-frame-pointer -fwrapv -Qunused-arguments -fPIC -fPIE v01/w4s02glv4
clang -march=native -O -fomit-frame-pointer -fwrapv -Qunused-arguments -fPIC -fPIE v01/w4s02glv4
clang -march=native -Os -fomit-frame-pointer -fwrapv -Qunused-arguments -fPIC -fPIE v01/w4s02glv4
clang -mcpu=native -O3 -fomit-frame-pointer -fwrapv -Qunused-arguments -fPIC -fPIE v01/w4s02glv4
clang -march=native -O2 -fomit-frame-pointer -fwrapv -Qunused-arguments -fPIC -fPIE v01/w4s04glv4
clang -march=native -O3 -fomit-frame-pointer -fwrapv -Qunused-arguments -fPIC -fPIE v01/w4s04glv4
clang -march=native -O -fomit-frame-pointer -fwrapv -Qunused-arguments -fPIC -fPIE v01/w4s04glv4
clang -march=native -Os -fomit-frame-pointer -fwrapv -Qunused-arguments -fPIC -fPIE v01/w4s04glv4
clang -mcpu=native -O3 -fomit-frame-pointer -fwrapv -Qunused-arguments -fPIC -fPIE v01/w4s04glv4
clang -march=native -O2 -fomit-frame-pointer -fwrapv -Qunused-arguments -fPIC -fPIE v01/w4s08glv4
clang -march=native -O3 -fomit-frame-pointer -fwrapv -Qunused-arguments -fPIC -fPIE v01/w4s08glv4
clang -march=native -O -fomit-frame-pointer -fwrapv -Qunused-arguments -fPIC -fPIE v01/w4s08glv4
clang -march=native -Os -fomit-frame-pointer -fwrapv -Qunused-arguments -fPIC -fPIE v01/w4s08glv4
clang -mcpu=native -O3 -fomit-frame-pointer -fwrapv -Qunused-arguments -fPIC -fPIE v01/w4s08glv4
clang -march=native -O2 -fomit-frame-pointer -fwrapv -Qunused-arguments -fPIC -fPIE v01/w4s16glv4
clang -march=native -O3 -fomit-frame-pointer -fwrapv -Qunused-arguments -fPIC -fPIE v01/w4s16glv4
clang -march=native -O -fomit-frame-pointer -fwrapv -Qunused-arguments -fPIC -fPIE v01/w4s16glv4
clang -march=native -Os -fomit-frame-pointer -fwrapv -Qunused-arguments -fPIC -fPIE v01/w4s16glv4
clang -mcpu=native -O3 -fomit-frame-pointer -fwrapv -Qunused-arguments -fPIC -fPIE v01/w4s16glv4
clang -march=native -O2 -fomit-frame-pointer -fwrapv -Qunused-arguments -fPIC -fPIE v01/w4s32glv4
clang -march=native -O3 -fomit-frame-pointer -fwrapv -Qunused-arguments -fPIC -fPIE v01/w4s32glv4
clang -march=native -O -fomit-frame-pointer -fwrapv -Qunused-arguments -fPIC -fPIE v01/w4s32glv4
clang -march=native -Os -fomit-frame-pointer -fwrapv -Qunused-arguments -fPIC -fPIE v01/w4s32glv4
clang -mcpu=native -O3 -fomit-frame-pointer -fwrapv -Qunused-arguments -fPIC -fPIE v01/w4s32glv4
clang -march=native -O2 -fomit-frame-pointer -fwrapv -Qunused-arguments -fPIC -fPIE v01/w8s01glv4
clang -march=native -O3 -fomit-frame-pointer -fwrapv -Qunused-arguments -fPIC -fPIE v01/w8s01glv4
clang -march=native -O -fomit-frame-pointer -fwrapv -Qunused-arguments -fPIC -fPIE v01/w8s01glv4
clang -march=native -Os -fomit-frame-pointer -fwrapv -Qunused-arguments -fPIC -fPIE v01/w8s01glv4
clang -mcpu=native -O3 -fomit-frame-pointer -fwrapv -Qunused-arguments -fPIC -fPIE v01/w8s01glv4
clang -march=native -O2 -fomit-frame-pointer -fwrapv -Qunused-arguments -fPIC -fPIE v01/w8s02glv4
clang -march=native -O3 -fomit-frame-pointer -fwrapv -Qunused-arguments -fPIC -fPIE v01/w8s02glv4
clang -march=native -O -fomit-frame-pointer -fwrapv -Qunused-arguments -fPIC -fPIE v01/w8s02glv4
clang -march=native -Os -fomit-frame-pointer -fwrapv -Qunused-arguments -fPIC -fPIE v01/w8s02glv4
clang -mcpu=native -O3 -fomit-frame-pointer -fwrapv -Qunused-arguments -fPIC -fPIE v01/w8s02glv4
clang -march=native -O2 -fomit-frame-pointer -fwrapv -Qunused-arguments -fPIC -fPIE v01/w8s04glv4
clang -march=native -O3 -fomit-frame-pointer -fwrapv -Qunused-arguments -fPIC -fPIE v01/w8s04glv4
clang -march=native -O -fomit-frame-pointer -fwrapv -Qunused-arguments -fPIC -fPIE v01/w8s04glv4
clang -march=native -Os -fomit-frame-pointer -fwrapv -Qunused-arguments -fPIC -fPIE v01/w8s04glv4
clang -mcpu=native -O3 -fomit-frame-pointer -fwrapv -Qunused-arguments -fPIC -fPIE v01/w8s04glv4
clang -march=native -O2 -fomit-frame-pointer -fwrapv -Qunused-arguments -fPIC -fPIE v01/w8s08glv4
clang -march=native -O3 -fomit-frame-pointer -fwrapv -Qunused-arguments -fPIC -fPIE v01/w8s08glv4
clang -march=native -O -fomit-frame-pointer -fwrapv -Qunused-arguments -fPIC -fPIE v01/w8s08glv4
clang -march=native -Os -fomit-frame-pointer -fwrapv -Qunused-arguments -fPIC -fPIE v01/w8s08glv4
clang -mcpu=native -O3 -fomit-frame-pointer -fwrapv -Qunused-arguments -fPIC -fPIE v01/w8s08glv4
clang -march=native -O2 -fomit-frame-pointer -fwrapv -Qunused-arguments -fPIC -fPIE v01/w8s16glv4
clang -march=native -O3 -fomit-frame-pointer -fwrapv -Qunused-arguments -fPIC -fPIE v01/w8s16glv4
clang -march=native -O -fomit-frame-pointer -fwrapv -Qunused-arguments -fPIC -fPIE v01/w8s16glv4
clang -march=native -Os -fomit-frame-pointer -fwrapv -Qunused-arguments -fPIC -fPIE v01/w8s16glv4
clang -mcpu=native -O3 -fomit-frame-pointer -fwrapv -Qunused-arguments -fPIC -fPIE v01/w8s16glv4
clang -march=native -O2 -fomit-frame-pointer -fwrapv -Qunused-arguments -fPIC -fPIE v01/w8s32glv4
clang -march=native -O3 -fomit-frame-pointer -fwrapv -Qunused-arguments -fPIC -fPIE v01/w8s32glv4
clang -march=native -O -fomit-frame-pointer -fwrapv -Qunused-arguments -fPIC -fPIE v01/w8s32glv4
clang -march=native -Os -fomit-frame-pointer -fwrapv -Qunused-arguments -fPIC -fPIE v01/w8s32glv4
clang -mcpu=native -O3 -fomit-frame-pointer -fwrapv -Qunused-arguments -fPIC -fPIE v01/w8s32glv4

Compiler output

Implementation: v01/w4s01glv4
Security model: unknown
Compiler: gcc -march=native -mtune=native -O2 -fomit-frame-pointer -fwrapv -fPIC -fPIE
divisor.c: In file included from divisor.c:13:0:
divisor.c: finite128.h:895:13: warning: inline function 'kum_fp_dbladd_2e064mce2_g_x8664_asm' declared but never defined
divisor.c: inline void kum_fp_dbladd_2e064mce2_g_x8664_asm(uni TMP, uni kn, uni_t i, uni d1, uni d2, uni CNS);
divisor.c: ^~~~~~~~~~~~~~~~~~~~~~~~~~~~~~~~~~~
divisor.c: finite128.h:894:13: warning: inline function 'kum_fp_dbl_2e064mce2_g_x8664_asm' declared but never defined
divisor.c: inline void kum_fp_dbl_2e064mce2_g_x8664_asm(uni TMP, void *NOPARAM1, void *NOPARAM2, uni d1, void *NOPARAM3, uni CNS);
divisor.c: ^~~~~~~~~~~~~~~~~~~~~~~~~~~~~~~~
divisor.c: finite128.h:874:13: warning: inline function 'hec_fp_aadd_2e064mce2_g2i_x8664_asm' declared but never defined
divisor.c: inline void hec_fp_aadd_2e064mce2_g2i_x8664_asm(uni TMP, uni_t prm, void *NOPARAM, uni D3, uni d1, uni d2);
divisor.c: ^~~~~~~~~~~~~~~~~~~~~~~~~~~~~~~~~~~
divisor.c: finite128.h:873:13: warning: inline function 'hec_fp_madd_2e064mce2_g2i_x8664_asm' declared but never defined
divisor.c: inline void hec_fp_madd_2e064mce2_g2i_x8664_asm(uni TMP, uni_t prm, void *NOPARAM, uni D3, uni d1, uni d2);
divisor.c: ^~~~~~~~~~~~~~~~~~~~~~~~~~~~~~~~~~~
divisor.c: finite128.h:872:13: warning: inline function 'hec_fp_add_2e064mce2_g2i_x8664_asm' declared but never defined
divisor.c: inline void hec_fp_add_2e064mce2_g2i_x8664_asm(uni TMP, uni_t prm, void *NOPARAM, uni D3, uni d1, uni d2);
divisor.c: ^~~~~~~~~~~~~~~~~~~~~~~~~~~~~~~~~~
divisor.c: finite128.h:871:13: warning: inline function 'hec_fp_dbl_2e064mce2_g2i_a2a3is0_x8664_asm' declared but never defined
divisor.c: inline void hec_fp_dbl_2e064mce2_g2i_a2a3is0_x8664_asm(uni TMP, uni_t prm, void *NOPARAM, uni D3, uni d1, uni CNS);
divisor.c: ^~~~~~~~~~~~~~~~~~~~~~~~~~~~~~~~~~~~~~~~~~
divisor.c: finite128.h:870:13: warning: inline function 'hec_fp_dbl_2e064mce2_g2i_x8664_asm' declared but never defined
divisor.c: inline void hec_fp_dbl_2e064mce2_g2i_x8664_asm(uni TMP, uni_t prm, void *NOPARAM, uni D3, uni d1, uni CNS);
divisor.c: ^~~~~~~~~~~~~~~~~~~~~~~~~~~~~~~~~~
divisor.c: finite128.h:647:13: warning: inline function 'kum_fp_dbladd_2e061m1e2_g_x8664_asm' declared but never defined
divisor.c: inline void kum_fp_dbladd_2e061m1e2_g_x8664_asm(uni TMP, uni kn, uni_t i, uni d1, uni d2, uni CNS);
divisor.c: ^~~~~~~~~~~~~~~~~~~~~~~~~~~~~~~~~~~
divisor.c: ...
fp_2e128mc_x8664.c: In file included from fp_2e128mc_x8664.c:7:0:
fp_2e128mc_x8664.c: finite128.h:895:13: warning: inline function 'kum_fp_dbladd_2e064mce2_g_x8664_asm' declared but never defined
fp_2e128mc_x8664.c: inline void kum_fp_dbladd_2e064mce2_g_x8664_asm(uni TMP, uni kn, uni_t i, uni d1, uni d2, uni CNS);
fp_2e128mc_x8664.c: ^~~~~~~~~~~~~~~~~~~~~~~~~~~~~~~~~~~
fp_2e128mc_x8664.c: finite128.h:894:13: warning: inline function 'kum_fp_dbl_2e064mce2_g_x8664_asm' declared but never defined
fp_2e128mc_x8664.c: inline void kum_fp_dbl_2e064mce2_g_x8664_asm(uni TMP, void *NOPARAM1, void *NOPARAM2, uni d1, void *NOPARAM3, uni CNS);
fp_2e128mc_x8664.c: ^~~~~~~~~~~~~~~~~~~~~~~~~~~~~~~~
fp_2e128mc_x8664.c: finite128.h:874:13: warning: inline function 'hec_fp_aadd_2e064mce2_g2i_x8664_asm' declared but never defined
fp_2e128mc_x8664.c: inline void hec_fp_aadd_2e064mce2_g2i_x8664_asm(uni TMP, uni_t prm, void *NOPARAM, uni D3, uni d1, uni d2);
fp_2e128mc_x8664.c: ^~~~~~~~~~~~~~~~~~~~~~~~~~~~~~~~~~~
fp_2e128mc_x8664.c: finite128.h:873:13: warning: inline function 'hec_fp_madd_2e064mce2_g2i_x8664_asm' declared but never defined
fp_2e128mc_x8664.c: inline void hec_fp_madd_2e064mce2_g2i_x8664_asm(uni TMP, uni_t prm, void *NOPARAM, uni D3, uni d1, uni d2);
fp_2e128mc_x8664.c: ^~~~~~~~~~~~~~~~~~~~~~~~~~~~~~~~~~~
fp_2e128mc_x8664.c: finite128.h:872:13: warning: inline function 'hec_fp_add_2e064mce2_g2i_x8664_asm' declared but never defined
fp_2e128mc_x8664.c: inline void hec_fp_add_2e064mce2_g2i_x8664_asm(uni TMP, uni_t prm, void *NOPARAM, uni D3, uni d1, uni d2);
fp_2e128mc_x8664.c: ^~~~~~~~~~~~~~~~~~~~~~~~~~~~~~~~~~
fp_2e128mc_x8664.c: finite128.h:871:13: warning: inline function 'hec_fp_dbl_2e064mce2_g2i_a2a3is0_x8664_asm' declared but never defined
fp_2e128mc_x8664.c: inline void hec_fp_dbl_2e064mce2_g2i_a2a3is0_x8664_asm(uni TMP, uni_t prm, void *NOPARAM, uni D3, uni d1, uni CNS);
fp_2e128mc_x8664.c: ^~~~~~~~~~~~~~~~~~~~~~~~~~~~~~~~~~~~~~~~~~
fp_2e128mc_x8664.c: finite128.h:870:13: warning: inline function 'hec_fp_dbl_2e064mce2_g2i_x8664_asm' declared but never defined
fp_2e128mc_x8664.c: inline void hec_fp_dbl_2e064mce2_g2i_x8664_asm(uni TMP, uni_t prm, void *NOPARAM, uni D3, uni d1, uni CNS);
fp_2e128mc_x8664.c: ^~~~~~~~~~~~~~~~~~~~~~~~~~~~~~~~~~
fp_2e128mc_x8664.c: finite128.h:647:13: warning: inline function 'kum_fp_dbladd_2e061m1e2_g_x8664_asm' declared but never defined
fp_2e128mc_x8664.c: inline void kum_fp_dbladd_2e061m1e2_g_x8664_asm(uni TMP, uni kn, uni_t i, uni d1, uni d2, uni CNS);
fp_2e128mc_x8664.c: ^~~~~~~~~~~~~~~~~~~~~~~~~~~~~~~~~~~
fp_2e128mc_x8664.c: ...
smul.c: In file included from smul.c:13:0:
smul.c: finite128.h:895:13: warning: inline function 'kum_fp_dbladd_2e064mce2_g_x8664_asm' declared but never defined
smul.c: inline void kum_fp_dbladd_2e064mce2_g_x8664_asm(uni TMP, uni kn, uni_t i, uni d1, uni d2, uni CNS);
smul.c: ^~~~~~~~~~~~~~~~~~~~~~~~~~~~~~~~~~~
smul.c: finite128.h:894:13: warning: inline function 'kum_fp_dbl_2e064mce2_g_x8664_asm' declared but never defined
smul.c: inline void kum_fp_dbl_2e064mce2_g_x8664_asm(uni TMP, void *NOPARAM1, void *NOPARAM2, uni d1, void *NOPARAM3, uni CNS);
smul.c: ^~~~~~~~~~~~~~~~~~~~~~~~~~~~~~~~
smul.c: finite128.h:874:13: warning: inline function 'hec_fp_aadd_2e064mce2_g2i_x8664_asm' declared but never defined
smul.c: inline void hec_fp_aadd_2e064mce2_g2i_x8664_asm(uni TMP, uni_t prm, void *NOPARAM, uni D3, uni d1, uni d2);
smul.c: ^~~~~~~~~~~~~~~~~~~~~~~~~~~~~~~~~~~
smul.c: finite128.h:873:13: warning: inline function 'hec_fp_madd_2e064mce2_g2i_x8664_asm' declared but never defined
smul.c: inline void hec_fp_madd_2e064mce2_g2i_x8664_asm(uni TMP, uni_t prm, void *NOPARAM, uni D3, uni d1, uni d2);
smul.c: ^~~~~~~~~~~~~~~~~~~~~~~~~~~~~~~~~~~
smul.c: finite128.h:872:13: warning: inline function 'hec_fp_add_2e064mce2_g2i_x8664_asm' declared but never defined
smul.c: inline void hec_fp_add_2e064mce2_g2i_x8664_asm(uni TMP, uni_t prm, void *NOPARAM, uni D3, uni d1, uni d2);
smul.c: ^~~~~~~~~~~~~~~~~~~~~~~~~~~~~~~~~~
smul.c: finite128.h:871:13: warning: inline function 'hec_fp_dbl_2e064mce2_g2i_a2a3is0_x8664_asm' declared but never defined
smul.c: inline void hec_fp_dbl_2e064mce2_g2i_a2a3is0_x8664_asm(uni TMP, uni_t prm, void *NOPARAM, uni D3, uni d1, uni CNS);
smul.c: ^~~~~~~~~~~~~~~~~~~~~~~~~~~~~~~~~~~~~~~~~~
smul.c: finite128.h:870:13: warning: inline function 'hec_fp_dbl_2e064mce2_g2i_x8664_asm' declared but never defined
smul.c: inline void hec_fp_dbl_2e064mce2_g2i_x8664_asm(uni TMP, uni_t prm, void *NOPARAM, uni D3, uni d1, uni CNS);
smul.c: ^~~~~~~~~~~~~~~~~~~~~~~~~~~~~~~~~~
smul.c: finite128.h:647:13: warning: inline function 'kum_fp_dbladd_2e061m1e2_g_x8664_asm' declared but never defined
smul.c: inline void kum_fp_dbladd_2e061m1e2_g_x8664_asm(uni TMP, uni kn, uni_t i, uni d1, uni d2, uni CNS);
smul.c: ^~~~~~~~~~~~~~~~~~~~~~~~~~~~~~~~~~~
smul.c: ...
smul_a2a3is0.c: In file included from smul_a2a3is0.c:13:0:
smul_a2a3is0.c: finite128.h:895:13: warning: inline function 'kum_fp_dbladd_2e064mce2_g_x8664_asm' declared but never defined
smul_a2a3is0.c: inline void kum_fp_dbladd_2e064mce2_g_x8664_asm(uni TMP, uni kn, uni_t i, uni d1, uni d2, uni CNS);
smul_a2a3is0.c: ^~~~~~~~~~~~~~~~~~~~~~~~~~~~~~~~~~~
smul_a2a3is0.c: finite128.h:894:13: warning: inline function 'kum_fp_dbl_2e064mce2_g_x8664_asm' declared but never defined
smul_a2a3is0.c: inline void kum_fp_dbl_2e064mce2_g_x8664_asm(uni TMP, void *NOPARAM1, void *NOPARAM2, uni d1, void *NOPARAM3, uni CNS);
smul_a2a3is0.c: ^~~~~~~~~~~~~~~~~~~~~~~~~~~~~~~~
smul_a2a3is0.c: finite128.h:874:13: warning: inline function 'hec_fp_aadd_2e064mce2_g2i_x8664_asm' declared but never defined
smul_a2a3is0.c: inline void hec_fp_aadd_2e064mce2_g2i_x8664_asm(uni TMP, uni_t prm, void *NOPARAM, uni D3, uni d1, uni d2);
smul_a2a3is0.c: ^~~~~~~~~~~~~~~~~~~~~~~~~~~~~~~~~~~
smul_a2a3is0.c: finite128.h:873:13: warning: inline function 'hec_fp_madd_2e064mce2_g2i_x8664_asm' declared but never defined
smul_a2a3is0.c: inline void hec_fp_madd_2e064mce2_g2i_x8664_asm(uni TMP, uni_t prm, void *NOPARAM, uni D3, uni d1, uni d2);
smul_a2a3is0.c: ^~~~~~~~~~~~~~~~~~~~~~~~~~~~~~~~~~~
smul_a2a3is0.c: finite128.h:872:13: warning: inline function 'hec_fp_add_2e064mce2_g2i_x8664_asm' declared but never defined
smul_a2a3is0.c: inline void hec_fp_add_2e064mce2_g2i_x8664_asm(uni TMP, uni_t prm, void *NOPARAM, uni D3, uni d1, uni d2);
smul_a2a3is0.c: ^~~~~~~~~~~~~~~~~~~~~~~~~~~~~~~~~~
smul_a2a3is0.c: finite128.h:871:13: warning: inline function 'hec_fp_dbl_2e064mce2_g2i_a2a3is0_x8664_asm' declared but never defined
smul_a2a3is0.c: inline void hec_fp_dbl_2e064mce2_g2i_a2a3is0_x8664_asm(uni TMP, uni_t prm, void *NOPARAM, uni D3, uni d1, uni CNS);
smul_a2a3is0.c: ^~~~~~~~~~~~~~~~~~~~~~~~~~~~~~~~~~~~~~~~~~
smul_a2a3is0.c: finite128.h:870:13: warning: inline function 'hec_fp_dbl_2e064mce2_g2i_x8664_asm' declared but never defined
smul_a2a3is0.c: inline void hec_fp_dbl_2e064mce2_g2i_x8664_asm(uni TMP, uni_t prm, void *NOPARAM, uni D3, uni d1, uni CNS);
smul_a2a3is0.c: ^~~~~~~~~~~~~~~~~~~~~~~~~~~~~~~~~~
smul_a2a3is0.c: finite128.h:647:13: warning: inline function 'kum_fp_dbladd_2e061m1e2_g_x8664_asm' declared but never defined
smul_a2a3is0.c: inline void kum_fp_dbladd_2e061m1e2_g_x8664_asm(uni TMP, uni kn, uni_t i, uni d1, uni d2, uni CNS);
smul_a2a3is0.c: ^~~~~~~~~~~~~~~~~~~~~~~~~~~~~~~~~~~
smul_a2a3is0.c: ...
smul_glv4.c: In file included from smul_glv4.c:11:0:
smul_glv4.c: finite128.h:895:13: warning: inline function 'kum_fp_dbladd_2e064mce2_g_x8664_asm' declared but never defined
smul_glv4.c: inline void kum_fp_dbladd_2e064mce2_g_x8664_asm(uni TMP, uni kn, uni_t i, uni d1, uni d2, uni CNS);
smul_glv4.c: ^~~~~~~~~~~~~~~~~~~~~~~~~~~~~~~~~~~
smul_glv4.c: finite128.h:894:13: warning: inline function 'kum_fp_dbl_2e064mce2_g_x8664_asm' declared but never defined
smul_glv4.c: inline void kum_fp_dbl_2e064mce2_g_x8664_asm(uni TMP, void *NOPARAM1, void *NOPARAM2, uni d1, void *NOPARAM3, uni CNS);
smul_glv4.c: ^~~~~~~~~~~~~~~~~~~~~~~~~~~~~~~~
smul_glv4.c: finite128.h:874:13: warning: inline function 'hec_fp_aadd_2e064mce2_g2i_x8664_asm' declared but never defined
smul_glv4.c: inline void hec_fp_aadd_2e064mce2_g2i_x8664_asm(uni TMP, uni_t prm, void *NOPARAM, uni D3, uni d1, uni d2);
smul_glv4.c: ^~~~~~~~~~~~~~~~~~~~~~~~~~~~~~~~~~~
smul_glv4.c: finite128.h:873:13: warning: inline function 'hec_fp_madd_2e064mce2_g2i_x8664_asm' declared but never defined
smul_glv4.c: inline void hec_fp_madd_2e064mce2_g2i_x8664_asm(uni TMP, uni_t prm, void *NOPARAM, uni D3, uni d1, uni d2);
smul_glv4.c: ^~~~~~~~~~~~~~~~~~~~~~~~~~~~~~~~~~~
smul_glv4.c: finite128.h:872:13: warning: inline function 'hec_fp_add_2e064mce2_g2i_x8664_asm' declared but never defined
smul_glv4.c: inline void hec_fp_add_2e064mce2_g2i_x8664_asm(uni TMP, uni_t prm, void *NOPARAM, uni D3, uni d1, uni d2);
smul_glv4.c: ^~~~~~~~~~~~~~~~~~~~~~~~~~~~~~~~~~
smul_glv4.c: finite128.h:871:13: warning: inline function 'hec_fp_dbl_2e064mce2_g2i_a2a3is0_x8664_asm' declared but never defined
smul_glv4.c: inline void hec_fp_dbl_2e064mce2_g2i_a2a3is0_x8664_asm(uni TMP, uni_t prm, void *NOPARAM, uni D3, uni d1, uni CNS);
smul_glv4.c: ^~~~~~~~~~~~~~~~~~~~~~~~~~~~~~~~~~~~~~~~~~
smul_glv4.c: finite128.h:870:13: warning: inline function 'hec_fp_dbl_2e064mce2_g2i_x8664_asm' declared but never defined
smul_glv4.c: inline void hec_fp_dbl_2e064mce2_g2i_x8664_asm(uni TMP, uni_t prm, void *NOPARAM, uni D3, uni d1, uni CNS);
smul_glv4.c: ^~~~~~~~~~~~~~~~~~~~~~~~~~~~~~~~~~
smul_glv4.c: finite128.h:647:13: warning: inline function 'kum_fp_dbladd_2e061m1e2_g_x8664_asm' declared but never defined
smul_glv4.c: inline void kum_fp_dbladd_2e061m1e2_g_x8664_asm(uni TMP, uni kn, uni_t i, uni d1, uni d2, uni CNS);
smul_glv4.c: ^~~~~~~~~~~~~~~~~~~~~~~~~~~~~~~~~~~
smul_glv4.c: ...
test.c: In file included from test.c:11:0:
test.c: finite128.h:895:13: warning: inline function 'kum_fp_dbladd_2e064mce2_g_x8664_asm' declared but never defined
test.c: inline void kum_fp_dbladd_2e064mce2_g_x8664_asm(uni TMP, uni kn, uni_t i, uni d1, uni d2, uni CNS);
test.c: ^~~~~~~~~~~~~~~~~~~~~~~~~~~~~~~~~~~
test.c: finite128.h:894:13: warning: inline function 'kum_fp_dbl_2e064mce2_g_x8664_asm' declared but never defined
test.c: inline void kum_fp_dbl_2e064mce2_g_x8664_asm(uni TMP, void *NOPARAM1, void *NOPARAM2, uni d1, void *NOPARAM3, uni CNS);
test.c: ^~~~~~~~~~~~~~~~~~~~~~~~~~~~~~~~
test.c: finite128.h:874:13: warning: inline function 'hec_fp_aadd_2e064mce2_g2i_x8664_asm' declared but never defined
test.c: inline void hec_fp_aadd_2e064mce2_g2i_x8664_asm(uni TMP, uni_t prm, void *NOPARAM, uni D3, uni d1, uni d2);
test.c: ^~~~~~~~~~~~~~~~~~~~~~~~~~~~~~~~~~~
test.c: finite128.h:873:13: warning: inline function 'hec_fp_madd_2e064mce2_g2i_x8664_asm' declared but never defined
test.c: inline void hec_fp_madd_2e064mce2_g2i_x8664_asm(uni TMP, uni_t prm, void *NOPARAM, uni D3, uni d1, uni d2);
test.c: ^~~~~~~~~~~~~~~~~~~~~~~~~~~~~~~~~~~
test.c: finite128.h:872:13: warning: inline function 'hec_fp_add_2e064mce2_g2i_x8664_asm' declared but never defined
test.c: inline void hec_fp_add_2e064mce2_g2i_x8664_asm(uni TMP, uni_t prm, void *NOPARAM, uni D3, uni d1, uni d2);
test.c: ^~~~~~~~~~~~~~~~~~~~~~~~~~~~~~~~~~
test.c: finite128.h:871:13: warning: inline function 'hec_fp_dbl_2e064mce2_g2i_a2a3is0_x8664_asm' declared but never defined
test.c: inline void hec_fp_dbl_2e064mce2_g2i_a2a3is0_x8664_asm(uni TMP, uni_t prm, void *NOPARAM, uni D3, uni d1, uni CNS);
test.c: ^~~~~~~~~~~~~~~~~~~~~~~~~~~~~~~~~~~~~~~~~~
test.c: finite128.h:870:13: warning: inline function 'hec_fp_dbl_2e064mce2_g2i_x8664_asm' declared but never defined
test.c: inline void hec_fp_dbl_2e064mce2_g2i_x8664_asm(uni TMP, uni_t prm, void *NOPARAM, uni D3, uni d1, uni CNS);
test.c: ^~~~~~~~~~~~~~~~~~~~~~~~~~~~~~~~~~
test.c: finite128.h:647:13: warning: inline function 'kum_fp_dbladd_2e061m1e2_g_x8664_asm' declared but never defined
test.c: inline void kum_fp_dbladd_2e061m1e2_g_x8664_asm(uni TMP, uni kn, uni_t i, uni d1, uni d2, uni CNS);
test.c: ^~~~~~~~~~~~~~~~~~~~~~~~~~~~~~~~~~~
test.c: ...
try.c: crypto_dh_prjfp128bk.a(fp_2e128mc_x8664.o): In function `fp_inv_2e128mc_x8664':
try.c: fp_2e128mc_x8664.c:(.text+0x...): undefined reference to `fp_cnt_bits'
try.c: crypto_dh_prjfp128bk.a(smul_a2a3is0.o): In function `hec_fp_smul_2e128mc_g2i_a2a3is0':
try.c: smul_a2a3is0.c:(.text+0x...): undefined reference to `fp_cnt_bits'
try.c: smul_a2a3is0.c:(.text+0x...): undefined reference to `find_nextwindow'
try.c: smul_a2a3is0.c:(.text+0x...): undefined reference to `find_nextwindow'
try.c: crypto_dh_prjfp128bk.a(smul_glv4.o): In function `hec_fp_smul_2e128mc_bk_glv4':
try.c: smul_glv4.c:(.text+0x...): undefined reference to `fp_cnt_bits'
try.c: smul_glv4.c:(.text+0x...): undefined reference to `fp_cnt_bits'
try.c: smul_glv4.c:(.text+0x...): undefined reference to `fp_cnt_bits'
try.c: smul_glv4.c:(.text+0x...): undefined reference to `fp_cnt_bits'
try.c: collect2: error: ld returned 1 exit status

Number of similar (compiler,implementation) pairs: 48, namely:
CompilerImplementations
gcc -march=native -mtune=native -O2 -fomit-frame-pointer -fwrapv -fPIC -fPIE v01/w4s01glv4
gcc -march=native -mtune=native -O3 -fomit-frame-pointer -fwrapv -fPIC -fPIE v01/w4s01glv4
gcc -march=native -mtune=native -O -fomit-frame-pointer -fwrapv -fPIC -fPIE v01/w4s01glv4
gcc -march=native -mtune=native -Os -fomit-frame-pointer -fwrapv -fPIC -fPIE v01/w4s01glv4
gcc -march=native -mtune=native -O2 -fomit-frame-pointer -fwrapv -fPIC -fPIE v01/w4s02glv4
gcc -march=native -mtune=native -O3 -fomit-frame-pointer -fwrapv -fPIC -fPIE v01/w4s02glv4
gcc -march=native -mtune=native -O -fomit-frame-pointer -fwrapv -fPIC -fPIE v01/w4s02glv4
gcc -march=native -mtune=native -Os -fomit-frame-pointer -fwrapv -fPIC -fPIE v01/w4s02glv4
gcc -march=native -mtune=native -O2 -fomit-frame-pointer -fwrapv -fPIC -fPIE v01/w4s04glv4
gcc -march=native -mtune=native -O3 -fomit-frame-pointer -fwrapv -fPIC -fPIE v01/w4s04glv4
gcc -march=native -mtune=native -O -fomit-frame-pointer -fwrapv -fPIC -fPIE v01/w4s04glv4
gcc -march=native -mtune=native -Os -fomit-frame-pointer -fwrapv -fPIC -fPIE v01/w4s04glv4
gcc -march=native -mtune=native -O2 -fomit-frame-pointer -fwrapv -fPIC -fPIE v01/w4s08glv4
gcc -march=native -mtune=native -O3 -fomit-frame-pointer -fwrapv -fPIC -fPIE v01/w4s08glv4
gcc -march=native -mtune=native -O -fomit-frame-pointer -fwrapv -fPIC -fPIE v01/w4s08glv4
gcc -march=native -mtune=native -Os -fomit-frame-pointer -fwrapv -fPIC -fPIE v01/w4s08glv4
gcc -march=native -mtune=native -O2 -fomit-frame-pointer -fwrapv -fPIC -fPIE v01/w4s16glv4
gcc -march=native -mtune=native -O3 -fomit-frame-pointer -fwrapv -fPIC -fPIE v01/w4s16glv4
gcc -march=native -mtune=native -O -fomit-frame-pointer -fwrapv -fPIC -fPIE v01/w4s16glv4
gcc -march=native -mtune=native -Os -fomit-frame-pointer -fwrapv -fPIC -fPIE v01/w4s16glv4
gcc -march=native -mtune=native -O2 -fomit-frame-pointer -fwrapv -fPIC -fPIE v01/w4s32glv4
gcc -march=native -mtune=native -O3 -fomit-frame-pointer -fwrapv -fPIC -fPIE v01/w4s32glv4
gcc -march=native -mtune=native -O -fomit-frame-pointer -fwrapv -fPIC -fPIE v01/w4s32glv4
gcc -march=native -mtune=native -Os -fomit-frame-pointer -fwrapv -fPIC -fPIE v01/w4s32glv4
gcc -march=native -mtune=native -O2 -fomit-frame-pointer -fwrapv -fPIC -fPIE v01/w8s01glv4
gcc -march=native -mtune=native -O3 -fomit-frame-pointer -fwrapv -fPIC -fPIE v01/w8s01glv4
gcc -march=native -mtune=native -O -fomit-frame-pointer -fwrapv -fPIC -fPIE v01/w8s01glv4
gcc -march=native -mtune=native -Os -fomit-frame-pointer -fwrapv -fPIC -fPIE v01/w8s01glv4
gcc -march=native -mtune=native -O2 -fomit-frame-pointer -fwrapv -fPIC -fPIE v01/w8s02glv4
gcc -march=native -mtune=native -O3 -fomit-frame-pointer -fwrapv -fPIC -fPIE v01/w8s02glv4
gcc -march=native -mtune=native -O -fomit-frame-pointer -fwrapv -fPIC -fPIE v01/w8s02glv4
gcc -march=native -mtune=native -Os -fomit-frame-pointer -fwrapv -fPIC -fPIE v01/w8s02glv4
gcc -march=native -mtune=native -O2 -fomit-frame-pointer -fwrapv -fPIC -fPIE v01/w8s04glv4
gcc -march=native -mtune=native -O3 -fomit-frame-pointer -fwrapv -fPIC -fPIE v01/w8s04glv4
gcc -march=native -mtune=native -O -fomit-frame-pointer -fwrapv -fPIC -fPIE v01/w8s04glv4
gcc -march=native -mtune=native -Os -fomit-frame-pointer -fwrapv -fPIC -fPIE v01/w8s04glv4
gcc -march=native -mtune=native -O2 -fomit-frame-pointer -fwrapv -fPIC -fPIE v01/w8s08glv4
gcc -march=native -mtune=native -O3 -fomit-frame-pointer -fwrapv -fPIC -fPIE v01/w8s08glv4
gcc -march=native -mtune=native -O -fomit-frame-pointer -fwrapv -fPIC -fPIE v01/w8s08glv4
gcc -march=native -mtune=native -Os -fomit-frame-pointer -fwrapv -fPIC -fPIE v01/w8s08glv4
gcc -march=native -mtune=native -O2 -fomit-frame-pointer -fwrapv -fPIC -fPIE v01/w8s16glv4
gcc -march=native -mtune=native -O3 -fomit-frame-pointer -fwrapv -fPIC -fPIE v01/w8s16glv4
gcc -march=native -mtune=native -O -fomit-frame-pointer -fwrapv -fPIC -fPIE v01/w8s16glv4
gcc -march=native -mtune=native -Os -fomit-frame-pointer -fwrapv -fPIC -fPIE v01/w8s16glv4
gcc -march=native -mtune=native -O2 -fomit-frame-pointer -fwrapv -fPIC -fPIE v01/w8s32glv4
gcc -march=native -mtune=native -O3 -fomit-frame-pointer -fwrapv -fPIC -fPIE v01/w8s32glv4
gcc -march=native -mtune=native -O -fomit-frame-pointer -fwrapv -fPIC -fPIE v01/w8s32glv4
gcc -march=native -mtune=native -Os -fomit-frame-pointer -fwrapv -fPIC -fPIE v01/w8s32glv4