Implementation notes: amd64, hydra8, crypto_hash/k12

Computer: hydra8
Microarchitecture: amd64; Ivy Bridge+AES (306a9)
Architecture: amd64
CPU ID: GenuineIntel-000306a9-bfebfbff
SUPERCOP version: 20240425
Operation: crypto_hash
Primitive: k12
TimeObject sizeTest sizeImplementationCompilerBenchmark dateSUPERCOP version
795374619 0 087128 860 896T:kcp/optimized1600lcufullclang_-march=native_-O2_-fomit-frame-pointer_-fwrapv_-Qunused-arguments_-fPIC_-fPIE2024042620240425
796074691 0 089144 860 896T:kcp/optimized1600lcufullclang_-march=native_-O3_-fomit-frame-pointer_-fwrapv_-Qunused-arguments_-fPIC_-fPIE2024042620240425
796464175 0 074586 852 896T:kcp/optimized1600lcufullclang_-march=native_-Os_-fomit-frame-pointer_-fwrapv_-Qunused-arguments_-fPIC_-fPIE2024042620240425
797865110 0 075896 860 896T:kcp/optimized1600lcufullclang_-march=native_-O_-fomit-frame-pointer_-fwrapv_-Qunused-arguments_-fPIC_-fPIE2024042620240425
802871823 0 084920 860 896T:kcp/optimized1600lcufullshldclang_-mcpu=native_-O3_-fomit-frame-pointer_-fwrapv_-Qunused-arguments_-fPIC_-fPIE2024042620240425
803874127 0 088584 860 896T:kcp/optimized1600lcufullshldclang_-march=native_-O3_-fomit-frame-pointer_-fwrapv_-Qunused-arguments_-fPIC_-fPIE2024042620240425
803974055 0 086568 860 896T:kcp/optimized1600lcufullshldclang_-march=native_-O2_-fomit-frame-pointer_-fwrapv_-Qunused-arguments_-fPIC_-fPIE2024042620240425
804863444 0 073850 852 896T:kcp/optimized1600lcufullshldclang_-march=native_-Os_-fomit-frame-pointer_-fwrapv_-Qunused-arguments_-fPIC_-fPIE2024042620240425
806260522 0 071007 788 928T:kcp/optimized1600lcufullshldgcc_-march=native_-mtune=native_-Os_-fomit-frame-pointer_-fwrapv_-fPIC_-fPIE2024042620240425
806564498 0 075288 860 896T:kcp/optimized1600lcufullshldclang_-march=native_-O_-fomit-frame-pointer_-fwrapv_-Qunused-arguments_-fPIC_-fPIE2024042620240425
818063376 0 074947 804 960T:kcp/optimized1600lcufullshldgcc_-march=native_-mtune=native_-O_-fomit-frame-pointer_-fwrapv_-fPIC_-fPIE2024042620240425
824240804 0 055256 860 896T:kcp/optimized1600lcu6clang_-march=native_-O3_-fomit-frame-pointer_-fwrapv_-Qunused-arguments_-fPIC_-fPIE2024042620240425
825040732 0 053240 860 896T:kcp/optimized1600lcu6clang_-march=native_-O2_-fomit-frame-pointer_-fwrapv_-Qunused-arguments_-fPIC_-fPIE2024042620240425
825631223 0 042008 860 896T:kcp/optimized1600lcu6clang_-march=native_-O_-fomit-frame-pointer_-fwrapv_-Qunused-arguments_-fPIC_-fPIE2024042620240425
828064762 0 076692 812 960T:kcp/optimized1600lcufullshldgcc_-march=native_-mtune=native_-O2_-fomit-frame-pointer_-fwrapv_-fPIC_-fPIE2024042620240425
830369944 0 083048 860 896T:kcp/optimized1600lcufullclang_-mcpu=native_-O3_-fomit-frame-pointer_-fwrapv_-Qunused-arguments_-fPIC_-fPIE2024042620240425
830758467 0 068943 788 928T:kcp/optimized1600lcufullgcc_-march=native_-mtune=native_-Os_-fomit-frame-pointer_-fwrapv_-fPIC_-fPIE2024042620240425
832730218 0 040634 852 896T:kcp/optimized1600lcu6clang_-march=native_-Os_-fomit-frame-pointer_-fwrapv_-Qunused-arguments_-fPIC_-fPIE2024042620240425
844837729 0 050824 860 896T:kcp/optimized1600lcu6clang_-mcpu=native_-O3_-fomit-frame-pointer_-fwrapv_-Qunused-arguments_-fPIC_-fPIE2024042620240425
846669515 0 082708 812 960T:kcp/optimized1600lcufullshldgcc_-march=native_-mtune=native_-O3_-fomit-frame-pointer_-fwrapv_-fPIC_-fPIE2024042620240425
856261317 0 072851 804 960T:kcp/optimized1600lcufullgcc_-march=native_-mtune=native_-O_-fomit-frame-pointer_-fwrapv_-fPIC_-fPIE2024042620240425
870429959 0 041860 812 960T:kcp/optimized1600lcu6gcc_-march=native_-mtune=native_-O2_-fomit-frame-pointer_-fwrapv_-fPIC_-fPIE2024042620240425
871327691 0 038175 788 928T:kcp/optimized1600lcu6gcc_-march=native_-mtune=native_-Os_-fomit-frame-pointer_-fwrapv_-fPIC_-fPIE2024042620240425
884960918 0 071399 788 928T:kcp/optimized1600ufullgcc_-march=native_-mtune=native_-Os_-fomit-frame-pointer_-fwrapv_-fPIC_-fPIE2024042620240425
887662759 0 074660 812 960T:kcp/optimized1600lcufullgcc_-march=native_-mtune=native_-O2_-fomit-frame-pointer_-fwrapv_-fPIC_-fPIE2024042620240425
888428952 0 040483 804 960T:kcp/optimized1600lcu6gcc_-march=native_-mtune=native_-O_-fomit-frame-pointer_-fwrapv_-fPIC_-fPIE2024042620240425
888568394 0 078810 852 896T:kcp/optimized1600ufullclang_-march=native_-Os_-fomit-frame-pointer_-fwrapv_-Qunused-arguments_-fPIC_-fPIE2024042620240425
899467458 0 080612 812 960T:kcp/optimized1600lcufullgcc_-march=native_-mtune=native_-O3_-fomit-frame-pointer_-fwrapv_-fPIC_-fPIE2024042620240425
903477135 0 089656 860 896T:kcp/optimized1600ufullclang_-march=native_-O2_-fomit-frame-pointer_-fwrapv_-Qunused-arguments_-fPIC_-fPIE2024042620240425
903577239 0 091704 860 896T:kcp/optimized1600ufullclang_-march=native_-O3_-fomit-frame-pointer_-fwrapv_-Qunused-arguments_-fPIC_-fPIE2024042620240425
904268970 0 079768 860 896T:kcp/optimized1600ufullclang_-march=native_-O_-fomit-frame-pointer_-fwrapv_-Qunused-arguments_-fPIC_-fPIE2024042620240425
912530897 0 041306 852 896T:kcp/optimized1600u6clang_-march=native_-Os_-fomit-frame-pointer_-fwrapv_-Qunused-arguments_-fPIC_-fPIE2024042620240425
915339818 0 052336 860 896T:kcp/optimized1600u6clang_-march=native_-O2_-fomit-frame-pointer_-fwrapv_-Qunused-arguments_-fPIC_-fPIE2024042620240425
916731661 0 042456 860 896T:kcp/optimized1600u6clang_-march=native_-O_-fomit-frame-pointer_-fwrapv_-Qunused-arguments_-fPIC_-fPIE2024042620240425
919339922 0 054384 860 896T:kcp/optimized1600u6clang_-march=native_-O3_-fomit-frame-pointer_-fwrapv_-Qunused-arguments_-fPIC_-fPIE2024042620240425
929036984 0 050088 860 896T:kcp/optimized1600u6clang_-mcpu=native_-O3_-fomit-frame-pointer_-fwrapv_-Qunused-arguments_-fPIC_-fPIE2024042620240425
932733985 0 047140 812 960T:kcp/optimized1600lcu6gcc_-march=native_-mtune=native_-O3_-fomit-frame-pointer_-fwrapv_-fPIC_-fPIE2024042620240425
933772831 0 085936 860 896T:kcp/optimized1600ufullclang_-mcpu=native_-O3_-fomit-frame-pointer_-fwrapv_-Qunused-arguments_-fPIC_-fPIE2024042620240425
938364150 0 075780 812 960T:kcp/optimized1600ufullgcc_-march=native_-mtune=native_-O_-fomit-frame-pointer_-fwrapv_-fPIC_-fPIE2024042620240425
942328750 0 039223 788 928T:kcp/optimized1600u6gcc_-march=native_-mtune=native_-Os_-fomit-frame-pointer_-fwrapv_-fPIC_-fPIE2024042620240425
955430766 0 042676 812 960T:kcp/optimized1600u6gcc_-march=native_-mtune=native_-O2_-fomit-frame-pointer_-fwrapv_-fPIC_-fPIE2024042620240425
959565479 0 077380 812 960T:kcp/optimized1600ufullgcc_-march=native_-mtune=native_-O2_-fomit-frame-pointer_-fwrapv_-fPIC_-fPIE2024042620240425
979969652 0 082812 812 960T:kcp/optimized1600ufullgcc_-march=native_-mtune=native_-O3_-fomit-frame-pointer_-fwrapv_-fPIC_-fPIE2024042620240425
989630232 0 041860 812 960T:kcp/optimized1600u6gcc_-march=native_-mtune=native_-O_-fomit-frame-pointer_-fwrapv_-fPIC_-fPIE2024042620240425
989733173 0 046332 812 960T:kcp/optimized1600u6gcc_-march=native_-mtune=native_-O3_-fomit-frame-pointer_-fwrapv_-fPIC_-fPIE2024042620240425
1198614097 0 027331 876 896T:kcp/reference1600clang_-mcpu=native_-O3_-fomit-frame-pointer_-fwrapv_-Qunused-arguments_-fPIC_-fPIE2024042620240425
1248216384 0 030979 876 896T:kcp/reference1600clang_-march=native_-O3_-fomit-frame-pointer_-fwrapv_-Qunused-arguments_-fPIC_-fPIE2024042620240425
1251615168 0 028272 860 896T:kcp/compact1600clang_-mcpu=native_-O3_-fomit-frame-pointer_-fwrapv_-Qunused-arguments_-fPIC_-fPIE2024042620240425
1273817514 0 031976 860 896T:kcp/compact1600clang_-march=native_-O3_-fomit-frame-pointer_-fwrapv_-Qunused-arguments_-fPIC_-fPIE2024042620240425
1278716392 0 029043 876 896T:kcp/reference1600clang_-march=native_-O2_-fomit-frame-pointer_-fwrapv_-Qunused-arguments_-fPIC_-fPIE2024042620240425
2145010027 0 023232 820 960T:kcp/reference1600gcc_-march=native_-mtune=native_-O3_-fomit-frame-pointer_-fwrapv_-fPIC_-fPIE2024042620240425
2174315661 0 028725 804 960T:kcp/compact1600gcc_-march=native_-mtune=native_-O3_-fomit-frame-pointer_-fwrapv_-fPIC_-fPIE2024042620240425
2418517227 0 028860 812 960T:kcp/inplace1600bigcc_-march=native_-mtune=native_-O_-fomit-frame-pointer_-fwrapv_-fPIC_-fPIE2024042620240425
2421826548 0 039700 812 960T:kcp/inplace1600bigcc_-march=native_-mtune=native_-O3_-fomit-frame-pointer_-fwrapv_-fPIC_-fPIE2024042620240425
2437829235 0 043560 860 896T:kcp/inplace1600biclang_-march=native_-O3_-fomit-frame-pointer_-fwrapv_-Qunused-arguments_-fPIC_-fPIE2024042620240425
2446129011 0 041392 860 896T:kcp/inplace1600biclang_-march=native_-O2_-fomit-frame-pointer_-fwrapv_-Qunused-arguments_-fPIC_-fPIE2024042620240425
2456917547 0 028039 788 928T:kcp/inplace1600bigcc_-march=native_-mtune=native_-Os_-fomit-frame-pointer_-fwrapv_-fPIC_-fPIE2024042620240425
2463117282 0 029800 860 896T:kcp/compact1600clang_-march=native_-O2_-fomit-frame-pointer_-fwrapv_-Qunused-arguments_-fPIC_-fPIE2024042620240425
2495426819 0 039640 860 896T:kcp/inplace1600biclang_-mcpu=native_-O3_-fomit-frame-pointer_-fwrapv_-Qunused-arguments_-fPIC_-fPIE2024042620240425
2734820119 0 032028 812 960T:kcp/inplace1600bigcc_-march=native_-mtune=native_-O2_-fomit-frame-pointer_-fwrapv_-fPIC_-fPIE2024042620240425
2748919649 0 030448 860 896T:kcp/inplace1600biclang_-march=native_-O_-fomit-frame-pointer_-fwrapv_-Qunused-arguments_-fPIC_-fPIE2024042620240425
2835718227 0 028642 852 896T:kcp/inplace1600biclang_-march=native_-Os_-fomit-frame-pointer_-fwrapv_-Qunused-arguments_-fPIC_-fPIE2024042620240425
410248330 0 020133 804 960T:kcp/compact1600gcc_-march=native_-mtune=native_-O2_-fomit-frame-pointer_-fwrapv_-fPIC_-fPIE2024042620240425
425177346 0 018128 860 896T:kcp/compact1600clang_-march=native_-O_-fomit-frame-pointer_-fwrapv_-Qunused-arguments_-fPIC_-fPIE2024042620240425
429636905 0 017280 780 928T:kcp/compact1600gcc_-march=native_-mtune=native_-Os_-fomit-frame-pointer_-fwrapv_-fPIC_-fPIE2024042620240425
460107680 0 019213 804 960T:kcp/compact1600gcc_-march=native_-mtune=native_-O_-fomit-frame-pointer_-fwrapv_-fPIC_-fPIE2024042620240425
495366731 0 017098 852 896T:kcp/compact1600clang_-march=native_-Os_-fomit-frame-pointer_-fwrapv_-Qunused-arguments_-fPIC_-fPIE2024042620240425
863758694 0 020616 820 960T:kcp/reference1600gcc_-march=native_-mtune=native_-O2_-fomit-frame-pointer_-fwrapv_-fPIC_-fPIE2024042620240425
876618370 0 019283 876 896T:kcp/reference1600clang_-march=native_-O_-fomit-frame-pointer_-fwrapv_-Qunused-arguments_-fPIC_-fPIE2024042620240425
1305558418 0 019983 812 960T:kcp/reference1600gcc_-march=native_-mtune=native_-O_-fomit-frame-pointer_-fwrapv_-fPIC_-fPIE2024042620240425
1365068056 0 018554 868 896T:kcp/reference1600clang_-march=native_-Os_-fomit-frame-pointer_-fwrapv_-Qunused-arguments_-fPIC_-fPIE2024042620240425
1949667277 0 017784 796 928T:kcp/reference1600gcc_-march=native_-mtune=native_-Os_-fomit-frame-pointer_-fwrapv_-fPIC_-fPIE2024042620240425
26682914612 0 027920 820 960T:kcp/reference1600-32bitsgcc_-march=native_-mtune=native_-O3_-fomit-frame-pointer_-fwrapv_-fPIC_-fPIE2024042620240425
38071411575 0 023576 820 960T:kcp/reference1600-32bitsgcc_-march=native_-mtune=native_-O2_-fomit-frame-pointer_-fwrapv_-fPIC_-fPIE2024042620240425
38557520669 0 035299 876 896T:kcp/reference1600-32bitsclang_-march=native_-O3_-fomit-frame-pointer_-fwrapv_-Qunused-arguments_-fPIC_-fPIE2024042620240425
40202918686 0 031955 876 896T:kcp/reference1600-32bitsclang_-mcpu=native_-O3_-fomit-frame-pointer_-fwrapv_-Qunused-arguments_-fPIC_-fPIE2024042620240425
41211112799 0 023747 876 896T:kcp/reference1600-32bitsclang_-march=native_-O_-fomit-frame-pointer_-fwrapv_-Qunused-arguments_-fPIC_-fPIE2024042620240425
45405918277 0 030963 876 896T:kcp/reference1600-32bitsclang_-march=native_-O2_-fomit-frame-pointer_-fwrapv_-Qunused-arguments_-fPIC_-fPIE2024042620240425
50495710848 0 022479 812 960T:kcp/reference1600-32bitsgcc_-march=native_-mtune=native_-O_-fomit-frame-pointer_-fwrapv_-fPIC_-fPIE2024042620240425
5593399523 0 020096 796 928T:kcp/reference1600-32bitsgcc_-march=native_-mtune=native_-Os_-fomit-frame-pointer_-fwrapv_-fPIC_-fPIE2024042620240425
5844809888 0 020458 868 896T:kcp/reference1600-32bitsclang_-march=native_-Os_-fomit-frame-pointer_-fwrapv_-Qunused-arguments_-fPIC_-fPIE2024042620240425

Compiler output

Implementation: T:kcp/inplace1600ARMv6M
Security model: timingleaks
Compiler: clang -march=native -O2 -fomit-frame-pointer -fwrapv -Qunused-arguments -fPIC -fPIE
keccak.s: keccak.s:1:1: error: unexpected token at start of statement
keccak.s: @
keccak.s: ^
keccak.s: keccak.s:2:1: error: unexpected token at start of statement
keccak.s: @ Implementation by the Keccak, Keyak and Ketje Teams, namely, Guido Bertoni,
keccak.s: ^
keccak.s: keccak.s:3:1: error: unexpected token at start of statement
keccak.s: @ Joan Daemen, Michaƫl Peeters, Gilles Van Assche and Ronny Van Keer, hereby
keccak.s: keccak.s:4:1: error: unexpected token at start of statement
keccak.s: @ denoted as "the implementer".
keccak.s: ^
keccak.s: keccak.s:5:1: error: unexpected token at start of statement
keccak.s: @
keccak.s: ^
keccak.s: keccak.s:6:1: error: unexpected token at start of statement
keccak.s: @ For more information, feedback or questions, please refer to our websites:
keccak.s: ^
keccak.s: keccak.s:7:1: error: unexpected token at start of statement
keccak.s: @ http://keccak.noekeon.org/
keccak.s: ^
keccak.s: keccak.s:8:1: error: unexpected token at start of statement
keccak.s: @ http://keyak.noekeon.org/
keccak.s: ^
keccak.s: keccak.s:9:1: error: unexpected token at start of statement
keccak.s: @ http://ketje.noekeon.org/
keccak.s: ...

Number of similar (compiler,implementation) pairs: 30, namely:
CompilerImplementations
clang -march=native -O2 -fomit-frame-pointer -fwrapv -Qunused-arguments -fPIC -fPIE T:kcp/inplace1600ARMv6M
clang -march=native -O3 -fomit-frame-pointer -fwrapv -Qunused-arguments -fPIC -fPIE T:kcp/inplace1600ARMv6M
clang -march=native -O -fomit-frame-pointer -fwrapv -Qunused-arguments -fPIC -fPIE T:kcp/inplace1600ARMv6M
clang -march=native -Os -fomit-frame-pointer -fwrapv -Qunused-arguments -fPIC -fPIE T:kcp/inplace1600ARMv6M
clang -mcpu=native -O3 -fomit-frame-pointer -fwrapv -Qunused-arguments -fPIC -fPIE T:kcp/inplace1600ARMv6M
clang -march=native -O2 -fomit-frame-pointer -fwrapv -Qunused-arguments -fPIC -fPIE T:kcp/inplace1600ARMv7A
clang -march=native -O3 -fomit-frame-pointer -fwrapv -Qunused-arguments -fPIC -fPIE T:kcp/inplace1600ARMv7A
clang -march=native -O -fomit-frame-pointer -fwrapv -Qunused-arguments -fPIC -fPIE T:kcp/inplace1600ARMv7A
clang -march=native -Os -fomit-frame-pointer -fwrapv -Qunused-arguments -fPIC -fPIE T:kcp/inplace1600ARMv7A
clang -mcpu=native -O3 -fomit-frame-pointer -fwrapv -Qunused-arguments -fPIC -fPIE T:kcp/inplace1600ARMv7A
clang -march=native -O2 -fomit-frame-pointer -fwrapv -Qunused-arguments -fPIC -fPIE T:kcp/inplace1600ARMv7M
clang -march=native -O3 -fomit-frame-pointer -fwrapv -Qunused-arguments -fPIC -fPIE T:kcp/inplace1600ARMv7M
clang -march=native -O -fomit-frame-pointer -fwrapv -Qunused-arguments -fPIC -fPIE T:kcp/inplace1600ARMv7M
clang -march=native -Os -fomit-frame-pointer -fwrapv -Qunused-arguments -fPIC -fPIE T:kcp/inplace1600ARMv7M
clang -mcpu=native -O3 -fomit-frame-pointer -fwrapv -Qunused-arguments -fPIC -fPIE T:kcp/inplace1600ARMv7M
clang -march=native -O2 -fomit-frame-pointer -fwrapv -Qunused-arguments -fPIC -fPIE T:kcp/optimized1600ARMv6Mu1
clang -march=native -O3 -fomit-frame-pointer -fwrapv -Qunused-arguments -fPIC -fPIE T:kcp/optimized1600ARMv6Mu1
clang -march=native -O -fomit-frame-pointer -fwrapv -Qunused-arguments -fPIC -fPIE T:kcp/optimized1600ARMv6Mu1
clang -march=native -Os -fomit-frame-pointer -fwrapv -Qunused-arguments -fPIC -fPIE T:kcp/optimized1600ARMv6Mu1
clang -mcpu=native -O3 -fomit-frame-pointer -fwrapv -Qunused-arguments -fPIC -fPIE T:kcp/optimized1600ARMv6Mu1
clang -march=native -O2 -fomit-frame-pointer -fwrapv -Qunused-arguments -fPIC -fPIE T:kcp/optimized1600ARMv6Mu2
clang -march=native -O3 -fomit-frame-pointer -fwrapv -Qunused-arguments -fPIC -fPIE T:kcp/optimized1600ARMv6Mu2
clang -march=native -O -fomit-frame-pointer -fwrapv -Qunused-arguments -fPIC -fPIE T:kcp/optimized1600ARMv6Mu2
clang -march=native -Os -fomit-frame-pointer -fwrapv -Qunused-arguments -fPIC -fPIE T:kcp/optimized1600ARMv6Mu2
clang -mcpu=native -O3 -fomit-frame-pointer -fwrapv -Qunused-arguments -fPIC -fPIE T:kcp/optimized1600ARMv6Mu2
clang -march=native -O2 -fomit-frame-pointer -fwrapv -Qunused-arguments -fPIC -fPIE T:kcp/optimized1600ARMv7A
clang -march=native -O3 -fomit-frame-pointer -fwrapv -Qunused-arguments -fPIC -fPIE T:kcp/optimized1600ARMv7A
clang -march=native -O -fomit-frame-pointer -fwrapv -Qunused-arguments -fPIC -fPIE T:kcp/optimized1600ARMv7A
clang -march=native -Os -fomit-frame-pointer -fwrapv -Qunused-arguments -fPIC -fPIE T:kcp/optimized1600ARMv7A
clang -mcpu=native -O3 -fomit-frame-pointer -fwrapv -Qunused-arguments -fPIC -fPIE T:kcp/optimized1600ARMv7A

Compiler output

Implementation: T:kcp/inplace1600ARMv6M
Security model: timingleaks
Compiler: gcc -march=native -mtune=native -O2 -fomit-frame-pointer -fwrapv -fPIC -fPIE
keccak.s: keccak.s: Assembler messages:
keccak.s: keccak.s:1: Error: junk at end of line, first unrecognized character is `@'
keccak.s: keccak.s:2: Error: junk at end of line, first unrecognized character is `@'
keccak.s: keccak.s:3: Error: junk at end of line, first unrecognized character is `@'
keccak.s: keccak.s:4: Error: junk at end of line, first unrecognized character is `@'
keccak.s: keccak.s:5: Error: junk at end of line, first unrecognized character is `@'
keccak.s: keccak.s:6: Error: junk at end of line, first unrecognized character is `@'
keccak.s: keccak.s:7: Error: junk at end of line, first unrecognized character is `@'
keccak.s: keccak.s:8: Error: junk at end of line, first unrecognized character is `@'
keccak.s: keccak.s:9: Error: junk at end of line, first unrecognized character is `@'
keccak.s: keccak.s:10: Error: junk at end of line, first unrecognized character is `@'
keccak.s: keccak.s:11: Error: junk at end of line, first unrecognized character is `@'
keccak.s: keccak.s:12: Error: junk at end of line, first unrecognized character is `@'
keccak.s: keccak.s:13: Error: junk at end of line, first unrecognized character is `@'
keccak.s: keccak.s:14: Error: junk at end of line, first unrecognized character is `@'
keccak.s: keccak.s:16: Error: junk at end of line, first unrecognized character is `@'
keccak.s: keccak.s:19: Error: unknown pseudo-op: `.thumb'
keccak.s: keccak.s:20: Error: unknown pseudo-op: `.syntax'
keccak.s: keccak.s:23: Error: junk at end of line, first unrecognized character is `@'
keccak.s: keccak.s:109: Error: junk at end of line, first unrecognized character is `@'
keccak.s: keccak.s:142: Error: junk at end of line, first unrecognized character is `@'
keccak.s: keccak.s:194: Error: junk at end of line, first unrecognized character is `@'
keccak.s: keccak.s:203: Error: junk at end of line, first unrecognized character is `@'
keccak.s: keccak.s:611: Error: junk at end of line, first unrecognized character is `@'
keccak.s: keccak.s:612: Error: junk at end of line, first unrecognized character is `@'
keccak.s: ...

Number of similar (compiler,implementation) pairs: 4, namely:
CompilerImplementations
gcc -march=native -mtune=native -O2 -fomit-frame-pointer -fwrapv -fPIC -fPIE T:kcp/inplace1600ARMv6M
gcc -march=native -mtune=native -O3 -fomit-frame-pointer -fwrapv -fPIC -fPIE T:kcp/inplace1600ARMv6M
gcc -march=native -mtune=native -O -fomit-frame-pointer -fwrapv -fPIC -fPIE T:kcp/inplace1600ARMv6M
gcc -march=native -mtune=native -Os -fomit-frame-pointer -fwrapv -fPIC -fPIE T:kcp/inplace1600ARMv6M

Compiler output

Implementation: T:kcp/inplace1600ARMv7A
Security model: timingleaks
Compiler: gcc -march=native -mtune=native -O2 -fomit-frame-pointer -fwrapv -fPIC -fPIE
keccak.s: keccak.s: Assembler messages:
keccak.s: keccak.s:1: Error: junk at end of line, first unrecognized character is `@'
keccak.s: keccak.s:2: Error: junk at end of line, first unrecognized character is `@'
keccak.s: keccak.s:3: Error: junk at end of line, first unrecognized character is `@'
keccak.s: keccak.s:4: Error: junk at end of line, first unrecognized character is `@'
keccak.s: keccak.s:5: Error: junk at end of line, first unrecognized character is `@'
keccak.s: keccak.s:6: Error: junk at end of line, first unrecognized character is `@'
keccak.s: keccak.s:7: Error: junk at end of line, first unrecognized character is `@'
keccak.s: keccak.s:8: Error: junk at end of line, first unrecognized character is `@'
keccak.s: keccak.s:9: Error: junk at end of line, first unrecognized character is `@'
keccak.s: keccak.s:10: Error: junk at end of line, first unrecognized character is `@'
keccak.s: keccak.s:11: Error: junk at end of line, first unrecognized character is `@'
keccak.s: keccak.s:12: Error: junk at end of line, first unrecognized character is `@'
keccak.s: keccak.s:13: Error: junk at end of line, first unrecognized character is `@'
keccak.s: keccak.s:14: Error: junk at end of line, first unrecognized character is `@'
keccak.s: keccak.s:16: Error: junk at end of line, first unrecognized character is `@'
keccak.s: keccak.s:18: Error: junk at end of line, first unrecognized character is `@'
keccak.s: keccak.s:21: Error: unknown pseudo-op: `.syntax'
keccak.s: keccak.s:22: Error: unknown pseudo-op: `.thumb'
keccak.s: keccak.s:25: Error: junk at end of line, first unrecognized character is `@'
keccak.s: keccak.s:78: Error: junk at end of line, first unrecognized character is `@'
keccak.s: keccak.s:127: Error: junk at end of line, first unrecognized character is `@'
keccak.s: keccak.s:179: Error: junk at end of line, first unrecognized character is `@'
keccak.s: keccak.s:471: Error: junk at end of line, first unrecognized character is `@'
keccak.s: keccak.s:472: Error: junk at end of line, first unrecognized character is `@'
keccak.s: ...

Number of similar (compiler,implementation) pairs: 4, namely:
CompilerImplementations
gcc -march=native -mtune=native -O2 -fomit-frame-pointer -fwrapv -fPIC -fPIE T:kcp/inplace1600ARMv7A
gcc -march=native -mtune=native -O3 -fomit-frame-pointer -fwrapv -fPIC -fPIE T:kcp/inplace1600ARMv7A
gcc -march=native -mtune=native -O -fomit-frame-pointer -fwrapv -fPIC -fPIE T:kcp/inplace1600ARMv7A
gcc -march=native -mtune=native -Os -fomit-frame-pointer -fwrapv -fPIC -fPIE T:kcp/inplace1600ARMv7A

Compiler output

Implementation: T:kcp/inplace1600ARMv7M
Security model: timingleaks
Compiler: gcc -march=native -mtune=native -O2 -fomit-frame-pointer -fwrapv -fPIC -fPIE
keccak.s: keccak.s: Assembler messages:
keccak.s: keccak.s:1: Error: junk at end of line, first unrecognized character is `@'
keccak.s: keccak.s:2: Error: junk at end of line, first unrecognized character is `@'
keccak.s: keccak.s:3: Error: junk at end of line, first unrecognized character is `@'
keccak.s: keccak.s:4: Error: junk at end of line, first unrecognized character is `@'
keccak.s: keccak.s:5: Error: junk at end of line, first unrecognized character is `@'
keccak.s: keccak.s:6: Error: junk at end of line, first unrecognized character is `@'
keccak.s: keccak.s:7: Error: junk at end of line, first unrecognized character is `@'
keccak.s: keccak.s:8: Error: junk at end of line, first unrecognized character is `@'
keccak.s: keccak.s:9: Error: junk at end of line, first unrecognized character is `@'
keccak.s: keccak.s:10: Error: junk at end of line, first unrecognized character is `@'
keccak.s: keccak.s:11: Error: junk at end of line, first unrecognized character is `@'
keccak.s: keccak.s:12: Error: junk at end of line, first unrecognized character is `@'
keccak.s: keccak.s:13: Error: junk at end of line, first unrecognized character is `@'
keccak.s: keccak.s:14: Error: junk at end of line, first unrecognized character is `@'
keccak.s: keccak.s:16: Error: junk at end of line, first unrecognized character is `@'
keccak.s: keccak.s:19: Error: unknown pseudo-op: `.thumb'
keccak.s: keccak.s:20: Error: unknown pseudo-op: `.syntax'
keccak.s: keccak.s:23: Error: junk at end of line, first unrecognized character is `@'
keccak.s: keccak.s:76: Error: junk at end of line, first unrecognized character is `@'
keccak.s: keccak.s:125: Error: junk at end of line, first unrecognized character is `@'
keccak.s: keccak.s:177: Error: junk at end of line, first unrecognized character is `@'
keccak.s: keccak.s:470: Error: junk at end of line, first unrecognized character is `@'
keccak.s: keccak.s:471: Error: junk at end of line, first unrecognized character is `@'
keccak.s: keccak.s:472: Error: junk at end of line, first unrecognized character is `@'
keccak.s: ...

Number of similar (compiler,implementation) pairs: 4, namely:
CompilerImplementations
gcc -march=native -mtune=native -O2 -fomit-frame-pointer -fwrapv -fPIC -fPIE T:kcp/inplace1600ARMv7M
gcc -march=native -mtune=native -O3 -fomit-frame-pointer -fwrapv -fPIC -fPIE T:kcp/inplace1600ARMv7M
gcc -march=native -mtune=native -O -fomit-frame-pointer -fwrapv -fPIC -fPIE T:kcp/inplace1600ARMv7M
gcc -march=native -mtune=native -Os -fomit-frame-pointer -fwrapv -fPIC -fPIE T:kcp/inplace1600ARMv7M

Compiler output

Implementation: T:kcp/optimized1600ARMv6Mu1
Security model: timingleaks
Compiler: gcc -march=native -mtune=native -O2 -fomit-frame-pointer -fwrapv -fPIC -fPIE
keccak.s: keccak.s: Assembler messages:
keccak.s: keccak.s:1: Error: junk at end of line, first unrecognized character is `@'
keccak.s: keccak.s:2: Error: junk at end of line, first unrecognized character is `@'
keccak.s: keccak.s:3: Error: junk at end of line, first unrecognized character is `@'
keccak.s: keccak.s:4: Error: junk at end of line, first unrecognized character is `@'
keccak.s: keccak.s:5: Error: junk at end of line, first unrecognized character is `@'
keccak.s: keccak.s:6: Error: junk at end of line, first unrecognized character is `@'
keccak.s: keccak.s:7: Error: junk at end of line, first unrecognized character is `@'
keccak.s: keccak.s:8: Error: junk at end of line, first unrecognized character is `@'
keccak.s: keccak.s:9: Error: junk at end of line, first unrecognized character is `@'
keccak.s: keccak.s:10: Error: junk at end of line, first unrecognized character is `@'
keccak.s: keccak.s:11: Error: junk at end of line, first unrecognized character is `@'
keccak.s: keccak.s:12: Error: junk at end of line, first unrecognized character is `@'
keccak.s: keccak.s:13: Error: junk at end of line, first unrecognized character is `@'
keccak.s: keccak.s:14: Error: junk at end of line, first unrecognized character is `@'
keccak.s: keccak.s:16: Error: junk at end of line, first unrecognized character is `@'
keccak.s: keccak.s:19: Error: unknown pseudo-op: `.thumb'
keccak.s: keccak.s:20: Error: unknown pseudo-op: `.syntax'
keccak.s: keccak.s:23: Error: junk at end of line, first unrecognized character is `@'
keccak.s: keccak.s:109: Error: junk at end of line, first unrecognized character is `@'
keccak.s: keccak.s:142: Error: junk at end of line, first unrecognized character is `@'
keccak.s: keccak.s:194: Error: junk at end of line, first unrecognized character is `@'
keccak.s: keccak.s:195: Error: junk at end of line, first unrecognized character is `@'
keccak.s: keccak.s:205: Error: junk at end of line, first unrecognized character is `@'
keccak.s: keccak.s:300: Error: junk at end of line, first unrecognized character is `@'
keccak.s: ...

Number of similar (compiler,implementation) pairs: 4, namely:
CompilerImplementations
gcc -march=native -mtune=native -O2 -fomit-frame-pointer -fwrapv -fPIC -fPIE T:kcp/optimized1600ARMv6Mu1
gcc -march=native -mtune=native -O3 -fomit-frame-pointer -fwrapv -fPIC -fPIE T:kcp/optimized1600ARMv6Mu1
gcc -march=native -mtune=native -O -fomit-frame-pointer -fwrapv -fPIC -fPIE T:kcp/optimized1600ARMv6Mu1
gcc -march=native -mtune=native -Os -fomit-frame-pointer -fwrapv -fPIC -fPIE T:kcp/optimized1600ARMv6Mu1

Compiler output

Implementation: T:kcp/optimized1600ARMv6Mu2
Security model: timingleaks
Compiler: gcc -march=native -mtune=native -O2 -fomit-frame-pointer -fwrapv -fPIC -fPIE
keccak.s: keccak.s: Assembler messages:
keccak.s: keccak.s:1: Error: junk at end of line, first unrecognized character is `@'
keccak.s: keccak.s:2: Error: junk at end of line, first unrecognized character is `@'
keccak.s: keccak.s:3: Error: junk at end of line, first unrecognized character is `@'
keccak.s: keccak.s:4: Error: junk at end of line, first unrecognized character is `@'
keccak.s: keccak.s:5: Error: junk at end of line, first unrecognized character is `@'
keccak.s: keccak.s:6: Error: junk at end of line, first unrecognized character is `@'
keccak.s: keccak.s:7: Error: junk at end of line, first unrecognized character is `@'
keccak.s: keccak.s:8: Error: junk at end of line, first unrecognized character is `@'
keccak.s: keccak.s:9: Error: junk at end of line, first unrecognized character is `@'
keccak.s: keccak.s:10: Error: junk at end of line, first unrecognized character is `@'
keccak.s: keccak.s:11: Error: junk at end of line, first unrecognized character is `@'
keccak.s: keccak.s:12: Error: junk at end of line, first unrecognized character is `@'
keccak.s: keccak.s:13: Error: junk at end of line, first unrecognized character is `@'
keccak.s: keccak.s:14: Error: junk at end of line, first unrecognized character is `@'
keccak.s: keccak.s:16: Error: junk at end of line, first unrecognized character is `@'
keccak.s: keccak.s:19: Error: unknown pseudo-op: `.thumb'
keccak.s: keccak.s:20: Error: unknown pseudo-op: `.syntax'
keccak.s: keccak.s:23: Error: junk at end of line, first unrecognized character is `@'
keccak.s: keccak.s:109: Error: junk at end of line, first unrecognized character is `@'
keccak.s: keccak.s:142: Error: junk at end of line, first unrecognized character is `@'
keccak.s: keccak.s:194: Error: junk at end of line, first unrecognized character is `@'
keccak.s: keccak.s:195: Error: junk at end of line, first unrecognized character is `@'
keccak.s: keccak.s:205: Error: junk at end of line, first unrecognized character is `@'
keccak.s: keccak.s:374: Error: junk at end of line, first unrecognized character is `@'
keccak.s: ...

Number of similar (compiler,implementation) pairs: 4, namely:
CompilerImplementations
gcc -march=native -mtune=native -O2 -fomit-frame-pointer -fwrapv -fPIC -fPIE T:kcp/optimized1600ARMv6Mu2
gcc -march=native -mtune=native -O3 -fomit-frame-pointer -fwrapv -fPIC -fPIE T:kcp/optimized1600ARMv6Mu2
gcc -march=native -mtune=native -O -fomit-frame-pointer -fwrapv -fPIC -fPIE T:kcp/optimized1600ARMv6Mu2
gcc -march=native -mtune=native -Os -fomit-frame-pointer -fwrapv -fPIC -fPIE T:kcp/optimized1600ARMv6Mu2

Compiler output

Implementation: T:kcp/optimized1600ARMv7A
Security model: timingleaks
Compiler: gcc -march=native -mtune=native -O2 -fomit-frame-pointer -fwrapv -fPIC -fPIE
keccak.s: keccak.s: Assembler messages:
keccak.s: keccak.s:1: Error: junk at end of line, first unrecognized character is `@'
keccak.s: keccak.s:2: Error: junk at end of line, first unrecognized character is `@'
keccak.s: keccak.s:3: Error: junk at end of line, first unrecognized character is `@'
keccak.s: keccak.s:4: Error: junk at end of line, first unrecognized character is `@'
keccak.s: keccak.s:5: Error: junk at end of line, first unrecognized character is `@'
keccak.s: keccak.s:6: Error: junk at end of line, first unrecognized character is `@'
keccak.s: keccak.s:7: Error: junk at end of line, first unrecognized character is `@'
keccak.s: keccak.s:8: Error: junk at end of line, first unrecognized character is `@'
keccak.s: keccak.s:9: Error: junk at end of line, first unrecognized character is `@'
keccak.s: keccak.s:10: Error: junk at end of line, first unrecognized character is `@'
keccak.s: keccak.s:11: Error: junk at end of line, first unrecognized character is `@'
keccak.s: keccak.s:12: Error: junk at end of line, first unrecognized character is `@'
keccak.s: keccak.s:13: Error: junk at end of line, first unrecognized character is `@'
keccak.s: keccak.s:14: Error: junk at end of line, first unrecognized character is `@'
keccak.s: keccak.s:16: Error: junk at end of line, first unrecognized character is `@'
keccak.s: keccak.s:17: Error: junk at end of line, first unrecognized character is `@'
keccak.s: keccak.s:18: Error: junk at end of line, first unrecognized character is `@'
keccak.s: keccak.s:21: Error: unknown pseudo-op: `.syntax'
keccak.s: keccak.s:22: Error: unknown pseudo-op: `.fpu'
keccak.s: keccak.s:23: Error: unknown pseudo-op: `.arm'
keccak.s: keccak.s:26: Error: junk at end of line, first unrecognized character is `@'
keccak.s: keccak.s:27: Error: junk at end of line, first unrecognized character is `@'
keccak.s: keccak.s:29: Error: junk at end of line, first unrecognized character is `@'
keccak.s: keccak.s:56: Error: junk at end of line, first unrecognized character is `@'
keccak.s: ...

Number of similar (compiler,implementation) pairs: 4, namely:
CompilerImplementations
gcc -march=native -mtune=native -O2 -fomit-frame-pointer -fwrapv -fPIC -fPIE T:kcp/optimized1600ARMv7A
gcc -march=native -mtune=native -O3 -fomit-frame-pointer -fwrapv -fPIC -fPIE T:kcp/optimized1600ARMv7A
gcc -march=native -mtune=native -O -fomit-frame-pointer -fwrapv -fPIC -fPIE T:kcp/optimized1600ARMv7A
gcc -march=native -mtune=native -Os -fomit-frame-pointer -fwrapv -fPIC -fPIE T:kcp/optimized1600ARMv7A

Compiler output

Implementation: T:kcp/optimized1600ARMv8A
Security model: timingleaks
Compiler: clang -march=native -O2 -fomit-frame-pointer -fwrapv -Qunused-arguments -fPIC -fPIE
keccak.s: keccak.s:258:20: error: unknown token in expression
keccak.s: movi v0.2d, #0
keccak.s: ^
keccak.s: keccak.s:259:20: error: unknown token in expression
keccak.s: movi v1.2d, #0
keccak.s: ^
keccak.s: keccak.s:260:20: error: unknown token in expression
keccak.s: movi v2.2d, #0
keccak.s: ^
keccak.s: keccak.s:261:20: error: unknown token in expression
keccak.s: movi v3.2d, #0
keccak.s: ^
keccak.s: keccak.s:262:15: error: unknown token in expression
keccak.s: st4 { v0.2d, v1.2d, v2.2d, v3.2d }, [x0], #64 // Clear 8lanes=64 bytes at a time
keccak.s: ^
keccak.s: keccak.s:263:15: error: unknown token in expression
keccak.s: st4 { v0.2d, v1.2d, v2.2d, v3.2d }, [x0], #64
keccak.s: ^
keccak.s: keccak.s:264:15: error: unknown token in expression
keccak.s: st4 { v0.2d, v1.2d, v2.2d, v3.2d }, [x0], #64
keccak.s: ^
keccak.s: keccak.s:265:15: error: unknown token in expression
keccak.s: st1 { v0.d }[0], [x0], #8
keccak.s: ^
keccak.s: keccak.s:276:20: error: expected ']' in brackets expression
keccak.s: ...

Number of similar (compiler,implementation) pairs: 5, namely:
CompilerImplementations
clang -march=native -O2 -fomit-frame-pointer -fwrapv -Qunused-arguments -fPIC -fPIE T:kcp/optimized1600ARMv8A
clang -march=native -O3 -fomit-frame-pointer -fwrapv -Qunused-arguments -fPIC -fPIE T:kcp/optimized1600ARMv8A
clang -march=native -O -fomit-frame-pointer -fwrapv -Qunused-arguments -fPIC -fPIE T:kcp/optimized1600ARMv8A
clang -march=native -Os -fomit-frame-pointer -fwrapv -Qunused-arguments -fPIC -fPIE T:kcp/optimized1600ARMv8A
clang -mcpu=native -O3 -fomit-frame-pointer -fwrapv -Qunused-arguments -fPIC -fPIE T:kcp/optimized1600ARMv8A

Compiler output

Implementation: T:kcp/optimized1600ARMv8A
Security model: timingleaks
Compiler: gcc -march=native -mtune=native -O2 -fomit-frame-pointer -fwrapv -fPIC -fPIE
keccak.s: keccak.s: Assembler messages:
keccak.s: keccak.s:258: Error: no such instruction: `movi v0.2d,'
keccak.s: keccak.s:259: Error: no such instruction: `movi v1.2d,'
keccak.s: keccak.s:260: Error: no such instruction: `movi v2.2d,'
keccak.s: keccak.s:261: Error: no such instruction: `movi v3.2d,'
keccak.s: keccak.s:262: Error: no such instruction: `st4 { v0.2d,v1.2d,v2.2d,v3.2d },[x0],'
keccak.s: keccak.s:263: Error: no such instruction: `st4 { v0.2d,v1.2d,v2.2d,v3.2d },[x0],'
keccak.s: keccak.s:264: Error: no such instruction: `st4 { v0.2d,v1.2d,v2.2d,v3.2d },[x0],'
keccak.s: keccak.s:265: Error: no such instruction: `st1 { v0.d }[0],[x0],'
keccak.s: keccak.s:276: Error: no such instruction: `ldrb w3,[x0,x2]'
keccak.s: keccak.s:277: Error: no such instruction: `eor w3,w3,w1'
keccak.s: keccak.s:278: Error: too many memory references for `str'
keccak.s: keccak.s:289: Error: too many memory references for `add'
keccak.s: keccak.s:290: Error: too many memory references for `sub'
keccak.s: keccak.s:291: Error: no such instruction: `b.cc KeccakP1600_AddBytes_Exit//length 0,move along'
keccak.s: keccak.s:293: Error: too many memory references for `sub'
keccak.s: keccak.s:294: Error: no such instruction: `b.cc KeccakP1600_AddBytes_Lanes//Jump if length is negative'
keccak.s: keccak.s:295: Error: no such instruction: `ld4 { v0.2d,v1.2d,v2.2d,v3.2d },[x0]'
keccak.s: keccak.s:296: Error: no such instruction: `ld4 { v4.2d,v5.2d,v6.2d,v7.2d },[x1],'
keccak.s: keccak.s:297: Error: no such instruction: `eor v0.16b,v0.16b,v4.16b'
keccak.s: keccak.s:298: Error: no such instruction: `eor v1.16b,v1.16b,v5.16b'
keccak.s: keccak.s:299: Error: no such instruction: `eor v2.16b,v2.16b,v6.16b'
keccak.s: keccak.s:300: Error: no such instruction: `eor v3.16b,v3.16b,v7.16b'
keccak.s: keccak.s:301: Error: no such instruction: `st4 { v0.2d,v1.2d,v2.2d,v3.2d },[x0],'
keccak.s: keccak.s:302: Error: no such instruction: `b KeccakP1600_AddBytes_8LanesLoop'
keccak.s: ...

Number of similar (compiler,implementation) pairs: 4, namely:
CompilerImplementations
gcc -march=native -mtune=native -O2 -fomit-frame-pointer -fwrapv -fPIC -fPIE T:kcp/optimized1600ARMv8A
gcc -march=native -mtune=native -O3 -fomit-frame-pointer -fwrapv -fPIC -fPIE T:kcp/optimized1600ARMv8A
gcc -march=native -mtune=native -O -fomit-frame-pointer -fwrapv -fPIC -fPIE T:kcp/optimized1600ARMv8A
gcc -march=native -mtune=native -Os -fomit-frame-pointer -fwrapv -fPIC -fPIE T:kcp/optimized1600ARMv8A

Compiler output

Implementation: T:kcp/optimized1600AVX2
Security model: timingleaks
Compiler: clang++ -march=native -O2 -fomit-frame-pointer -fwrapv -Qunused-arguments -fPIC -fPIE
K12.c: clang: warning: treating 'c' input as 'c++' when in C++ mode, this behavior is deprecated [-Wdeprecated]
KangarooTwelve.c: clang: warning: treating 'c' input as 'c++' when in C++ mode, this behavior is deprecated [-Wdeprecated]
KeccakSpongeWidth1600.c: clang: warning: treating 'c' input as 'c++' when in C++ mode, this behavior is deprecated [-Wdeprecated]
KeccakP-1600-AVX2.cpp: KeccakP-1600-AVX2.cpp:641:5: error: always_inline function '_mm256_xor_si256' requires target feature 'avx2', but would be inlined into function 'KeccakP1600_Permute_Nrounds' that is compiled without support for 'avx2'
KeccakP-1600-AVX2.cpp: KECCAK_PERMUTE_LOOP(, nrounds)
KeccakP-1600-AVX2.cpp: ^
KeccakP-1600-AVX2.cpp: KeccakP-1600-AVX2.cpp:162:14: note: expanded from macro 'KECCAK_PERMUTE_LOOP'
KeccakP-1600-AVX2.cpp: r0 = XOR(a0, a1); \
KeccakP-1600-AVX2.cpp: ^
KeccakP-1600-AVX2.cpp: KeccakP-1600-AVX2.cpp:52:41: note: expanded from macro 'XOR'
KeccakP-1600-AVX2.cpp: #define XOR(a, b) _mm256_xor_si256(a, b)
KeccakP-1600-AVX2.cpp: ^
KeccakP-1600-AVX2.cpp: KeccakP-1600-AVX2.cpp:641:5: error: always_inline function '_mm256_xor_si256' requires target feature 'avx2', but would be inlined into function 'KeccakP1600_Permute_Nrounds' that is compiled without support for 'avx2'
KeccakP-1600-AVX2.cpp: KeccakP-1600-AVX2.cpp:163:14: note: expanded from macro 'KECCAK_PERMUTE_LOOP'
KeccakP-1600-AVX2.cpp: r0 = XOR(r0, a2); \
KeccakP-1600-AVX2.cpp: ^
KeccakP-1600-AVX2.cpp: KeccakP-1600-AVX2.cpp:52:41: note: expanded from macro 'XOR'
KeccakP-1600-AVX2.cpp: #define XOR(a, b) _mm256_xor_si256(a, b)
KeccakP-1600-AVX2.cpp: ^
KeccakP-1600-AVX2.cpp: KeccakP-1600-AVX2.cpp:641:5: error: always_inline function '_mm256_xor_si256' requires target feature 'avx2', but would be inlined into function 'KeccakP1600_Permute_Nrounds' that is compiled without support for 'avx2'
KeccakP-1600-AVX2.cpp: KeccakP-1600-AVX2.cpp:164:14: note: expanded from macro 'KECCAK_PERMUTE_LOOP'
KeccakP-1600-AVX2.cpp: r0 = XOR(r0, a3); \
KeccakP-1600-AVX2.cpp: ^
KeccakP-1600-AVX2.cpp: KeccakP-1600-AVX2.cpp:52:41: note: expanded from macro 'XOR'
KeccakP-1600-AVX2.cpp: #define XOR(a, b) _mm256_xor_si256(a, b)
KeccakP-1600-AVX2.cpp: ^
KeccakP-1600-AVX2.cpp: KeccakP-1600-AVX2.cpp:641:5: error: always_inline function '_mm256_xor_si256' requires target feature 'avx2', but would be inlined into function 'KeccakP1600_Permute_Nrounds' that is compiled without support for 'avx2'
KeccakP-1600-AVX2.cpp: KeccakP-1600-AVX2.cpp:165:14: note: expanded from macro 'KECCAK_PERMUTE_LOOP'
KeccakP-1600-AVX2.cpp: ...

Number of similar (compiler,implementation) pairs: 4, namely:
CompilerImplementations
clang++ -march=native -O2 -fomit-frame-pointer -fwrapv -Qunused-arguments -fPIC -fPIE T:kcp/optimized1600AVX2
clang++ -march=native -O3 -fomit-frame-pointer -fwrapv -Qunused-arguments -fPIC -fPIE T:kcp/optimized1600AVX2
clang++ -march=native -O -fomit-frame-pointer -fwrapv -Qunused-arguments -fPIC -fPIE T:kcp/optimized1600AVX2
clang++ -march=native -Os -fomit-frame-pointer -fwrapv -Qunused-arguments -fPIC -fPIE T:kcp/optimized1600AVX2

Compiler output

Implementation: T:kcp/optimized1600AVX2
Security model: timingleaks
Compiler: g++ -march=native -mtune=native -O2 -fomit-frame-pointer -fwrapv -fPIC -fPIE
KeccakP-1600-AVX2.cpp: In file included from /usr/lib/gcc/x86_64-linux-gnu/11/include/immintrin.h:47,
KeccakP-1600-AVX2.cpp: from /usr/lib/gcc/x86_64-linux-gnu/11/include/x86intrin.h:32,
KeccakP-1600-AVX2.cpp: from KeccakP-1600-AVX2.cpp:18:
KeccakP-1600-AVX2.cpp: /usr/lib/gcc/x86_64-linux-gnu/11/include/avx2intrin.h: In function 'void KeccakP1600_Permute_Nrounds(void*, unsigned int)':
KeccakP-1600-AVX2.cpp: /usr/lib/gcc/x86_64-linux-gnu/11/include/avx2intrin.h:1084:1: error: inlining failed in call to 'always_inline' '__m256i _mm256_permute2x128_si256(__m256i, __m256i, int)': target specific option mismatch
KeccakP-1600-AVX2.cpp: 1084 | _mm256_permute2x128_si256 (__m256i __X, __m256i __Y, const int __M)
KeccakP-1600-AVX2.cpp: | ^~~~~~~~~~~~~~~~~~~~~~~~~
KeccakP-1600-AVX2.cpp: KeccakP-1600-AVX2.cpp:269:39: note: called from here
KeccakP-1600-AVX2.cpp: 269 | a4 = _mm256_permute2x128_si256(r0, r1, 0x20); \
KeccakP-1600-AVX2.cpp: | ~~~~~~~~~~~~~~~~~~~~~~~~~^~~~~~~~~~~~~~
KeccakP-1600-AVX2.cpp: KeccakP-1600-AVX2.cpp:641:5: note: in expansion of macro 'KECCAK_PERMUTE_LOOP'
KeccakP-1600-AVX2.cpp: 641 | KECCAK_PERMUTE_LOOP(, nrounds)
KeccakP-1600-AVX2.cpp: | ^~~~~~~~~~~~~~~~~~~
KeccakP-1600-AVX2.cpp: In file included from /usr/lib/gcc/x86_64-linux-gnu/11/include/immintrin.h:47,
KeccakP-1600-AVX2.cpp: from /usr/lib/gcc/x86_64-linux-gnu/11/include/x86intrin.h:32,
KeccakP-1600-AVX2.cpp: from KeccakP-1600-AVX2.cpp:18:
KeccakP-1600-AVX2.cpp: /usr/lib/gcc/x86_64-linux-gnu/11/include/avx2intrin.h:906:1: error: inlining failed in call to 'always_inline' '__m256i _mm256_unpacklo_epi64(__m256i, __m256i)': target specific option mismatch
KeccakP-1600-AVX2.cpp: 906 | _mm256_unpacklo_epi64 (__m256i __A, __m256i __B)
KeccakP-1600-AVX2.cpp: | ^~~~~~~~~~~~~~~~~~~~~
KeccakP-1600-AVX2.cpp: KeccakP-1600-AVX2.cpp:268:35: note: called from here
KeccakP-1600-AVX2.cpp: 268 | r1 = _mm256_unpacklo_epi64(a24, a34); \
KeccakP-1600-AVX2.cpp: | ~~~~~~~~~~~~~~~~~~~~~^~~~~~~~~~
KeccakP-1600-AVX2.cpp: KeccakP-1600-AVX2.cpp:641:5: note: in expansion of macro 'KECCAK_PERMUTE_LOOP'
KeccakP-1600-AVX2.cpp: 641 | KECCAK_PERMUTE_LOOP(, nrounds)
KeccakP-1600-AVX2.cpp: | ^~~~~~~~~~~~~~~~~~~
KeccakP-1600-AVX2.cpp: ...

Number of similar (compiler,implementation) pairs: 4, namely:
CompilerImplementations
g++ -march=native -mtune=native -O2 -fomit-frame-pointer -fwrapv -fPIC -fPIE T:kcp/optimized1600AVX2
g++ -march=native -mtune=native -O3 -fomit-frame-pointer -fwrapv -fPIC -fPIE T:kcp/optimized1600AVX2
g++ -march=native -mtune=native -O -fomit-frame-pointer -fwrapv -fPIC -fPIE T:kcp/optimized1600AVX2
g++ -march=native -mtune=native -Os -fomit-frame-pointer -fwrapv -fPIC -fPIE T:kcp/optimized1600AVX2

Compiler output

Implementation: T:kcp/optimized1600AVX512
Security model: timingleaks
Compiler: clang -march=native -O2 -fomit-frame-pointer -fwrapv -Qunused-arguments -fPIC -fPIE
KeccakP-1600-AVX512.c: KeccakP-1600-AVX512.c:238:41: error: always_inline function '_mm512_maskz_loadu_epi64' requires target feature 'avx512f', but would be inlined into function 'KeccakP1600_AddBytes' that is compiled without support for 'avx512f'
KeccakP-1600-AVX512.c: STORE_8Lanes( stateAsLanes, XOR(LOAD_8Lanes(stateAsLanes), LOAD_8Lanes((const UINT64*)data)));
KeccakP-1600-AVX512.c: ^
KeccakP-1600-AVX512.c: KeccakP-1600-AVX512.c:215:37: note: expanded from macro 'LOAD_8Lanes'
KeccakP-1600-AVX512.c: #define LOAD_8Lanes(a) LOAD_Lanes(0xFF,a)
KeccakP-1600-AVX512.c: ^
KeccakP-1600-AVX512.c: KeccakP-1600-AVX512.c:212:37: note: expanded from macro 'LOAD_Lanes'
KeccakP-1600-AVX512.c: #define LOAD_Lanes(m,a) _mm512_maskz_loadu_epi64(m,a)
KeccakP-1600-AVX512.c: ^
KeccakP-1600-AVX512.c: KeccakP-1600-AVX512.c:238:41: error: AVX vector return of type '__m512i' (vector of 8 'long long' values) without 'avx512f' enabled changes the ABI
KeccakP-1600-AVX512.c: KeccakP-1600-AVX512.c:215:37: note: expanded from macro 'LOAD_8Lanes'
KeccakP-1600-AVX512.c: #define LOAD_8Lanes(a) LOAD_Lanes(0xFF,a)
KeccakP-1600-AVX512.c: ^
KeccakP-1600-AVX512.c: KeccakP-1600-AVX512.c:212:37: note: expanded from macro 'LOAD_Lanes'
KeccakP-1600-AVX512.c: #define LOAD_Lanes(m,a) _mm512_maskz_loadu_epi64(m,a)
KeccakP-1600-AVX512.c: ^
KeccakP-1600-AVX512.c: KeccakP-1600-AVX512.c:238:68: error: always_inline function '_mm512_maskz_loadu_epi64' requires target feature 'avx512f', but would be inlined into function 'KeccakP1600_AddBytes' that is compiled without support for 'avx512f'
KeccakP-1600-AVX512.c: STORE_8Lanes( stateAsLanes, XOR(LOAD_8Lanes(stateAsLanes), LOAD_8Lanes((const UINT64*)data)));
KeccakP-1600-AVX512.c: ^
KeccakP-1600-AVX512.c: KeccakP-1600-AVX512.c:215:37: note: expanded from macro 'LOAD_8Lanes'
KeccakP-1600-AVX512.c: #define LOAD_8Lanes(a) LOAD_Lanes(0xFF,a)
KeccakP-1600-AVX512.c: ^
KeccakP-1600-AVX512.c: KeccakP-1600-AVX512.c:212:37: note: expanded from macro 'LOAD_Lanes'
KeccakP-1600-AVX512.c: #define LOAD_Lanes(m,a) _mm512_maskz_loadu_epi64(m,a)
KeccakP-1600-AVX512.c: ^
KeccakP-1600-AVX512.c: ...

Number of similar (compiler,implementation) pairs: 5, namely:
CompilerImplementations
clang -march=native -O2 -fomit-frame-pointer -fwrapv -Qunused-arguments -fPIC -fPIE T:kcp/optimized1600AVX512
clang -march=native -O3 -fomit-frame-pointer -fwrapv -Qunused-arguments -fPIC -fPIE T:kcp/optimized1600AVX512
clang -march=native -O -fomit-frame-pointer -fwrapv -Qunused-arguments -fPIC -fPIE T:kcp/optimized1600AVX512
clang -march=native -Os -fomit-frame-pointer -fwrapv -Qunused-arguments -fPIC -fPIE T:kcp/optimized1600AVX512
clang -mcpu=native -O3 -fomit-frame-pointer -fwrapv -Qunused-arguments -fPIC -fPIE T:kcp/optimized1600AVX512

Compiler output

Implementation: T:kcp/optimized1600AVX512
Security model: timingleaks
Compiler: gcc -march=native -mtune=native -O2 -fomit-frame-pointer -fwrapv -fPIC -fPIE
KeccakP-1600-AVX512.c: KeccakP-1600-AVX512.c: In function 'KeccakP1600_AddBytes':
KeccakP-1600-AVX512.c: KeccakP-1600-AVX512.c:216:37: warning: AVX512F vector return without AVX512F enabled changes the ABI [-Wpsabi]
KeccakP-1600-AVX512.c: 216 | #define STORE_Lanes(a,m,v) _mm512_mask_storeu_epi64(a,m,v)
KeccakP-1600-AVX512.c: | ^~~~~~~~~~~~~~~~~~~~~~~~~~~~~~~
KeccakP-1600-AVX512.c: KeccakP-1600-AVX512.c:219:37: note: in expansion of macro 'STORE_Lanes'
KeccakP-1600-AVX512.c: 219 | #define STORE_8Lanes(a,v) STORE_Lanes(a,0xFF,v)
KeccakP-1600-AVX512.c: | ^~~~~~~~~~~
KeccakP-1600-AVX512.c: KeccakP-1600-AVX512.c:238:9: note: in expansion of macro 'STORE_8Lanes'
KeccakP-1600-AVX512.c: 238 | STORE_8Lanes( stateAsLanes, XOR(LOAD_8Lanes(stateAsLanes), LOAD_8Lanes((const UINT64*)data)));
KeccakP-1600-AVX512.c: | ^~~~~~~~~~~~
KeccakP-1600-AVX512.c: In file included from /usr/lib/gcc/x86_64-linux-gnu/11/include/immintrin.h:49,
KeccakP-1600-AVX512.c: from KeccakP-1600-AVX512.c:26:
KeccakP-1600-AVX512.c: /usr/lib/gcc/x86_64-linux-gnu/11/include/avx512fintrin.h:6440:1: error: inlining failed in call to 'always_inline' '_mm512_mask_storeu_epi64': target specific option mismatch
KeccakP-1600-AVX512.c: 6440 | _mm512_mask_storeu_epi64 (void *__P, __mmask8 __U, __m512i __A)
KeccakP-1600-AVX512.c: | ^~~~~~~~~~~~~~~~~~~~~~~~
KeccakP-1600-AVX512.c: KeccakP-1600-AVX512.c:216:37: note: called from here
KeccakP-1600-AVX512.c: 216 | #define STORE_Lanes(a,m,v) _mm512_mask_storeu_epi64(a,m,v)
KeccakP-1600-AVX512.c: | ^~~~~~~~~~~~~~~~~~~~~~~~~~~~~~~
KeccakP-1600-AVX512.c: KeccakP-1600-AVX512.c:219:37: note: in expansion of macro 'STORE_Lanes'
KeccakP-1600-AVX512.c: 219 | #define STORE_8Lanes(a,v) STORE_Lanes(a,0xFF,v)
KeccakP-1600-AVX512.c: | ^~~~~~~~~~~
KeccakP-1600-AVX512.c: KeccakP-1600-AVX512.c:238:9: note: in expansion of macro 'STORE_8Lanes'
KeccakP-1600-AVX512.c: 238 | STORE_8Lanes( stateAsLanes, XOR(LOAD_8Lanes(stateAsLanes), LOAD_8Lanes((const UINT64*)data)));
KeccakP-1600-AVX512.c: | ^~~~~~~~~~~~
KeccakP-1600-AVX512.c: In file included from /usr/lib/gcc/x86_64-linux-gnu/11/include/immintrin.h:49,
KeccakP-1600-AVX512.c: ...

Number of similar (compiler,implementation) pairs: 4, namely:
CompilerImplementations
gcc -march=native -mtune=native -O2 -fomit-frame-pointer -fwrapv -fPIC -fPIE T:kcp/optimized1600AVX512
gcc -march=native -mtune=native -O3 -fomit-frame-pointer -fwrapv -fPIC -fPIE T:kcp/optimized1600AVX512
gcc -march=native -mtune=native -O -fomit-frame-pointer -fwrapv -fPIC -fPIE T:kcp/optimized1600AVX512
gcc -march=native -mtune=native -Os -fomit-frame-pointer -fwrapv -fPIC -fPIE T:kcp/optimized1600AVX512

Compiler output

Implementation: T:kcp/optimized1600AsmX86-64
Security model: timingleaks
Compiler: clang -march=native -O2 -fomit-frame-pointer -fwrapv -Qunused-arguments -fPIC -fPIE
try.c: /usr/bin/ld: libcrypto_hash_k12.a(keccak.o): relocation R_X86_64_32S against `.text' can not be used when making a PIE object; recompile with -fPIE
try.c: /usr/bin/ld: failed to set dynamic section sizes: bad value
try.c: clang: error: linker command failed with exit code 1 (use -v to see invocation)

Number of similar (compiler,implementation) pairs: 10, namely:
CompilerImplementations
clang -march=native -O2 -fomit-frame-pointer -fwrapv -Qunused-arguments -fPIC -fPIE T:kcp/optimized1600AsmX86-64
clang -march=native -O3 -fomit-frame-pointer -fwrapv -Qunused-arguments -fPIC -fPIE T:kcp/optimized1600AsmX86-64
clang -march=native -O -fomit-frame-pointer -fwrapv -Qunused-arguments -fPIC -fPIE T:kcp/optimized1600AsmX86-64
clang -march=native -Os -fomit-frame-pointer -fwrapv -Qunused-arguments -fPIC -fPIE T:kcp/optimized1600AsmX86-64
clang -mcpu=native -O3 -fomit-frame-pointer -fwrapv -Qunused-arguments -fPIC -fPIE T:kcp/optimized1600AsmX86-64
clang -march=native -O2 -fomit-frame-pointer -fwrapv -Qunused-arguments -fPIC -fPIE T:kcp/optimized1600AsmX86-64shld
clang -march=native -O3 -fomit-frame-pointer -fwrapv -Qunused-arguments -fPIC -fPIE T:kcp/optimized1600AsmX86-64shld
clang -march=native -O -fomit-frame-pointer -fwrapv -Qunused-arguments -fPIC -fPIE T:kcp/optimized1600AsmX86-64shld
clang -march=native -Os -fomit-frame-pointer -fwrapv -Qunused-arguments -fPIC -fPIE T:kcp/optimized1600AsmX86-64shld
clang -mcpu=native -O3 -fomit-frame-pointer -fwrapv -Qunused-arguments -fPIC -fPIE T:kcp/optimized1600AsmX86-64shld

Compiler output

Implementation: T:kcp/optimized1600AsmX86-64
Security model: timingleaks
Compiler: gcc -march=native -mtune=native -O2 -fomit-frame-pointer -fwrapv -fPIC -fPIE
try.c: /usr/bin/ld: libcrypto_hash_k12.a(keccak.o): relocation R_X86_64_32S against `.text' can not be used when making a PIE object; recompile with -fPIE
try.c: /usr/bin/ld: failed to set dynamic section sizes: bad value
try.c: collect2: error: ld returned 1 exit status

Number of similar (compiler,implementation) pairs: 8, namely:
CompilerImplementations
gcc -march=native -mtune=native -O2 -fomit-frame-pointer -fwrapv -fPIC -fPIE T:kcp/optimized1600AsmX86-64
gcc -march=native -mtune=native -O3 -fomit-frame-pointer -fwrapv -fPIC -fPIE T:kcp/optimized1600AsmX86-64
gcc -march=native -mtune=native -O -fomit-frame-pointer -fwrapv -fPIC -fPIE T:kcp/optimized1600AsmX86-64
gcc -march=native -mtune=native -Os -fomit-frame-pointer -fwrapv -fPIC -fPIE T:kcp/optimized1600AsmX86-64
gcc -march=native -mtune=native -O2 -fomit-frame-pointer -fwrapv -fPIC -fPIE T:kcp/optimized1600AsmX86-64shld
gcc -march=native -mtune=native -O3 -fomit-frame-pointer -fwrapv -fPIC -fPIE T:kcp/optimized1600AsmX86-64shld
gcc -march=native -mtune=native -O -fomit-frame-pointer -fwrapv -fPIC -fPIE T:kcp/optimized1600AsmX86-64shld
gcc -march=native -mtune=native -Os -fomit-frame-pointer -fwrapv -fPIC -fPIE T:kcp/optimized1600AsmX86-64shld

Compiler output

Implementation: T:kcp/optimized1600AsmX86-64Apple
Security model: timingleaks
Compiler: clang -march=native -O2 -fomit-frame-pointer -fwrapv -Qunused-arguments -fPIC -fPIE
keccak.s: keccak.s:555:24: error: expected register here
keccak.s: movq %rax, _ba(arg1)
keccak.s: ^
keccak.s: keccak.s:556:24: error: expected register here
keccak.s: movq %rcx, _be(arg1)
keccak.s: ^
keccak.s: keccak.s:557:24: error: expected register here
keccak.s: movq %rcx, _bi(arg1)
keccak.s: ^
keccak.s: keccak.s:558:24: error: expected register here
keccak.s: movq %rax, _bo(arg1)
keccak.s: ^
keccak.s: keccak.s:559:24: error: expected register here
keccak.s: movdqu %xmm0, _bu(arg1)
keccak.s: ^
keccak.s: keccak.s:560:24: error: expected register here
keccak.s: movdqu %xmm0, _ge(arg1)
keccak.s: ^
keccak.s: keccak.s:561:24: error: expected register here
keccak.s: movq %rcx, _go(arg1)
keccak.s: ^
keccak.s: keccak.s:562:24: error: expected register here
keccak.s: movq %rax, _gu(arg1)
keccak.s: ^
keccak.s: keccak.s:563:24: error: expected register here
keccak.s: ...

Number of similar (compiler,implementation) pairs: 5, namely:
CompilerImplementations
clang -march=native -O2 -fomit-frame-pointer -fwrapv -Qunused-arguments -fPIC -fPIE T:kcp/optimized1600AsmX86-64Apple
clang -march=native -O3 -fomit-frame-pointer -fwrapv -Qunused-arguments -fPIC -fPIE T:kcp/optimized1600AsmX86-64Apple
clang -march=native -O -fomit-frame-pointer -fwrapv -Qunused-arguments -fPIC -fPIE T:kcp/optimized1600AsmX86-64Apple
clang -march=native -Os -fomit-frame-pointer -fwrapv -Qunused-arguments -fPIC -fPIE T:kcp/optimized1600AsmX86-64Apple
clang -mcpu=native -O3 -fomit-frame-pointer -fwrapv -Qunused-arguments -fPIC -fPIE T:kcp/optimized1600AsmX86-64Apple

Compiler output

Implementation: T:kcp/optimized1600AsmX86-64Apple
Security model: timingleaks
Compiler: gcc -march=native -mtune=native -O2 -fomit-frame-pointer -fwrapv -fPIC -fPIE
keccak.s: keccak.s: Assembler messages:
keccak.s: keccak.s:555: Error: junk `(arg1)' after expression
keccak.s: keccak.s:556: Error: junk `(arg1)' after expression
keccak.s: keccak.s:557: Error: junk `(arg1)' after expression
keccak.s: keccak.s:558: Error: junk `(arg1)' after expression
keccak.s: keccak.s:559: Error: junk `(arg1)' after expression
keccak.s: keccak.s:560: Error: junk `(arg1)' after expression
keccak.s: keccak.s:561: Error: junk `(arg1)' after expression
keccak.s: keccak.s:562: Error: junk `(arg1)' after expression
keccak.s: keccak.s:563: Error: junk `(arg1)' after expression
keccak.s: keccak.s:564: Error: junk `(arg1)' after expression
keccak.s: keccak.s:565: Error: junk `(arg1)' after expression
keccak.s: keccak.s:566: Error: junk `(arg1)' after expression
keccak.s: keccak.s:567: Error: junk `(arg1)' after expression
keccak.s: keccak.s:568: Error: junk `(arg1)' after expression
keccak.s: keccak.s:569: Error: junk `(arg1)' after expression
keccak.s: keccak.s:570: Error: junk `(arg1)' after expression
keccak.s: keccak.s:571: Error: junk `(arg1)' after expression
keccak.s: keccak.s:572: Error: junk `(arg1)' after expression
keccak.s: keccak.s:573: Error: junk `(arg1)' after expression
keccak.s: keccak.s:583: Error: too many memory references for `add'
keccak.s: keccak.s:598: Error: too many memory references for `add'
keccak.s: keccak.s:601: Error: too many memory references for `movq'
keccak.s: keccak.s:605: Error: junk `(arg2)' after expression
keccak.s: keccak.s:605: Error: junk `(arg1)' after expression
keccak.s: ...

Number of similar (compiler,implementation) pairs: 4, namely:
CompilerImplementations
gcc -march=native -mtune=native -O2 -fomit-frame-pointer -fwrapv -fPIC -fPIE T:kcp/optimized1600AsmX86-64Apple
gcc -march=native -mtune=native -O3 -fomit-frame-pointer -fwrapv -fPIC -fPIE T:kcp/optimized1600AsmX86-64Apple
gcc -march=native -mtune=native -O -fomit-frame-pointer -fwrapv -fPIC -fPIE T:kcp/optimized1600AsmX86-64Apple
gcc -march=native -mtune=native -Os -fomit-frame-pointer -fwrapv -fPIC -fPIE T:kcp/optimized1600AsmX86-64Apple

Compiler output

Implementation: T:kcp/optimized1600XOPu6
Security model: timingleaks
Compiler: clang -march=native -O2 -fomit-frame-pointer -fwrapv -Qunused-arguments -fPIC -fPIE
KeccakP-1600-XOP.c: KeccakP-1600-XOP.c:400:5: error: '__builtin_ia32_vprotqi' needs target feature xop
KeccakP-1600-XOP.c: roundsN(nr)
KeccakP-1600-XOP.c: ^
KeccakP-1600-XOP.c: ./KeccakP-1600-unrolling.macros:297:9: note: expanded from macro 'roundsN'
KeccakP-1600-XOP.c: thetaRhoPiChiIotaPrepareTheta(i, A, E) \
KeccakP-1600-XOP.c: ^
KeccakP-1600-XOP.c: KeccakP-1600-XOP.c:200:5: note: expanded from macro 'thetaRhoPiChiIotaPrepareTheta'
KeccakP-1600-XOP.c: computeD \
KeccakP-1600-XOP.c: ^
KeccakP-1600-XOP.c: KeccakP-1600-XOP.c:187:23: note: expanded from macro 'computeD'
KeccakP-1600-XOP.c: Dei = XOR128(Cae, ROL6464same(Cio, 1)); \
KeccakP-1600-XOP.c: ^
KeccakP-1600-XOP.c: KeccakP-1600-XOP.c:60:29: note: expanded from macro 'ROL6464same'
KeccakP-1600-XOP.c: #define ROL6464same(a, o) _mm_roti_epi64(a, o)
KeccakP-1600-XOP.c: ^
KeccakP-1600-XOP.c: /usr/lib/llvm-14/lib/clang/14.0.0/include/xopintrin.h:237:13: note: expanded from macro '_mm_roti_epi64'
KeccakP-1600-XOP.c: ((__m128i)__builtin_ia32_vprotqi((__v2di)(__m128i)(A), (N)))
KeccakP-1600-XOP.c: ^
KeccakP-1600-XOP.c: KeccakP-1600-XOP.c:400:5: error: '__builtin_ia32_vprotqi' needs target feature xop
KeccakP-1600-XOP.c: ./KeccakP-1600-unrolling.macros:297:9: note: expanded from macro 'roundsN'
KeccakP-1600-XOP.c: thetaRhoPiChiIotaPrepareTheta(i, A, E) \
KeccakP-1600-XOP.c: ^
KeccakP-1600-XOP.c: KeccakP-1600-XOP.c:200:5: note: expanded from macro 'thetaRhoPiChiIotaPrepareTheta'
KeccakP-1600-XOP.c: computeD \
KeccakP-1600-XOP.c: ^
KeccakP-1600-XOP.c: ...

Number of similar (compiler,implementation) pairs: 10, namely:
CompilerImplementations
clang -march=native -O2 -fomit-frame-pointer -fwrapv -Qunused-arguments -fPIC -fPIE T:kcp/optimized1600XOPu6
clang -march=native -O3 -fomit-frame-pointer -fwrapv -Qunused-arguments -fPIC -fPIE T:kcp/optimized1600XOPu6
clang -march=native -O -fomit-frame-pointer -fwrapv -Qunused-arguments -fPIC -fPIE T:kcp/optimized1600XOPu6
clang -march=native -Os -fomit-frame-pointer -fwrapv -Qunused-arguments -fPIC -fPIE T:kcp/optimized1600XOPu6
clang -mcpu=native -O3 -fomit-frame-pointer -fwrapv -Qunused-arguments -fPIC -fPIE T:kcp/optimized1600XOPu6
clang -march=native -O2 -fomit-frame-pointer -fwrapv -Qunused-arguments -fPIC -fPIE T:kcp/optimized1600XOPufull
clang -march=native -O3 -fomit-frame-pointer -fwrapv -Qunused-arguments -fPIC -fPIE T:kcp/optimized1600XOPufull
clang -march=native -O -fomit-frame-pointer -fwrapv -Qunused-arguments -fPIC -fPIE T:kcp/optimized1600XOPufull
clang -march=native -Os -fomit-frame-pointer -fwrapv -Qunused-arguments -fPIC -fPIE T:kcp/optimized1600XOPufull
clang -mcpu=native -O3 -fomit-frame-pointer -fwrapv -Qunused-arguments -fPIC -fPIE T:kcp/optimized1600XOPufull

Compiler output

Implementation: T:kcp/optimized1600XOPu6
Security model: timingleaks
Compiler: gcc -march=native -mtune=native -O2 -fomit-frame-pointer -fwrapv -fPIC -fPIE
KeccakP-1600-XOP.c: In file included from /usr/lib/gcc/x86_64-linux-gnu/11/include/x86intrin.h:38,
KeccakP-1600-XOP.c: from KeccakP-1600-XOP.c:32:
KeccakP-1600-XOP.c: KeccakP-1600-XOP.c: In function 'KeccakP1600_Permute_Nrounds':
KeccakP-1600-XOP.c: /usr/lib/gcc/x86_64-linux-gnu/11/include/xopintrin.h:272:1: error: inlining failed in call to 'always_inline' '_mm_roti_epi64': target specific option mismatch
KeccakP-1600-XOP.c: 272 | _mm_roti_epi64(__m128i __A, const int __B)
KeccakP-1600-XOP.c: | ^~~~~~~~~~~~~~
KeccakP-1600-XOP.c: KeccakP-1600-XOP.c:60:29: note: called from here
KeccakP-1600-XOP.c: 60 | #define ROL6464same(a, o) _mm_roti_epi64(a, o)
KeccakP-1600-XOP.c: | ^~~~~~~~~~~~~~~~~~~~
KeccakP-1600-XOP.c: KeccakP-1600-XOP.c:250:13: note: in expansion of macro 'ROL6464same'
KeccakP-1600-XOP.c: 250 | Bsusa = ROL6464same(Bsusa, 2); \
KeccakP-1600-XOP.c: | ^~~~~~~~~~~
KeccakP-1600-XOP.c: KeccakP-1600-unrolling.macros:297:9: note: in expansion of macro 'thetaRhoPiChiIotaPrepareTheta'
KeccakP-1600-XOP.c: 297 | thetaRhoPiChiIotaPrepareTheta(i, A, E) \
KeccakP-1600-XOP.c: | ^~~~~~~~~~~~~~~~~~~~~~~~~~~~~
KeccakP-1600-XOP.c: KeccakP-1600-XOP.c:400:5: note: in expansion of macro 'roundsN'
KeccakP-1600-XOP.c: 400 | roundsN(nr)
KeccakP-1600-XOP.c: | ^~~~~~~
KeccakP-1600-XOP.c: In file included from /usr/lib/gcc/x86_64-linux-gnu/11/include/x86intrin.h:38,
KeccakP-1600-XOP.c: from KeccakP-1600-XOP.c:32:
KeccakP-1600-XOP.c: /usr/lib/gcc/x86_64-linux-gnu/11/include/xopintrin.h:245:1: error: inlining failed in call to 'always_inline' '_mm_rot_epi64': target specific option mismatch
KeccakP-1600-XOP.c: 245 | _mm_rot_epi64(__m128i __A, __m128i __B)
KeccakP-1600-XOP.c: | ^~~~~~~~~~~~~
KeccakP-1600-XOP.c: KeccakP-1600-XOP.c:61:29: note: called from here
KeccakP-1600-XOP.c: 61 | #define ROL6464(a, r1, r2) _mm_rot_epi64(a, CONST128( rot_##r1##_##r2 ))
KeccakP-1600-XOP.c: ...

Number of similar (compiler,implementation) pairs: 8, namely:
CompilerImplementations
gcc -march=native -mtune=native -O2 -fomit-frame-pointer -fwrapv -fPIC -fPIE T:kcp/optimized1600XOPu6
gcc -march=native -mtune=native -O3 -fomit-frame-pointer -fwrapv -fPIC -fPIE T:kcp/optimized1600XOPu6
gcc -march=native -mtune=native -O -fomit-frame-pointer -fwrapv -fPIC -fPIE T:kcp/optimized1600XOPu6
gcc -march=native -mtune=native -Os -fomit-frame-pointer -fwrapv -fPIC -fPIE T:kcp/optimized1600XOPu6
gcc -march=native -mtune=native -O2 -fomit-frame-pointer -fwrapv -fPIC -fPIE T:kcp/optimized1600XOPufull
gcc -march=native -mtune=native -O3 -fomit-frame-pointer -fwrapv -fPIC -fPIE T:kcp/optimized1600XOPufull
gcc -march=native -mtune=native -O -fomit-frame-pointer -fwrapv -fPIC -fPIE T:kcp/optimized1600XOPufull
gcc -march=native -mtune=native -Os -fomit-frame-pointer -fwrapv -fPIC -fPIE T:kcp/optimized1600XOPufull