Implementation notes: amd64, hydra5, crypto_hash/blake256

Computer: hydra5
Architecture: amd64
CPU ID: AuthenticAMD-00300f10-178bfbff
SUPERCOP version: 20191221
Operation: crypto_hash
Primitive: blake256
TimeObject sizeTest sizeImplementationCompilerBenchmark dateSUPERCOP version
206169958 0 019209 752 776bswapgcc_-march=native_-mtune=native_-Os_-fomit-frame-pointer_-fwrapv_-fPIC_-fPIE2019122120191221
2065510160 0 019401 752 776regsgcc_-march=native_-mtune=native_-Os_-fomit-frame-pointer_-fwrapv_-fPIC_-fPIE2019122120191221
2108010583 0 021069 768 808regsgcc_-march=native_-mtune=native_-O2_-fomit-frame-pointer_-fwrapv_-fPIC_-fPIE2019122120191221
2109410383 0 020877 768 808bswapgcc_-march=native_-mtune=native_-O2_-fomit-frame-pointer_-fwrapv_-fPIC_-fPIE2019122120191221
2117411232 0 024246 776 808bswapgcc_-march=native_-mtune=native_-O3_-fomit-frame-pointer_-fwrapv_-fPIC_-fPIE2019122120191221
2122711007 0 024022 776 808regsgcc_-march=native_-mtune=native_-O3_-fomit-frame-pointer_-fwrapv_-fPIC_-fPIE2019122120191221
213067585 0 016829 768 736sse2clang_-march=native_-Os_-fomit-frame-pointer_-fwrapv_-Qunused-arguments_-fPIC_-fPIE2019122120191221
213417972 0 018991 776 736sse2-2clang_-march=native_-O2_-fomit-frame-pointer_-fwrapv_-Qunused-arguments_-fPIC_-fPIE2019122120191221
213417972 0 020175 776 736sse2-2clang_-march=native_-O3_-fomit-frame-pointer_-fwrapv_-Qunused-arguments_-fPIC_-fPIE2019122120191221
213417972 0 020175 776 736sse2-2clang_-mcpu=native_-O3_-fomit-frame-pointer_-fwrapv_-Qunused-arguments_-fPIC_-fPIE2019122120191221
213507972 0 018991 776 736sse2-2clang_-march=native_-O_-fomit-frame-pointer_-fwrapv_-Qunused-arguments_-fPIC_-fPIE2019122120191221
215377947 0 017181 768 736sse2-2clang_-march=native_-Os_-fomit-frame-pointer_-fwrapv_-Qunused-arguments_-fPIC_-fPIE2019122120191221
215507610 0 019823 776 736sse2clang_-march=native_-O3_-fomit-frame-pointer_-fwrapv_-Qunused-arguments_-fPIC_-fPIE2019122120191221
215507610 0 019823 776 736sse2clang_-mcpu=native_-O3_-fomit-frame-pointer_-fwrapv_-Qunused-arguments_-fPIC_-fPIE2019122120191221
215557610 0 018639 776 736sse2clang_-march=native_-O2_-fomit-frame-pointer_-fwrapv_-Qunused-arguments_-fPIC_-fPIE2019122120191221
215557610 0 018639 776 736sse2clang_-march=native_-O_-fomit-frame-pointer_-fwrapv_-Qunused-arguments_-fPIC_-fPIE2019122120191221
2183010226 0 020349 768 808bswapgcc_-march=native_-mtune=native_-O_-fomit-frame-pointer_-fwrapv_-fPIC_-fPIE2019122120191221
2208223750 0 034470 776 808sphlibgcc_-march=native_-mtune=native_-O2_-fomit-frame-pointer_-fwrapv_-fPIC_-fPIE2019122120191221
2208227865 0 040982 776 808sphlibgcc_-march=native_-mtune=native_-O3_-fomit-frame-pointer_-fwrapv_-fPIC_-fPIE2019122120191221
2220224314 0 035455 776 736sphlibclang_-march=native_-O_-fomit-frame-pointer_-fwrapv_-Qunused-arguments_-fPIC_-fPIE2019122120191221
2220624314 0 035455 776 736sphlibclang_-march=native_-O2_-fomit-frame-pointer_-fwrapv_-Qunused-arguments_-fPIC_-fPIE2019122120191221
2233924346 0 036671 776 736sphlibclang_-mcpu=native_-O3_-fomit-frame-pointer_-fwrapv_-Qunused-arguments_-fPIC_-fPIE2019122120191221
2234824346 0 036671 776 736sphlibclang_-march=native_-O3_-fomit-frame-pointer_-fwrapv_-Qunused-arguments_-fPIC_-fPIE2019122120191221
2244024127 0 033501 768 736sphlibclang_-march=native_-Os_-fomit-frame-pointer_-fwrapv_-Qunused-arguments_-fPIC_-fPIE2019122120191221
2285723778 0 034110 776 808sphlibgcc_-march=native_-mtune=native_-O_-fomit-frame-pointer_-fwrapv_-fPIC_-fPIE2019122120191221
2296810966 0 021085 768 808regsgcc_-march=native_-mtune=native_-O_-fomit-frame-pointer_-fwrapv_-fPIC_-fPIE2019122120191221
2323822781 0 032153 752 776sphlibgcc_-march=native_-mtune=native_-Os_-fomit-frame-pointer_-fwrapv_-fPIC_-fPIE2019122120191221
236198762 0 018885 768 808sse2gcc_-march=native_-mtune=native_-O_-fomit-frame-pointer_-fwrapv_-fPIC_-fPIE2019122120191221
237269429 0 019557 768 808sse2-2gcc_-march=native_-mtune=native_-O_-fomit-frame-pointer_-fwrapv_-fPIC_-fPIE2019122120191221
2649910215 0 023230 776 808sse2-2gcc_-march=native_-mtune=native_-O3_-fomit-frame-pointer_-fwrapv_-fPIC_-fPIE2019122120191221
265969791 0 020277 768 808sse2-2gcc_-march=native_-mtune=native_-O2_-fomit-frame-pointer_-fwrapv_-fPIC_-fPIE2019122120191221
302048725 0 019783 776 736bswapclang_-march=native_-O2_-fomit-frame-pointer_-fwrapv_-Qunused-arguments_-fPIC_-fPIE2019122120191221
302488725 0 020967 776 736bswapclang_-march=native_-O3_-fomit-frame-pointer_-fwrapv_-Qunused-arguments_-fPIC_-fPIE2019122120191221
304518779 0 020999 776 736bswapclang_-mcpu=native_-O3_-fomit-frame-pointer_-fwrapv_-Qunused-arguments_-fPIC_-fPIE2019122120191221
304658725 0 019783 776 736bswapclang_-march=native_-O_-fomit-frame-pointer_-fwrapv_-Qunused-arguments_-fPIC_-fPIE2019122120191221
304918677 0 017941 768 736bswapclang_-march=native_-Os_-fomit-frame-pointer_-fwrapv_-Qunused-arguments_-fPIC_-fPIE2019122120191221
305049223 0 022238 776 808sse2gcc_-march=native_-mtune=native_-O3_-fomit-frame-pointer_-fwrapv_-fPIC_-fPIE2019122120191221
305408799 0 019285 768 808sse2gcc_-march=native_-mtune=native_-O2_-fomit-frame-pointer_-fwrapv_-fPIC_-fPIE2019122120191221
306338333 0 018662 776 808sphlib-smallgcc_-march=native_-mtune=native_-O_-fomit-frame-pointer_-fwrapv_-fPIC_-fPIE2019122120191221
308372552 0 011797 768 736refclang_-march=native_-Os_-fomit-frame-pointer_-fwrapv_-Qunused-arguments_-fPIC_-fPIE2019122120191221
314627470 0 016857 752 776sphlib-smallgcc_-march=native_-mtune=native_-Os_-fomit-frame-pointer_-fwrapv_-fPIC_-fPIE2019122120191221
323219328 0 021543 776 736regsclang_-mcpu=native_-O3_-fomit-frame-pointer_-fwrapv_-Qunused-arguments_-fPIC_-fPIE2019122120191221
324819245 0 018485 768 736regsclang_-march=native_-Os_-fomit-frame-pointer_-fwrapv_-Qunused-arguments_-fPIC_-fPIE2019122120191221
326979270 0 021511 776 736regsclang_-march=native_-O3_-fomit-frame-pointer_-fwrapv_-Qunused-arguments_-fPIC_-fPIE2019122120191221
327029270 0 020327 776 736regsclang_-march=native_-O_-fomit-frame-pointer_-fwrapv_-Qunused-arguments_-fPIC_-fPIE2019122120191221
328669270 0 020327 776 736regsclang_-march=native_-O2_-fomit-frame-pointer_-fwrapv_-Qunused-arguments_-fPIC_-fPIE2019122120191221
332878029 0 017389 768 736sphlib-smallclang_-march=native_-Os_-fomit-frame-pointer_-fwrapv_-Qunused-arguments_-fPIC_-fPIE2019122120191221
334828266 0 019439 776 736sphlib-smallclang_-march=native_-O_-fomit-frame-pointer_-fwrapv_-Qunused-arguments_-fPIC_-fPIE2019122120191221
334868314 0 020655 776 736sphlib-smallclang_-march=native_-O3_-fomit-frame-pointer_-fwrapv_-Qunused-arguments_-fPIC_-fPIE2019122120191221
335048314 0 020655 776 736sphlib-smallclang_-mcpu=native_-O3_-fomit-frame-pointer_-fwrapv_-Qunused-arguments_-fPIC_-fPIE2019122120191221
335708266 0 019439 776 736sphlib-smallclang_-march=native_-O2_-fomit-frame-pointer_-fwrapv_-Qunused-arguments_-fPIC_-fPIE2019122120191221
349222833 0 012073 752 776refgcc_-march=native_-mtune=native_-Os_-fomit-frame-pointer_-fwrapv_-fPIC_-fPIE2019122120191221
367342975 0 013117 768 808refgcc_-march=native_-mtune=native_-O_-fomit-frame-pointer_-fwrapv_-fPIC_-fPIE2019122120191221
399198599 0 017865 752 776sse2-2gcc_-march=native_-mtune=native_-Os_-fomit-frame-pointer_-fwrapv_-fPIC_-fPIE2019122120191221
4153210650 0 019913 752 776sandygcc_-march=native_-mtune=native_-Os_-fomit-frame-pointer_-fwrapv_-fPIC_-fPIE2019122120191221
424942947 0 015159 776 736refclang_-mcpu=native_-O3_-fomit-frame-pointer_-fwrapv_-Qunused-arguments_-fPIC_-fPIE2019122120191221
425123123 0 014151 776 736refclang_-march=native_-O2_-fomit-frame-pointer_-fwrapv_-Qunused-arguments_-fPIC_-fPIE2019122120191221
4252514329 0 027446 776 808sphlib-smallgcc_-march=native_-mtune=native_-O3_-fomit-frame-pointer_-fwrapv_-fPIC_-fPIE2019122120191221
426132947 0 015159 776 736refclang_-march=native_-O3_-fomit-frame-pointer_-fwrapv_-Qunused-arguments_-fPIC_-fPIE2019122120191221
427953123 0 014151 776 736refclang_-march=native_-O_-fomit-frame-pointer_-fwrapv_-Qunused-arguments_-fPIC_-fPIE2019122120191221
4366410150 0 020870 776 808sphlib-smallgcc_-march=native_-mtune=native_-O2_-fomit-frame-pointer_-fwrapv_-fPIC_-fPIE2019122120191221
4446511695 0 022189 768 808sandygcc_-march=native_-mtune=native_-O2_-fomit-frame-pointer_-fwrapv_-fPIC_-fPIE2019122120191221
4451012544 0 025558 776 808sandygcc_-march=native_-mtune=native_-O3_-fomit-frame-pointer_-fwrapv_-fPIC_-fPIE2019122120191221
4489510213 0 021255 776 736sandyclang_-march=native_-O2_-fomit-frame-pointer_-fwrapv_-Qunused-arguments_-fPIC_-fPIE2019122120191221
4490810213 0 022439 776 736sandyclang_-march=native_-O3_-fomit-frame-pointer_-fwrapv_-Qunused-arguments_-fPIC_-fPIE2019122120191221
4494410213 0 022439 776 736sandyclang_-mcpu=native_-O3_-fomit-frame-pointer_-fwrapv_-Qunused-arguments_-fPIC_-fPIE2019122120191221
4496210165 0 019413 768 736sandyclang_-march=native_-Os_-fomit-frame-pointer_-fwrapv_-Qunused-arguments_-fPIC_-fPIE2019122120191221
4497510213 0 021255 776 736sandyclang_-march=native_-O_-fomit-frame-pointer_-fwrapv_-Qunused-arguments_-fPIC_-fPIE2019122120191221
463134911 0 017910 776 808refgcc_-march=native_-mtune=native_-O3_-fomit-frame-pointer_-fwrapv_-fPIC_-fPIE2019122120191221
471118011 0 017257 752 776sse2gcc_-march=native_-mtune=native_-Os_-fomit-frame-pointer_-fwrapv_-fPIC_-fPIE2019122120191221
475623959 0 014445 768 808refgcc_-march=native_-mtune=native_-O2_-fomit-frame-pointer_-fwrapv_-fPIC_-fPIE2019122120191221
4891711328 0 021469 768 808sandygcc_-march=native_-mtune=native_-O_-fomit-frame-pointer_-fwrapv_-fPIC_-fPIE2019122120191221

Compiler output

Implementation: avxicc
Security model: unknown
Compiler: clang -march=native -O2 -fomit-frame-pointer -fwrapv -Qunused-arguments -fPIC -fPIE
hash.s: hash.s:219710:31: error: cannot use more than one symbol in memory operand
hash.s: mov esi, offset flat: padding.0 #289.3
hash.s: ^
hash.s: hash.s:219728:31: error: cannot use more than one symbol in memory operand
hash.s: mov esi, offset flat: padding.0 #289.3
hash.s: ^
hash.s: hash.s:221419:31: error: cannot use more than one symbol in memory operand
hash.s: mov esi, offset flat: padding.0 #289.3
hash.s: ^
hash.s: hash.s:221437:31: error: cannot use more than one symbol in memory operand
hash.s: mov esi, offset flat: padding.0 #289.3
hash.s: ^
hash.s: hash.s:223123:31: error: cannot use more than one symbol in memory operand
hash.s: mov esi, offset flat: padding.0+1 #289.3
hash.s: ^

Number of similar (compiler,implementation) pairs: 5, namely:
CompilerImplementations
clang -march=native -O2 -fomit-frame-pointer -fwrapv -Qunused-arguments -fPIC -fPIE avxicc
clang -march=native -O3 -fomit-frame-pointer -fwrapv -Qunused-arguments -fPIC -fPIE avxicc
clang -march=native -O -fomit-frame-pointer -fwrapv -Qunused-arguments -fPIC -fPIE avxicc
clang -march=native -Os -fomit-frame-pointer -fwrapv -Qunused-arguments -fPIC -fPIE avxicc
clang -mcpu=native -O3 -fomit-frame-pointer -fwrapv -Qunused-arguments -fPIC -fPIE avxicc

Compiler output

Implementation: avxicc
Security model: unknown
Compiler: gcc -march=native -mtune=native -O2 -fomit-frame-pointer -fwrapv -fPIC -fPIE
try.c: /usr/bin/ld: crypto_hash_blake256.a(hash.o): relocation R_X86_64_32 against `.rodata' can not be used when making a PIE object; recompile with -fPIC
try.c: /usr/bin/ld: final link failed: Nonrepresentable section on output
try.c: collect2: error: ld returned 1 exit status

Number of similar (compiler,implementation) pairs: 4, namely:
CompilerImplementations
gcc -march=native -mtune=native -O2 -fomit-frame-pointer -fwrapv -fPIC -fPIE avxicc
gcc -march=native -mtune=native -O3 -fomit-frame-pointer -fwrapv -fPIC -fPIE avxicc
gcc -march=native -mtune=native -O -fomit-frame-pointer -fwrapv -fPIC -fPIE avxicc
gcc -march=native -mtune=native -Os -fomit-frame-pointer -fwrapv -fPIC -fPIE avxicc

Compiler output

Implementation: avxs
Security model: unknown
Compiler: clang -march=native -O2 -fomit-frame-pointer -fwrapv -Qunused-arguments -fPIC -fPIE
hash.c: hash.c:154:61: error: always_inline function '_mm_shuffle_epi8' requires target feature 'ssse3', but would be inlined into function 'blake256_final' that is compiled without support for 'ssse3'
hash.c: __m128i w0 = _mm_load_si128((__m128i*)(&S->h[0])); w0 = _mm_shuffle_epi8(w0, u32to8);
hash.c: ^
hash.c: hash.c:155:61: error: always_inline function '_mm_shuffle_epi8' requires target feature 'ssse3', but would be inlined into function 'blake256_final' that is compiled without support for 'ssse3'
hash.c: __m128i w1 = _mm_load_si128((__m128i*)(&S->h[4])); w1 = _mm_shuffle_epi8(w1, u32to8);
hash.c: ^
hash.c: 2 errors generated.

Number of similar (compiler,implementation) pairs: 5, namely:
CompilerImplementations
clang -march=native -O2 -fomit-frame-pointer -fwrapv -Qunused-arguments -fPIC -fPIE avxs
clang -march=native -O3 -fomit-frame-pointer -fwrapv -Qunused-arguments -fPIC -fPIE avxs
clang -march=native -O -fomit-frame-pointer -fwrapv -Qunused-arguments -fPIC -fPIE avxs
clang -march=native -Os -fomit-frame-pointer -fwrapv -Qunused-arguments -fPIC -fPIE avxs
clang -mcpu=native -O3 -fomit-frame-pointer -fwrapv -Qunused-arguments -fPIC -fPIE avxs

Compiler output

Implementation: avxs
Security model: unknown
Compiler: gcc -march=native -mtune=native -O2 -fomit-frame-pointer -fwrapv -fPIC -fPIE
hash.c: In file included from /usr/lib/gcc/x86_64-linux-gnu/7/include/x86intrin.h:39:0,
hash.c: from hash.c:7:
hash.c: hash.c: In function 'blake256_final':
hash.c: /usr/lib/gcc/x86_64-linux-gnu/7/include/tmmintrin.h:136:1: error: inlining failed in call to always_inline '_mm_shuffle_epi8': target specific option mismatch
hash.c: _mm_shuffle_epi8 (__m128i __X, __m128i __Y)
hash.c: ^~~~~~~~~~~~~~~~
hash.c: hash.c:155:59: note: called from here
hash.c: __m128i w1 = _mm_load_si128((__m128i*)(&S->h[4])); w1 = _mm_shuffle_epi8(w1, u32to8);
hash.c: ~~~^~~~~~~~~~~~~~~~~~~~~~~~~~~~~~
hash.c: In file included from /usr/lib/gcc/x86_64-linux-gnu/7/include/x86intrin.h:39:0,
hash.c: from hash.c:7:
hash.c: /usr/lib/gcc/x86_64-linux-gnu/7/include/tmmintrin.h:136:1: error: inlining failed in call to always_inline '_mm_shuffle_epi8': target specific option mismatch
hash.c: _mm_shuffle_epi8 (__m128i __X, __m128i __Y)
hash.c: ^~~~~~~~~~~~~~~~
hash.c: hash.c:154:59: note: called from here
hash.c: __m128i w0 = _mm_load_si128((__m128i*)(&S->h[0])); w0 = _mm_shuffle_epi8(w0, u32to8);
hash.c: ~~~^~~~~~~~~~~~~~~~~~~~~~~~~~~~~~
hash.c: In file included from /usr/lib/gcc/x86_64-linux-gnu/7/include/x86intrin.h:39:0,
hash.c: from hash.c:7:
hash.c: /usr/lib/gcc/x86_64-linux-gnu/7/include/tmmintrin.h:136:1: error: inlining failed in call to always_inline '_mm_shuffle_epi8': target specific option mismatch
hash.c: _mm_shuffle_epi8 (__m128i __X, __m128i __Y)
hash.c: ^~~~~~~~~~~~~~~~
hash.c: hash.c:154:59: note: called from here
hash.c: __m128i w0 = _mm_load_si128((__m128i*)(&S->h[0])); w0 = _mm_shuffle_epi8(w0, u32to8);
hash.c: ~~~^~~~~~~~~~~~~~~~~~~~~~~~~~~~~~
hash.c: ...

Number of similar (compiler,implementation) pairs: 4, namely:
CompilerImplementations
gcc -march=native -mtune=native -O2 -fomit-frame-pointer -fwrapv -fPIC -fPIE avxs
gcc -march=native -mtune=native -O3 -fomit-frame-pointer -fwrapv -fPIC -fPIE avxs
gcc -march=native -mtune=native -O -fomit-frame-pointer -fwrapv -fPIC -fPIE avxs
gcc -march=native -mtune=native -Os -fomit-frame-pointer -fwrapv -fPIC -fPIE avxs

Compiler output

Implementation: sse41
Security model: unknown
Compiler: clang -march=native -O2 -fomit-frame-pointer -fwrapv -Qunused-arguments -fPIC -fPIE
hash.c: In file included from hash.c:121:
hash.c: ./rounds.sse41.h:17:22: warning: implicit conversion from 'long' to 'int' changes value from 3964562569 to -330404727 [-Wconstant-conversion]
hash.c: buf2 = _mm_set_epi32(3964562569, 698298832, 57701188, 2242054355);
hash.c: ~~~~~~~~~~~~~ ^~~~~~~~~~
hash.c: ./rounds.sse41.h:17:55: warning: implicit conversion from 'long' to 'int' changes value from 2242054355 to -2052912941 [-Wconstant-conversion]
hash.c: buf2 = _mm_set_epi32(3964562569, 698298832, 57701188, 2242054355);
hash.c: ~~~~~~~~~~~~~ ^~~~~~~~~~
hash.c: ./rounds.sse41.h:20:33: warning: implicit conversion from 'long' to 'int' changes value from 2752067618 to -1542899678 [-Wconstant-conversion]
hash.c: buf1 = _mm_set_epi32(137296536, 2752067618, 320440878, 608135816);
hash.c: ~~~~~~~~~~~~~ ^~~~~~~~~~
hash.c: ./rounds.sse41.h:47:22: warning: implicit conversion from 'long' to 'int' changes value from 3041331479 to -1253635817 [-Wconstant-conversion]
hash.c: buf2 = _mm_set_epi32(3041331479, 3380367581, 887688300, 953160567);
hash.c: ~~~~~~~~~~~~~ ^~~~~~~~~~
hash.c: ./rounds.sse41.h:47:34: warning: implicit conversion from 'long' to 'int' changes value from 3380367581 to -914599715 [-Wconstant-conversion]
hash.c: buf2 = _mm_set_epi32(3041331479, 3380367581, 887688300, 953160567);
hash.c: ~~~~~~~~~~~~~ ^~~~~~~~~~
hash.c: ./rounds.sse41.h:50:34: warning: implicit conversion from 'long' to 'int' changes value from 3232508343 to -1062458953 [-Wconstant-conversion]
hash.c: buf1 = _mm_set_epi32(1065670069, 3232508343, 3193202383, 1160258022);
hash.c: ~~~~~~~~~~~~~ ^~~~~~~~~~
hash.c: ./rounds.sse41.h:50:46: warning: implicit conversion from 'long' to 'int' changes value from 3193202383 to -1101764913 [-Wconstant-conversion]
hash.c: buf1 = _mm_set_epi32(1065670069, 3232508343, 3193202383, 1160258022);
hash.c: ~~~~~~~~~~~~~ ^~~~~~~~~~
hash.c: ./rounds.sse41.h:81:33: warning: implicit conversion from 'long' to 'int' changes value from 3041331479 to -1253635817 [-Wconstant-conversion]
hash.c: buf2 = _mm_set_epi32(137296536, 3041331479, 1160258022, 3193202383);
hash.c: ~~~~~~~~~~~~~ ^~~~~~~~~~
hash.c: ...

Number of similar (compiler,implementation) pairs: 5, namely:
CompilerImplementations
clang -march=native -O2 -fomit-frame-pointer -fwrapv -Qunused-arguments -fPIC -fPIE sse41
clang -march=native -O3 -fomit-frame-pointer -fwrapv -Qunused-arguments -fPIC -fPIE sse41
clang -march=native -O -fomit-frame-pointer -fwrapv -Qunused-arguments -fPIC -fPIE sse41
clang -march=native -Os -fomit-frame-pointer -fwrapv -Qunused-arguments -fPIC -fPIE sse41
clang -mcpu=native -O3 -fomit-frame-pointer -fwrapv -Qunused-arguments -fPIC -fPIE sse41

Compiler output

Implementation: sse41
Security model: unknown
Compiler: gcc -march=native -mtune=native -O2 -fomit-frame-pointer -fwrapv -fPIC -fPIE
hash.c: In file included from hash.c:4:0:
hash.c: hash.c: In function 'blake256_compress':
hash.c: /usr/lib/gcc/x86_64-linux-gnu/7/include/tmmintrin.h:136:1: error: inlining failed in call to always_inline '_mm_shuffle_epi8': target specific option mismatch
hash.c: _mm_shuffle_epi8 (__m128i __X, __m128i __Y)
hash.c: ^~~~~~~~~~~~~~~~
hash.c: hash.c:107:6: note: called from here
hash.c: m3 = _mm_shuffle_epi8(_mm_loadu_si128((__m128i*)(datablock + 48)), u8to32);
hash.c: ~~~^~~~~~~~~~~~~~~~~~~~~~~~~~~~~~~~~~~~~~~~~~~~~~~~~~~~~~~~~~~~~~~~~~~~~~~
hash.c: In file included from hash.c:4:0:
hash.c: /usr/lib/gcc/x86_64-linux-gnu/7/include/tmmintrin.h:136:1: error: inlining failed in call to always_inline '_mm_shuffle_epi8': target specific option mismatch
hash.c: _mm_shuffle_epi8 (__m128i __X, __m128i __Y)
hash.c: ^~~~~~~~~~~~~~~~
hash.c: hash.c:106:6: note: called from here
hash.c: m2 = _mm_shuffle_epi8(_mm_loadu_si128((__m128i*)(datablock + 32)), u8to32);
hash.c: ~~~^~~~~~~~~~~~~~~~~~~~~~~~~~~~~~~~~~~~~~~~~~~~~~~~~~~~~~~~~~~~~~~~~~~~~~~
hash.c: In file included from hash.c:4:0:
hash.c: /usr/lib/gcc/x86_64-linux-gnu/7/include/tmmintrin.h:136:1: error: inlining failed in call to always_inline '_mm_shuffle_epi8': target specific option mismatch
hash.c: _mm_shuffle_epi8 (__m128i __X, __m128i __Y)
hash.c: ^~~~~~~~~~~~~~~~
hash.c: hash.c:105:6: note: called from here
hash.c: m1 = _mm_shuffle_epi8(_mm_loadu_si128((__m128i*)(datablock + 16)), u8to32);
hash.c: ~~~^~~~~~~~~~~~~~~~~~~~~~~~~~~~~~~~~~~~~~~~~~~~~~~~~~~~~~~~~~~~~~~~~~~~~~~
hash.c: In file included from hash.c:4:0:
hash.c: /usr/lib/gcc/x86_64-linux-gnu/7/include/tmmintrin.h:136:1: error: inlining failed in call to always_inline '_mm_shuffle_epi8': target specific option mismatch
hash.c: _mm_shuffle_epi8 (__m128i __X, __m128i __Y)
hash.c: ...

Number of similar (compiler,implementation) pairs: 4, namely:
CompilerImplementations
gcc -march=native -mtune=native -O2 -fomit-frame-pointer -fwrapv -fPIC -fPIE sse41
gcc -march=native -mtune=native -O3 -fomit-frame-pointer -fwrapv -fPIC -fPIE sse41
gcc -march=native -mtune=native -O -fomit-frame-pointer -fwrapv -fPIC -fPIE sse41
gcc -march=native -mtune=native -Os -fomit-frame-pointer -fwrapv -fPIC -fPIE sse41

Compiler output

Implementation: sse41-2
Security model: unknown
Compiler: clang -march=native -O2 -fomit-frame-pointer -fwrapv -Qunused-arguments -fPIC -fPIE
hash.c: In file included from hash.c:2:
hash.c: ./blake256.h:105:15: warning: '_mm_roti_epi32' macro redefined [-Wmacro-redefined]
hash.c: #define _mm_roti_epi32(r, c) ((8==-c) ? _mm_shuffle_epi8(r,r8) : ( (16==-c) ? _mm_shuffle_epi8(r,r16) : _mm_xor_si128(_mm_srli_epi32( (r), -(c) ),_mm_slli_epi32( (r), 32-(-c) )) ) )
hash.c: ^
hash.c: /usr/lib/llvm-6.0/lib/clang/6.0.0/include/xopintrin.h:246:9: note: previous definition is here
hash.c: #define _mm_roti_epi32(A, N) __extension__ ({ \
hash.c: ^
hash.c: hash.c:93:22: error: always_inline function '_mm_shuffle_epi8' requires target feature 'ssse3', but would be inlined into function 'blake256_compress' that is compiled without support for 'ssse3'
hash.c: const __m128i m0 = _mm_shuffle_epi8(LOADU(datablock + 00), u8to32);
hash.c: ^
hash.c: hash.c:94:22: error: always_inline function '_mm_shuffle_epi8' requires target feature 'ssse3', but would be inlined into function 'blake256_compress' that is compiled without support for 'ssse3'
hash.c: const __m128i m1 = _mm_shuffle_epi8(LOADU(datablock + 16), u8to32);
hash.c: ^
hash.c: hash.c:95:22: error: always_inline function '_mm_shuffle_epi8' requires target feature 'ssse3', but would be inlined into function 'blake256_compress' that is compiled without support for 'ssse3'
hash.c: const __m128i m2 = _mm_shuffle_epi8(LOADU(datablock + 32), u8to32);
hash.c: ^
hash.c: hash.c:96:22: error: always_inline function '_mm_shuffle_epi8' requires target feature 'ssse3', but would be inlined into function 'blake256_compress' that is compiled without support for 'ssse3'
hash.c: const __m128i m3 = _mm_shuffle_epi8(LOADU(datablock + 48), u8to32);
hash.c: ^
hash.c: hash.c:115:3: error: always_inline function '_mm_shuffle_epi8' requires target feature 'ssse3', but would be inlined into function 'blake256_compress' that is compiled without support for 'ssse3'
hash.c: ROUND( 0);
hash.c: ^
hash.c: ./rounds.h:52:3: note: expanded from macro 'ROUND'
hash.c: G1(row1,row2,row3,row4,buf1); \
hash.c: ^
hash.c: ...

Number of similar (compiler,implementation) pairs: 5, namely:
CompilerImplementations
clang -march=native -O2 -fomit-frame-pointer -fwrapv -Qunused-arguments -fPIC -fPIE sse41-2
clang -march=native -O3 -fomit-frame-pointer -fwrapv -Qunused-arguments -fPIC -fPIE sse41-2
clang -march=native -O -fomit-frame-pointer -fwrapv -Qunused-arguments -fPIC -fPIE sse41-2
clang -march=native -Os -fomit-frame-pointer -fwrapv -Qunused-arguments -fPIC -fPIE sse41-2
clang -mcpu=native -O3 -fomit-frame-pointer -fwrapv -Qunused-arguments -fPIC -fPIE sse41-2

Compiler output

Implementation: sse41-2
Security model: unknown
Compiler: gcc -march=native -mtune=native -O2 -fomit-frame-pointer -fwrapv -fPIC -fPIE
hash.c: In file included from /usr/lib/gcc/x86_64-linux-gnu/7/include/x86intrin.h:39:0,
hash.c: from blake256.h:7,
hash.c: from hash.c:2:
hash.c: hash.c: In function 'blake256_compress':
hash.c: /usr/lib/gcc/x86_64-linux-gnu/7/include/tmmintrin.h:136:1: error: inlining failed in call to always_inline '_mm_shuffle_epi8': target specific option mismatch
hash.c: _mm_shuffle_epi8 (__m128i __X, __m128i __Y)
hash.c: ^~~~~~~~~~~~~~~~
hash.c: hash.c:96:17: note: called from here
hash.c: const __m128i m3 = _mm_shuffle_epi8(LOADU(datablock + 48), u8to32);
hash.c: ^~
hash.c: In file included from /usr/lib/gcc/x86_64-linux-gnu/7/include/x86intrin.h:39:0,
hash.c: from blake256.h:7,
hash.c: from hash.c:2:
hash.c: /usr/lib/gcc/x86_64-linux-gnu/7/include/tmmintrin.h:136:1: error: inlining failed in call to always_inline '_mm_shuffle_epi8': target specific option mismatch
hash.c: _mm_shuffle_epi8 (__m128i __X, __m128i __Y)
hash.c: ^~~~~~~~~~~~~~~~
hash.c: hash.c:95:17: note: called from here
hash.c: const __m128i m2 = _mm_shuffle_epi8(LOADU(datablock + 32), u8to32);
hash.c: ^~
hash.c: In file included from /usr/lib/gcc/x86_64-linux-gnu/7/include/x86intrin.h:39:0,
hash.c: from blake256.h:7,
hash.c: from hash.c:2:
hash.c: /usr/lib/gcc/x86_64-linux-gnu/7/include/tmmintrin.h:136:1: error: inlining failed in call to always_inline '_mm_shuffle_epi8': target specific option mismatch
hash.c: _mm_shuffle_epi8 (__m128i __X, __m128i __Y)
hash.c: ^~~~~~~~~~~~~~~~
hash.c: ...

Number of similar (compiler,implementation) pairs: 8, namely:
CompilerImplementations
gcc -march=native -mtune=native -O2 -fomit-frame-pointer -fwrapv -fPIC -fPIE sse41-2
gcc -march=native -mtune=native -O3 -fomit-frame-pointer -fwrapv -fPIC -fPIE sse41-2
gcc -march=native -mtune=native -O -fomit-frame-pointer -fwrapv -fPIC -fPIE sse41-2
gcc -march=native -mtune=native -Os -fomit-frame-pointer -fwrapv -fPIC -fPIE sse41-2
gcc -march=native -mtune=native -O2 -fomit-frame-pointer -fwrapv -fPIC -fPIE xop
gcc -march=native -mtune=native -O3 -fomit-frame-pointer -fwrapv -fPIC -fPIE xop
gcc -march=native -mtune=native -O -fomit-frame-pointer -fwrapv -fPIC -fPIE xop
gcc -march=native -mtune=native -Os -fomit-frame-pointer -fwrapv -fPIC -fPIE xop

Compiler output

Implementation: ssse3
Security model: unknown
Compiler: clang -march=native -O2 -fomit-frame-pointer -fwrapv -Qunused-arguments -fPIC -fPIE
hash.c: In file included from hash.c:122:
hash.c: ./rounds.ssse3.h:3:22: warning: implicit conversion from 'long' to 'int' changes value from 3964562569 to -330404727 [-Wconstant-conversion]
hash.c: buf2 = _mm_set_epi32(3964562569, 698298832, 57701188, 2242054355);
hash.c: ~~~~~~~~~~~~~ ^~~~~~~~~~
hash.c: ./rounds.ssse3.h:3:55: warning: implicit conversion from 'long' to 'int' changes value from 2242054355 to -2052912941 [-Wconstant-conversion]
hash.c: buf2 = _mm_set_epi32(3964562569, 698298832, 57701188, 2242054355);
hash.c: ~~~~~~~~~~~~~ ^~~~~~~~~~
hash.c: ./rounds.ssse3.h:6:33: warning: implicit conversion from 'long' to 'int' changes value from 2752067618 to -1542899678 [-Wconstant-conversion]
hash.c: buf1 = _mm_set_epi32(137296536, 2752067618, 320440878, 608135816);
hash.c: ~~~~~~~~~~~~~ ^~~~~~~~~~
hash.c: ./rounds.ssse3.h:27:22: warning: implicit conversion from 'long' to 'int' changes value from 3041331479 to -1253635817 [-Wconstant-conversion]
hash.c: buf2 = _mm_set_epi32(3041331479, 3380367581, 887688300, 953160567);
hash.c: ~~~~~~~~~~~~~ ^~~~~~~~~~
hash.c: ./rounds.ssse3.h:27:34: warning: implicit conversion from 'long' to 'int' changes value from 3380367581 to -914599715 [-Wconstant-conversion]
hash.c: buf2 = _mm_set_epi32(3041331479, 3380367581, 887688300, 953160567);
hash.c: ~~~~~~~~~~~~~ ^~~~~~~~~~
hash.c: ./rounds.ssse3.h:30:34: warning: implicit conversion from 'long' to 'int' changes value from 3232508343 to -1062458953 [-Wconstant-conversion]
hash.c: buf1 = _mm_set_epi32(1065670069, 3232508343, 3193202383, 1160258022);
hash.c: ~~~~~~~~~~~~~ ^~~~~~~~~~
hash.c: ./rounds.ssse3.h:30:46: warning: implicit conversion from 'long' to 'int' changes value from 3193202383 to -1101764913 [-Wconstant-conversion]
hash.c: buf1 = _mm_set_epi32(1065670069, 3232508343, 3193202383, 1160258022);
hash.c: ~~~~~~~~~~~~~ ^~~~~~~~~~
hash.c: ./rounds.ssse3.h:51:33: warning: implicit conversion from 'long' to 'int' changes value from 3041331479 to -1253635817 [-Wconstant-conversion]
hash.c: buf2 = _mm_set_epi32(137296536, 3041331479, 1160258022, 3193202383);
hash.c: ~~~~~~~~~~~~~ ^~~~~~~~~~
hash.c: ...

Number of similar (compiler,implementation) pairs: 5, namely:
CompilerImplementations
clang -march=native -O2 -fomit-frame-pointer -fwrapv -Qunused-arguments -fPIC -fPIE ssse3
clang -march=native -O3 -fomit-frame-pointer -fwrapv -Qunused-arguments -fPIC -fPIE ssse3
clang -march=native -O -fomit-frame-pointer -fwrapv -Qunused-arguments -fPIC -fPIE ssse3
clang -march=native -Os -fomit-frame-pointer -fwrapv -Qunused-arguments -fPIC -fPIE ssse3
clang -mcpu=native -O3 -fomit-frame-pointer -fwrapv -Qunused-arguments -fPIC -fPIE ssse3

Compiler output

Implementation: ssse3
Security model: unknown
Compiler: gcc -march=native -mtune=native -O2 -fomit-frame-pointer -fwrapv -fPIC -fPIE
hash.c: In file included from hash.c:4:0:
hash.c: hash.c: In function 'blake256_compress':
hash.c: /usr/lib/gcc/x86_64-linux-gnu/7/include/tmmintrin.h:136:1: error: inlining failed in call to always_inline '_mm_shuffle_epi8': target specific option mismatch
hash.c: _mm_shuffle_epi8 (__m128i __X, __m128i __Y)
hash.c: ^~~~~~~~~~~~~~~~
hash.c: hash.c:108:15: note: called from here
hash.c: m.u128[3] = _mm_shuffle_epi8(_mm_loadu_si128((__m128i*)(datablock + 48)), u8to32);
hash.c: ^~~~~~~~~~~~~~~~~~~~~~~~~~~~~~~~~~~~~~~~~~~~~~~~~~~~~~~~~~~~~~~~~~~~~
hash.c: In file included from hash.c:4:0:
hash.c: /usr/lib/gcc/x86_64-linux-gnu/7/include/tmmintrin.h:136:1: error: inlining failed in call to always_inline '_mm_shuffle_epi8': target specific option mismatch
hash.c: _mm_shuffle_epi8 (__m128i __X, __m128i __Y)
hash.c: ^~~~~~~~~~~~~~~~
hash.c: hash.c:107:15: note: called from here
hash.c: m.u128[2] = _mm_shuffle_epi8(_mm_loadu_si128((__m128i*)(datablock + 32)), u8to32);
hash.c: ^~~~~~~~~~~~~~~~~~~~~~~~~~~~~~~~~~~~~~~~~~~~~~~~~~~~~~~~~~~~~~~~~~~~~
hash.c: In file included from hash.c:4:0:
hash.c: /usr/lib/gcc/x86_64-linux-gnu/7/include/tmmintrin.h:136:1: error: inlining failed in call to always_inline '_mm_shuffle_epi8': target specific option mismatch
hash.c: _mm_shuffle_epi8 (__m128i __X, __m128i __Y)
hash.c: ^~~~~~~~~~~~~~~~
hash.c: hash.c:106:15: note: called from here
hash.c: m.u128[1] = _mm_shuffle_epi8(_mm_loadu_si128((__m128i*)(datablock + 16)), u8to32);
hash.c: ^~~~~~~~~~~~~~~~~~~~~~~~~~~~~~~~~~~~~~~~~~~~~~~~~~~~~~~~~~~~~~~~~~~~~
hash.c: In file included from hash.c:4:0:
hash.c: /usr/lib/gcc/x86_64-linux-gnu/7/include/tmmintrin.h:136:1: error: inlining failed in call to always_inline '_mm_shuffle_epi8': target specific option mismatch
hash.c: _mm_shuffle_epi8 (__m128i __X, __m128i __Y)
hash.c: ...

Number of similar (compiler,implementation) pairs: 4, namely:
CompilerImplementations
gcc -march=native -mtune=native -O2 -fomit-frame-pointer -fwrapv -fPIC -fPIE ssse3
gcc -march=native -mtune=native -O3 -fomit-frame-pointer -fwrapv -fPIC -fPIE ssse3
gcc -march=native -mtune=native -O -fomit-frame-pointer -fwrapv -fPIC -fPIE ssse3
gcc -march=native -mtune=native -Os -fomit-frame-pointer -fwrapv -fPIC -fPIE ssse3

Compiler output

Implementation: vect128
Security model: unknown
Compiler: clang -march=native -O2 -fomit-frame-pointer -fwrapv -Qunused-arguments -fPIC -fPIE
vector.c: vector.c:389:3: error: use of unknown builtin '__builtin_ia32_punpckldq128' [-Wimplicit-function-declaration]
vector.c: v32_interleave_inplace(M0,M2);
vector.c: ^
vector.c: ./vector.h:1038:17: note: expanded from macro 'v32_interleave_inplace'
vector.c: v32 c__ = v32_interleavel (a__, b__); \
vector.c: ^
vector.c: ./vector.h:100:27: note: expanded from macro 'v32_interleavel'
vector.c: #define v32_interleavel __builtin_ia32_punpckldq128
vector.c: ^
vector.c: vector.c:389:3: error: initializing 'v32' (aka 'v4si') with an expression of incompatible type 'int'
vector.c: v32_interleave_inplace(M0,M2);
vector.c: ^~~~~~~~~~~~~~~~~~~~~~~~~~~~~
vector.c: ./vector.h:1038:11: note: expanded from macro 'v32_interleave_inplace'
vector.c: v32 c__ = v32_interleavel (a__, b__); \
vector.c: ^ ~~~~~~~~~~~~~~~~~~~~~~~~~~
vector.c: vector.c:389:3: error: use of unknown builtin '__builtin_ia32_punpckhdq128' [-Wimplicit-function-declaration]
vector.c: ./vector.h:1039:17: note: expanded from macro 'v32_interleave_inplace'
vector.c: v32 d__ = v32_interleaveh (a__, b__); \
vector.c: ^
vector.c: ./vector.h:101:27: note: expanded from macro 'v32_interleaveh'
vector.c: #define v32_interleaveh __builtin_ia32_punpckhdq128
vector.c: ^
vector.c: vector.c:389:3: note: did you mean '__builtin_ia32_punpckldq128'?
vector.c: ./vector.h:1039:17: note: expanded from macro 'v32_interleave_inplace'
vector.c: v32 d__ = v32_interleaveh (a__, b__); \
vector.c: ...

Number of similar (compiler,implementation) pairs: 5, namely:
CompilerImplementations
clang -march=native -O2 -fomit-frame-pointer -fwrapv -Qunused-arguments -fPIC -fPIE vect128
clang -march=native -O3 -fomit-frame-pointer -fwrapv -Qunused-arguments -fPIC -fPIE vect128
clang -march=native -O -fomit-frame-pointer -fwrapv -Qunused-arguments -fPIC -fPIE vect128
clang -march=native -Os -fomit-frame-pointer -fwrapv -Qunused-arguments -fPIC -fPIE vect128
clang -mcpu=native -O3 -fomit-frame-pointer -fwrapv -Qunused-arguments -fPIC -fPIE vect128

Compiler output

Implementation: vect128
Security model: unknown
Compiler: gcc -march=native -mtune=native -O2 -fomit-frame-pointer -fwrapv -fPIC -fPIE
vector.c: In file included from vector.c:7:0:
vector.c: vector.c: In function 'round256':
vector.c: vector.h:83:29: warning: implicit declaration of function '__builtin_ia32_pshufb128'; did you mean '__builtin_ia32_psubb128'? [-Wimplicit-function-declaration]
vector.c: #define vector_shuffle(x,s) __builtin_ia32_pshufb128(x, s)
vector.c: ^
vector.c: vector.h:59:26: note: in definition of macro 'V1632'
vector.c: #define V1632(x) ((v32) (x))
vector.c: ^
vector.c: vector.h:1006:24: note: in expansion of macro 'V816'
vector.c: #define V832(x) V1632(V816(x))
vector.c: ^~~~
vector.c: vector.c:384:8: note: in expansion of macro 'V832'
vector.c: M0 = V832(vector_shuffle(V328(M0), interleave_bytes.v8));
vector.c: ^~~~
vector.c: vector.c:384:13: note: in expansion of macro 'vector_shuffle'
vector.c: M0 = V832(vector_shuffle(V328(M0), interleave_bytes.v8));
vector.c: ^~~~~~~~~~~~~~
vector.c: vector.c:384:3: error: can't convert a value of type 'int' to vector type '__vector(8) short int' which has different size
vector.c: M0 = V832(vector_shuffle(V328(M0), interleave_bytes.v8));
vector.c: ^~
vector.c: vector.c:385:3: error: can't convert a value of type 'int' to vector type '__vector(8) short int' which has different size
vector.c: M1 = V832(vector_shuffle(V328(M1), interleave_bytes.v8));
vector.c: ^~
vector.c: vector.c:386:3: error: can't convert a value of type 'int' to vector type '__vector(8) short int' which has different size
vector.c: M2 = V832(vector_shuffle(V328(M2), interleave_bytes.v8));
vector.c: ...

Number of similar (compiler,implementation) pairs: 4, namely:
CompilerImplementations
gcc -march=native -mtune=native -O2 -fomit-frame-pointer -fwrapv -fPIC -fPIE vect128
gcc -march=native -mtune=native -O3 -fomit-frame-pointer -fwrapv -fPIC -fPIE vect128
gcc -march=native -mtune=native -O -fomit-frame-pointer -fwrapv -fPIC -fPIE vect128
gcc -march=native -mtune=native -Os -fomit-frame-pointer -fwrapv -fPIC -fPIE vect128

Compiler output

Implementation: vect128-mmxhack
Security model: unknown
Compiler: clang -march=native -O2 -fomit-frame-pointer -fwrapv -Qunused-arguments -fPIC -fPIE
vector.c: vector.c:203:8: error: use of unknown builtin '__builtin_ia32_pshufd' [-Wimplicit-function-declaration]
vector.c: M0 = v32_shufrot(M0,1);
vector.c: ^
vector.c: ./vector.h:151:26: note: expanded from macro 'v32_shufrot'
vector.c: #define v32_shufrot(x,s) v32_shuf(x,XCAT(SHUFROT_,s))
vector.c: ^
vector.c: ./vector.h:140:18: note: expanded from macro 'v32_shuf'
vector.c: #define v32_shuf __builtin_ia32_pshufd
vector.c: ^
vector.c: vector.c:203:8: note: did you mean '__builtin_ia32_psubd'?
vector.c: ./vector.h:151:26: note: expanded from macro 'v32_shufrot'
vector.c: #define v32_shufrot(x,s) v32_shuf(x,XCAT(SHUFROT_,s))
vector.c: ^
vector.c: ./vector.h:140:18: note: expanded from macro 'v32_shuf'
vector.c: #define v32_shuf __builtin_ia32_pshufd
vector.c: ^
vector.c: /usr/lib/llvm-6.0/lib/clang/6.0.0/include/mmintrin.h:560:19: note: '__builtin_ia32_psubd' declared here
vector.c: return (__m64)__builtin_ia32_psubd((__v2si)__m1, (__v2si)__m2);
vector.c: ^
vector.c: vector.c:203:6: error: assigning to 'v32' (aka 'v4si') from incompatible type 'int'
vector.c: M0 = v32_shufrot(M0,1);
vector.c: ^ ~~~~~~~~~~~~~~~~~
vector.c: vector.c:205:6: error: assigning to 'v32' (aka 'v4si') from incompatible type 'int'
vector.c: M0 = v32_shufrot(M0,1);
vector.c: ^ ~~~~~~~~~~~~~~~~~
vector.c: ...

Number of similar (compiler,implementation) pairs: 5, namely:
CompilerImplementations
clang -march=native -O2 -fomit-frame-pointer -fwrapv -Qunused-arguments -fPIC -fPIE vect128-mmxhack
clang -march=native -O3 -fomit-frame-pointer -fwrapv -Qunused-arguments -fPIC -fPIE vect128-mmxhack
clang -march=native -O -fomit-frame-pointer -fwrapv -Qunused-arguments -fPIC -fPIE vect128-mmxhack
clang -march=native -Os -fomit-frame-pointer -fwrapv -Qunused-arguments -fPIC -fPIE vect128-mmxhack
clang -mcpu=native -O3 -fomit-frame-pointer -fwrapv -Qunused-arguments -fPIC -fPIE vect128-mmxhack

Compiler output

Implementation: vect128-mmxhack
Security model: unknown
Compiler: gcc -march=native -mtune=native -O2 -fomit-frame-pointer -fwrapv -fPIC -fPIE
vector.c: In file included from vector.c:7:0:
vector.c: vector.c: In function 'round256':
vector.c: vector.h:83:29: warning: implicit declaration of function '__builtin_ia32_pshufb128'; did you mean '__builtin_ia32_psubb128'? [-Wimplicit-function-declaration]
vector.c: #define vector_shuffle(x,s) __builtin_ia32_pshufb128(x, s)
vector.c: ^
vector.c: vector.h:59:26: note: in definition of macro 'V1632'
vector.c: #define V1632(x) ((v32) (x))
vector.c: ^
vector.c: vector.h:1006:24: note: in expansion of macro 'V816'
vector.c: #define V832(x) V1632(V816(x))
vector.c: ^~~~
vector.c: vector.h:190:22: note: in expansion of macro 'V832'
vector.c: #define v32_lswap(x) V832(vector_shuffle(V328(x), v32_swap_endianness))
vector.c: ^~~~
vector.c: vector.h:190:27: note: in expansion of macro 'vector_shuffle'
vector.c: #define v32_lswap(x) V832(vector_shuffle(V328(x), v32_swap_endianness))
vector.c: ^~~~~~~~~~~~~~
vector.c: vector.c:162:12: note: in expansion of macro 'v32_lswap'
vector.c: v32 M0 = v32_lswap(MM[0]), M1 = v32_lswap(MM[1]),
vector.c: ^~~~~~~~~
vector.c: vector.c:162:3: error: can't convert a value of type 'int' to vector type '__vector(8) short int' which has different size
vector.c: v32 M0 = v32_lswap(MM[0]), M1 = v32_lswap(MM[1]),
vector.c: ^~~
vector.c: vector.c:162:3: error: can't convert a value of type 'int' to vector type '__vector(8) short int' which has different size
vector.c: vector.c:163:5: error: can't convert a value of type 'int' to vector type '__vector(8) short int' which has different size
vector.c: ...

Number of similar (compiler,implementation) pairs: 4, namely:
CompilerImplementations
gcc -march=native -mtune=native -O2 -fomit-frame-pointer -fwrapv -fPIC -fPIE vect128-mmxhack
gcc -march=native -mtune=native -O3 -fomit-frame-pointer -fwrapv -fPIC -fPIE vect128-mmxhack
gcc -march=native -mtune=native -O -fomit-frame-pointer -fwrapv -fPIC -fPIE vect128-mmxhack
gcc -march=native -mtune=native -Os -fomit-frame-pointer -fwrapv -fPIC -fPIE vect128-mmxhack

Compiler output

Implementation: xop
Security model: unknown
Compiler: clang -march=native -O2 -fomit-frame-pointer -fwrapv -Qunused-arguments -fPIC -fPIE
hash.c: hash.c:93:22: error: always_inline function '_mm_shuffle_epi8' requires target feature 'ssse3', but would be inlined into function 'blake256_compress' that is compiled without support for 'ssse3'
hash.c: const __m128i m0 = _mm_shuffle_epi8(LOADU(datablock + 00), u8to32);
hash.c: ^
hash.c: hash.c:94:22: error: always_inline function '_mm_shuffle_epi8' requires target feature 'ssse3', but would be inlined into function 'blake256_compress' that is compiled without support for 'ssse3'
hash.c: const __m128i m1 = _mm_shuffle_epi8(LOADU(datablock + 16), u8to32);
hash.c: ^
hash.c: hash.c:95:22: error: always_inline function '_mm_shuffle_epi8' requires target feature 'ssse3', but would be inlined into function 'blake256_compress' that is compiled without support for 'ssse3'
hash.c: const __m128i m2 = _mm_shuffle_epi8(LOADU(datablock + 32), u8to32);
hash.c: ^
hash.c: hash.c:96:22: error: always_inline function '_mm_shuffle_epi8' requires target feature 'ssse3', but would be inlined into function 'blake256_compress' that is compiled without support for 'ssse3'
hash.c: const __m128i m3 = _mm_shuffle_epi8(LOADU(datablock + 48), u8to32);
hash.c: ^
hash.c: hash.c:115:3: error: always_inline function '_mm_perm_epi8' requires target feature 'fma4', but would be inlined into function 'blake256_compress' that is compiled without support for 'fma4'
hash.c: ROUND( 0);
hash.c: ^
hash.c: ./rounds.h:51:3: note: expanded from macro 'ROUND'
hash.c: LOAD_MSG_ ##r ##_1(buf1); \
hash.c: ^
hash.c: <scratch space>:393:1: note: expanded from here
hash.c: LOAD_MSG_0_1
hash.c: ^
hash.c: ./load.xop.h:19:6: note: expanded from macro 'LOAD_MSG_0_1'
hash.c: s0 = _mm_perm_epi8(m0, m1, _mm_set_epi32(TOB(6),TOB(4),TOB(2),TOB(0)) ); \
hash.c: ^
hash.c: hash.c:115:3: error: '__builtin_ia32_vprotdi' needs target feature xop
hash.c: ...

Number of similar (compiler,implementation) pairs: 3, namely:
CompilerImplementations
clang -march=native -O2 -fomit-frame-pointer -fwrapv -Qunused-arguments -fPIC -fPIE xop
clang -march=native -O3 -fomit-frame-pointer -fwrapv -Qunused-arguments -fPIC -fPIE xop
clang -march=native -O -fomit-frame-pointer -fwrapv -Qunused-arguments -fPIC -fPIE xop

Compiler output

Implementation: xop
Security model: unknown
Compiler: clang -march=native -Os -fomit-frame-pointer -fwrapv -Qunused-arguments -fPIC -fPIE
hash.c: hash.c:93:22: error: always_inline function '_mm_shuffle_epi8' requires target feature 'ssse3', but would be inlined into function 'blake256_compress' that is compiled without support for 'ssse3'
hash.c: const __m128i m0 = _mm_shuffle_epi8(LOADU(datablock + 00), u8to32);
hash.c: ^
hash.c: hash.c:94:22: error: always_inline function '_mm_shuffle_epi8' requires target feature 'ssse3', but would be inlined into function 'blake256_compress' that is compiled without support for 'ssse3'
hash.c: const __m128i m1 = _mm_shuffle_epi8(LOADU(datablock + 16), u8to32);
hash.c: ^
hash.c: hash.c:95:22: error: always_inline function '_mm_shuffle_epi8' requires target feature 'ssse3', but would be inlined into function 'blake256_compress' that is compiled without support for 'ssse3'
hash.c: const __m128i m2 = _mm_shuffle_epi8(LOADU(datablock + 32), u8to32);
hash.c: ^
hash.c: hash.c:96:22: error: always_inline function '_mm_shuffle_epi8' requires target feature 'ssse3', but would be inlined into function 'blake256_compress' that is compiled without support for 'ssse3'
hash.c: const __m128i m3 = _mm_shuffle_epi8(LOADU(datablock + 48), u8to32);
hash.c: ^
hash.c: hash.c:115:3: error: always_inline function '_mm_perm_epi8' requires target feature 'fma4', but would be inlined into function 'blake256_compress' that is compiled without support for 'fma4'
hash.c: ROUND( 0);
hash.c: ^
hash.c: ./rounds.h:51:3: note: expanded from macro 'ROUND'
hash.c: LOAD_MSG_ ##r ##_1(buf1); \
hash.c: ^
hash.c: <scratch space>:388:1: note: expanded from here
hash.c: LOAD_MSG_0_1
hash.c: ^
hash.c: ./load.xop.h:19:6: note: expanded from macro 'LOAD_MSG_0_1'
hash.c: s0 = _mm_perm_epi8(m0, m1, _mm_set_epi32(TOB(6),TOB(4),TOB(2),TOB(0)) ); \
hash.c: ^
hash.c: hash.c:115:3: error: '__builtin_ia32_vprotdi' needs target feature xop
hash.c: ...

Number of similar (compiler,implementation) pairs: 1, namely:
CompilerImplementations
clang -march=native -Os -fomit-frame-pointer -fwrapv -Qunused-arguments -fPIC -fPIE xop

Compiler output

Implementation: xop
Security model: unknown
Compiler: clang -mcpu=native -O3 -fomit-frame-pointer -fwrapv -Qunused-arguments -fPIC -fPIE
hash.c: hash.c:93:22: error: always_inline function '_mm_shuffle_epi8' requires target feature 'ssse3', but would be inlined into function 'blake256_compress' that is compiled without support for 'ssse3'
hash.c: const __m128i m0 = _mm_shuffle_epi8(LOADU(datablock + 00), u8to32);
hash.c: ^
hash.c: hash.c:94:22: error: always_inline function '_mm_shuffle_epi8' requires target feature 'ssse3', but would be inlined into function 'blake256_compress' that is compiled without support for 'ssse3'
hash.c: const __m128i m1 = _mm_shuffle_epi8(LOADU(datablock + 16), u8to32);
hash.c: ^
hash.c: hash.c:95:22: error: always_inline function '_mm_shuffle_epi8' requires target feature 'ssse3', but would be inlined into function 'blake256_compress' that is compiled without support for 'ssse3'
hash.c: const __m128i m2 = _mm_shuffle_epi8(LOADU(datablock + 32), u8to32);
hash.c: ^
hash.c: hash.c:96:22: error: always_inline function '_mm_shuffle_epi8' requires target feature 'ssse3', but would be inlined into function 'blake256_compress' that is compiled without support for 'ssse3'
hash.c: const __m128i m3 = _mm_shuffle_epi8(LOADU(datablock + 48), u8to32);
hash.c: ^
hash.c: hash.c:115:3: error: always_inline function '_mm_perm_epi8' requires target feature 'sse4a', but would be inlined into function 'blake256_compress' that is compiled without support for 'sse4a'
hash.c: ROUND( 0);
hash.c: ^
hash.c: ./rounds.h:51:3: note: expanded from macro 'ROUND'
hash.c: LOAD_MSG_ ##r ##_1(buf1); \
hash.c: ^
hash.c: <scratch space>:393:1: note: expanded from here
hash.c: LOAD_MSG_0_1
hash.c: ^
hash.c: ./load.xop.h:19:6: note: expanded from macro 'LOAD_MSG_0_1'
hash.c: s0 = _mm_perm_epi8(m0, m1, _mm_set_epi32(TOB(6),TOB(4),TOB(2),TOB(0)) ); \
hash.c: ^
hash.c: hash.c:115:3: error: '__builtin_ia32_vprotdi' needs target feature xop
hash.c: ...

Number of similar (compiler,implementation) pairs: 1, namely:
CompilerImplementations
clang -mcpu=native -O3 -fomit-frame-pointer -fwrapv -Qunused-arguments -fPIC -fPIE xop

Namespace violations

Implementation: sphlib
Security model: unknown
Compiler: clang -march=native -O2 -fomit-frame-pointer -fwrapv -Qunused-arguments -fPIC -fPIE
blake.o sph_blake224 T
blake.o sph_blake224_addbits_and_close T
blake.o sph_blake224_close T
blake.o sph_blake224_init T
blake.o sph_blake256 T
blake.o sph_blake256_addbits_and_close T
blake.o sph_blake256_close T
blake.o sph_blake256_init T
blake.o sph_blake384 T
blake.o sph_blake384_addbits_and_close T
blake.o sph_blake384_close T
blake.o sph_blake384_init T
blake.o sph_blake512 T
blake.o sph_blake512_addbits_and_close T
blake.o sph_blake512_close T
blake.o sph_blake512_init T

Number of similar (compiler,implementation) pairs: 18, namely:
CompilerImplementations
clang -march=native -O2 -fomit-frame-pointer -fwrapv -Qunused-arguments -fPIC -fPIE sphlib
clang -march=native -O3 -fomit-frame-pointer -fwrapv -Qunused-arguments -fPIC -fPIE sphlib
clang -march=native -O -fomit-frame-pointer -fwrapv -Qunused-arguments -fPIC -fPIE sphlib
clang -march=native -Os -fomit-frame-pointer -fwrapv -Qunused-arguments -fPIC -fPIE sphlib
clang -mcpu=native -O3 -fomit-frame-pointer -fwrapv -Qunused-arguments -fPIC -fPIE sphlib
gcc -march=native -mtune=native -O2 -fomit-frame-pointer -fwrapv -fPIC -fPIE sphlib
gcc -march=native -mtune=native -O3 -fomit-frame-pointer -fwrapv -fPIC -fPIE sphlib
gcc -march=native -mtune=native -O -fomit-frame-pointer -fwrapv -fPIC -fPIE sphlib
gcc -march=native -mtune=native -Os -fomit-frame-pointer -fwrapv -fPIC -fPIE sphlib
clang -march=native -O2 -fomit-frame-pointer -fwrapv -Qunused-arguments -fPIC -fPIE sphlib-small
clang -march=native -O3 -fomit-frame-pointer -fwrapv -Qunused-arguments -fPIC -fPIE sphlib-small
clang -march=native -O -fomit-frame-pointer -fwrapv -Qunused-arguments -fPIC -fPIE sphlib-small
clang -march=native -Os -fomit-frame-pointer -fwrapv -Qunused-arguments -fPIC -fPIE sphlib-small
clang -mcpu=native -O3 -fomit-frame-pointer -fwrapv -Qunused-arguments -fPIC -fPIE sphlib-small
gcc -march=native -mtune=native -O2 -fomit-frame-pointer -fwrapv -fPIC -fPIE sphlib-small
gcc -march=native -mtune=native -O3 -fomit-frame-pointer -fwrapv -fPIC -fPIE sphlib-small
gcc -march=native -mtune=native -O -fomit-frame-pointer -fwrapv -fPIC -fPIE sphlib-small
gcc -march=native -mtune=native -Os -fomit-frame-pointer -fwrapv -fPIC -fPIE sphlib-small