Implementation notes: amd64, hydra5, crypto_aead/kiasuneq128v1

Computer: hydra5
Microarchitecture: amd64; K10 32nm (300f10)
Architecture: amd64
CPU ID: AuthenticAMD-00300f10-178bfbff
SUPERCOP version: 20240425
Operation: crypto_aead
Primitive: kiasuneq128v1
TimeObject sizeTest sizeImplementationCompilerBenchmark dateSUPERCOP version
21332821906 0 038916 812 1088T:refgcc_-march=native_-mtune=native_-O3_-fomit-frame-pointer_-fwrapv_-fPIC_-fPIE2024042820240425
23115619791 0 036184 860 1024T:refclang_-mcpu=native_-O3_-fomit-frame-pointer_-fwrapv_-Qunused-arguments_-fPIC_-fPIE2024042820240425
23158019791 0 036184 860 1024T:refclang_-march=native_-O3_-fomit-frame-pointer_-fwrapv_-Qunused-arguments_-fPIC_-fPIE2024042820240425
23501719007 0 034528 860 1024T:refclang_-march=native_-O2_-fomit-frame-pointer_-fwrapv_-Qunused-arguments_-fPIC_-fPIE2024042820240425
23996020946 0 036652 812 1088T:refgcc_-march=native_-mtune=native_-O2_-fomit-frame-pointer_-fwrapv_-fPIC_-fPIE2024042820240425
24225719232 0 032410 852 1024T:refclang_-march=native_-Os_-fomit-frame-pointer_-fwrapv_-Qunused-arguments_-fPIC_-fPIE2024042820240425
26040819362 0 032943 788 1056T:refgcc_-march=native_-mtune=native_-Os_-fomit-frame-pointer_-fwrapv_-fPIC_-fPIE2024042820240425
27160820045 0 034932 812 1088T:refgcc_-march=native_-mtune=native_-O_-fomit-frame-pointer_-fwrapv_-fPIC_-fPIE2024042820240425
28125619195 0 033216 860 1024T:refclang_-march=native_-O_-fomit-frame-pointer_-fwrapv_-Qunused-arguments_-fPIC_-fPIE2024042820240425

Compiler output

Implementation: T:bitslice
Security model: timingleaks
Compiler: clang -march=native -O2 -fomit-frame-pointer -fwrapv -Qunused-arguments -fPIC -fPIE
try.c: /usr/bin/ld: libcrypto_aead_kiasuneq128v1.a(aes_tweaked.o): relocation R_X86_64_32S against symbol `M0' can not be used when making a PIE object; recompile with -fPIE
try.c: /usr/bin/ld: failed to set dynamic section sizes: bad value
try.c: clang: error: linker command failed with exit code 1 (use -v to see invocation)

Number of similar (compiler,implementation) pairs: 5, namely:
CompilerImplementations
clang -march=native -O2 -fomit-frame-pointer -fwrapv -Qunused-arguments -fPIC -fPIE T:bitslice
clang -march=native -O3 -fomit-frame-pointer -fwrapv -Qunused-arguments -fPIC -fPIE T:bitslice
clang -march=native -O -fomit-frame-pointer -fwrapv -Qunused-arguments -fPIC -fPIE T:bitslice
clang -march=native -Os -fomit-frame-pointer -fwrapv -Qunused-arguments -fPIC -fPIE T:bitslice
clang -mcpu=native -O3 -fomit-frame-pointer -fwrapv -Qunused-arguments -fPIC -fPIE T:bitslice

Compiler output

Implementation: T:bitslice
Security model: timingleaks
Compiler: gcc -march=native -mtune=native -O2 -fomit-frame-pointer -fwrapv -fPIC -fPIE
try.c: /usr/bin/ld: libcrypto_aead_kiasuneq128v1.a(aes_tweaked.o): relocation R_X86_64_32S against symbol `M0' can not be used when making a PIE object; recompile with -fPIE
try.c: /usr/bin/ld: failed to set dynamic section sizes: bad value
try.c: collect2: error: ld returned 1 exit status

Number of similar (compiler,implementation) pairs: 4, namely:
CompilerImplementations
gcc -march=native -mtune=native -O2 -fomit-frame-pointer -fwrapv -fPIC -fPIE T:bitslice
gcc -march=native -mtune=native -O3 -fomit-frame-pointer -fwrapv -fPIC -fPIE T:bitslice
gcc -march=native -mtune=native -O -fomit-frame-pointer -fwrapv -fPIC -fPIE T:bitslice
gcc -march=native -mtune=native -Os -fomit-frame-pointer -fwrapv -fPIC -fPIE T:bitslice

Compiler output

Implementation: T:opt
Security model: timingleaks
Compiler: clang -march=native -O2 -fomit-frame-pointer -fwrapv -Qunused-arguments -fPIC -fPIE
kiasu.c: kiasu.c:91:50: warning: implicit conversion from 'int' to 'char' changes value from 192 to -64 [-Wconstant-conversion]
kiasu.c: const __m128i MSB_AD_LAST = constant8( (0x6<<5),0x00,0x00,0x00, 0x00,0x00,0x00,0x00, 0x00,0x00,0x00,0x00, 0x00,0x00,0x00,0x00 );
kiasu.c: ~~~~~~~~~~~~~~~^~~~~~~~~~~~~~~~~~~~~~~~~~~~~~~~~~~~~~~~~~~~~~~~~~~~~~~~~~~~~~~~~~~~~~~~~~~~~~~~~~~~
kiasu.c: ./aes_ni.macros:13:171: note: expanded from macro 'constant8'
kiasu.c: #define constant8(b15,b14,b13,b12,b11,b10,b9,b8,b7,b6,b5,b4,b3,b2,b1,b0) _mm_set_epi8 ((b0),(b1),(b2),(b3),(b4),(b5),(b6),(b7),(b8),(b9),(b10),(b11),(b12),(b13),(b14),(b15))
kiasu.c: ~~~~~~~~~~~~ ^~~
kiasu.c: kiasu.c:94:56: warning: implicit conversion from 'int' to 'char' changes value from 128 to -128 [-Wconstant-conversion]
kiasu.c: const __m128i MSB_M_LAST_NONZERO = constant8( (0x4<<5),0x00,0x00,0x00, 0x00,0x00,0x00,0x00, 0x00,0x00,0x00,0x00, 0x00,0x00,0x00,0x00 );
kiasu.c: ~~~~~~~~~~~~~~~^~~~~~~~~~~~~~~~~~~~~~~~~~~~~~~~~~~~~~~~~~~~~~~~~~~~~~~~~~~~~~~~~~~~~~~~~~~~~~~~~~~~
kiasu.c: ./aes_ni.macros:13:171: note: expanded from macro 'constant8'
kiasu.c: #define constant8(b15,b14,b13,b12,b11,b10,b9,b8,b7,b6,b5,b4,b3,b2,b1,b0) _mm_set_epi8 ((b0),(b1),(b2),(b3),(b4),(b5),(b6),(b7),(b8),(b9),(b10),(b11),(b12),(b13),(b14),(b15))
kiasu.c: ~~~~~~~~~~~~ ^~~
kiasu.c: kiasu.c:95:49: warning: implicit conversion from 'int' to 'char' changes value from 160 to -96 [-Wconstant-conversion]
kiasu.c: const __m128i MSB_CHKSUM = constant8( (0x5<<5),0x00,0x00,0x00, 0x00,0x00,0x00,0x00, 0x00,0x00,0x00,0x00, 0x00,0x00,0x00,0x00 );
kiasu.c: ~~~~~~~~~~~~~~~^~~~~~~~~~~~~~~~~~~~~~~~~~~~~~~~~~~~~~~~~~~~~~~~~~~~~~~~~~~~~~~~~~~~~~~~~~~~~~~~~~~~
kiasu.c: ./aes_ni.macros:13:171: note: expanded from macro 'constant8'
kiasu.c: #define constant8(b15,b14,b13,b12,b11,b10,b9,b8,b7,b6,b5,b4,b3,b2,b1,b0) _mm_set_epi8 ((b0),(b1),(b2),(b3),(b4),(b5),(b6),(b7),(b8),(b9),(b10),(b11),(b12),(b13),(b14),(b15))
kiasu.c: ~~~~~~~~~~~~ ^~~
kiasu.c: kiasu.c:130:4: error: always_inline function '_mm_aesenc_si128' requires target feature 'aes', but would be inlined into function 'kiasu_aead_encrypt' that is compiled without support for 'aes'
kiasu.c: AES( State, subkeys, Tweak );
kiasu.c: ^
kiasu.c: ./aes_ni.macros:21:5: note: expanded from macro 'AES'
kiasu.c: s = enc( s , xor( subkeys[1] , tw ) );\
kiasu.c: ^
kiasu.c: ./aes_ni.macros:1:18: note: expanded from macro 'enc'
kiasu.c: ...

Number of similar (compiler,implementation) pairs: 5, namely:
CompilerImplementations
clang -march=native -O2 -fomit-frame-pointer -fwrapv -Qunused-arguments -fPIC -fPIE T:opt
clang -march=native -O3 -fomit-frame-pointer -fwrapv -Qunused-arguments -fPIC -fPIE T:opt
clang -march=native -O -fomit-frame-pointer -fwrapv -Qunused-arguments -fPIC -fPIE T:opt
clang -march=native -Os -fomit-frame-pointer -fwrapv -Qunused-arguments -fPIC -fPIE T:opt
clang -mcpu=native -O3 -fomit-frame-pointer -fwrapv -Qunused-arguments -fPIC -fPIE T:opt

Compiler output

Implementation: T:opt
Security model: timingleaks
Compiler: gcc -march=native -mtune=native -O2 -fomit-frame-pointer -fwrapv -fPIC -fPIE
kiasu.c: In file included from kiasu.c:28:
kiasu.c: kiasu.c: In function 'set_encryption_key':
kiasu.c: /usr/lib/gcc/x86_64-linux-gnu/11/include/wmmintrin.h:87:1: error: inlining failed in call to 'always_inline' '_mm_aeskeygenassist_si128': target specific option mismatch
kiasu.c: 87 | _mm_aeskeygenassist_si128 (__m128i __X, const int __C)
kiasu.c: | ^~~~~~~~~~~~~~~~~~~~~~~~~
kiasu.c: kiasu.c:55:19: note: called from here
kiasu.c: 55 | subkeys[10] = assist128(subkeys[9], _mm_aeskeygenassist_si128(subkeys[9],0x36));
kiasu.c: | ^~~~~~~~~~~~~~~~~~~~~~~~~~~~~~~~~~~~~~~~~~~~~~~~~~~~~~~~~~~~~~~~~
kiasu.c: In file included from kiasu.c:28:
kiasu.c: /usr/lib/gcc/x86_64-linux-gnu/11/include/wmmintrin.h:87:1: error: inlining failed in call to 'always_inline' '_mm_aeskeygenassist_si128': target specific option mismatch
kiasu.c: 87 | _mm_aeskeygenassist_si128 (__m128i __X, const int __C)
kiasu.c: | ^~~~~~~~~~~~~~~~~~~~~~~~~
kiasu.c: kiasu.c:54:19: note: called from here
kiasu.c: 54 | subkeys[ 9] = assist128(subkeys[8], _mm_aeskeygenassist_si128(subkeys[8],0x1b));
kiasu.c: | ^~~~~~~~~~~~~~~~~~~~~~~~~~~~~~~~~~~~~~~~~~~~~~~~~~~~~~~~~~~~~~~~~
kiasu.c: In file included from kiasu.c:28:
kiasu.c: /usr/lib/gcc/x86_64-linux-gnu/11/include/wmmintrin.h:87:1: error: inlining failed in call to 'always_inline' '_mm_aeskeygenassist_si128': target specific option mismatch
kiasu.c: 87 | _mm_aeskeygenassist_si128 (__m128i __X, const int __C)
kiasu.c: | ^~~~~~~~~~~~~~~~~~~~~~~~~
kiasu.c: kiasu.c:53:19: note: called from here
kiasu.c: 53 | subkeys[ 8] = assist128(subkeys[7], _mm_aeskeygenassist_si128(subkeys[7],0x80));
kiasu.c: | ^~~~~~~~~~~~~~~~~~~~~~~~~~~~~~~~~~~~~~~~~~~~~~~~~~~~~~~~~~~~~~~~~
kiasu.c: In file included from kiasu.c:28:
kiasu.c: /usr/lib/gcc/x86_64-linux-gnu/11/include/wmmintrin.h:87:1: error: inlining failed in call to 'always_inline' '_mm_aeskeygenassist_si128': target specific option mismatch
kiasu.c: 87 | _mm_aeskeygenassist_si128 (__m128i __X, const int __C)
kiasu.c: ...

Number of similar (compiler,implementation) pairs: 4, namely:
CompilerImplementations
gcc -march=native -mtune=native -O2 -fomit-frame-pointer -fwrapv -fPIC -fPIE T:opt
gcc -march=native -mtune=native -O3 -fomit-frame-pointer -fwrapv -fPIC -fPIE T:opt
gcc -march=native -mtune=native -O -fomit-frame-pointer -fwrapv -fPIC -fPIE T:opt
gcc -march=native -mtune=native -Os -fomit-frame-pointer -fwrapv -fPIC -fPIE T:opt