Implementation notes: amd64, hydra5, crypto_aead/aes128gcmv1

Computer: hydra5
Architecture: amd64
CPU ID: AuthenticAMD-00300f10-178bfbff
SUPERCOP version: 20191221
Operation: crypto_aead
Primitive: aes128gcmv1
TimeObject sizeTest sizeImplementationCompilerBenchmark dateSUPERCOP version
38792763077 0 1626463 776 880refclang_-march=native_-O_-fomit-frame-pointer_-fwrapv_-Qunused-arguments_-fPIC_-fPIE2019122120191221
38805473077 0 1627647 776 880refclang_-mcpu=native_-O3_-fomit-frame-pointer_-fwrapv_-Qunused-arguments_-fPIC_-fPIE2019122120191221
38805683077 0 1627647 776 880refclang_-march=native_-O3_-fomit-frame-pointer_-fwrapv_-Qunused-arguments_-fPIC_-fPIE2019122120191221
38808213077 0 1626463 776 880refclang_-march=native_-O2_-fomit-frame-pointer_-fwrapv_-Qunused-arguments_-fPIC_-fPIE2019122120191221
43987223508 0 1629454 776 944refgcc_-march=native_-mtune=native_-O3_-fomit-frame-pointer_-fwrapv_-fPIC_-fPIE2019122120191221
75339871585 0 1623165 768 880refclang_-march=native_-Os_-fomit-frame-pointer_-fwrapv_-Qunused-arguments_-fPIC_-fPIE2019122120191221
223894142462 0 1625909 768 944refgcc_-march=native_-mtune=native_-O2_-fomit-frame-pointer_-fwrapv_-fPIC_-fPIE2019122120191221
224781542312 0 1625205 768 944refgcc_-march=native_-mtune=native_-O_-fomit-frame-pointer_-fwrapv_-fPIC_-fPIE2019122120191221
225805881923 0 1623561 752 912refgcc_-march=native_-mtune=native_-Os_-fomit-frame-pointer_-fwrapv_-fPIC_-fPIE2019122120191221

Compiler output

Implementation: dolbeau/aesenc-int
Security model: unknown
Compiler: clang -march=native -O2 -fomit-frame-pointer -fwrapv -Qunused-arguments -fPIC -fPIE
aesenc-int.c: aesenc-int.c:40:34: warning: incompatible pointer types passing 'const unsigned int *' to parameter of type 'const __m128i *' [-Wincompatible-pointer-types]
aesenc-int.c: __m128i key0 = _mm_loadu_si128((const unsigned int *)(key+0));
aesenc-int.c: ^~~~~~~~~~~~~~~~~~~~~~~~~~~~~
aesenc-int.c: /usr/lib/llvm-6.0/lib/clang/6.0.0/include/emmintrin.h:3561:32: note: passing argument to parameter '__p' here
aesenc-int.c: _mm_loadu_si128(__m128i const *__p)
aesenc-int.c: ^
aesenc-int.c: aesenc-int.c:643:16: error: always_inline function '_mm_shuffle_epi8' requires target feature 'ssse3', but would be inlined into function 'crypto_aead_aes128gcmv1_dolbeau_aesenc_int_encrypt' that is compiled without support for 'ssse3'
aesenc-int.c: __m128i Hv = _mm_shuffle_epi8(_mm_load_si128((const __m128i*)H), rev);
aesenc-int.c: ^
aesenc-int.c: 1 warning and 1 error generated.

Number of similar (compiler,implementation) pairs: 5, namely:
CompilerImplementations
clang -march=native -O2 -fomit-frame-pointer -fwrapv -Qunused-arguments -fPIC -fPIE dolbeau/aesenc-int
clang -march=native -O3 -fomit-frame-pointer -fwrapv -Qunused-arguments -fPIC -fPIE dolbeau/aesenc-int
clang -march=native -O -fomit-frame-pointer -fwrapv -Qunused-arguments -fPIC -fPIE dolbeau/aesenc-int
clang -march=native -Os -fomit-frame-pointer -fwrapv -Qunused-arguments -fPIC -fPIE dolbeau/aesenc-int
clang -mcpu=native -O3 -fomit-frame-pointer -fwrapv -Qunused-arguments -fPIC -fPIE dolbeau/aesenc-int

Compiler output

Implementation: dolbeau/aesenc-int
Security model: unknown
Compiler: gcc -march=native -mtune=native -O2 -fomit-frame-pointer -fwrapv -fPIC -fPIE
aesenc-int.c: aesenc-int.c: In function 'aesni_key128_expand':
aesenc-int.c: aesenc-int.c:40:34: warning: passing argument 1 of '_mm_loadu_si128' from incompatible pointer type [-Wincompatible-pointer-types]
aesenc-int.c: __m128i key0 = _mm_loadu_si128((const unsigned int *)(key+0));
aesenc-int.c: ^
aesenc-int.c: In file included from /usr/lib/gcc/x86_64-linux-gnu/7/include/xmmintrin.h:1252:0,
aesenc-int.c: from /usr/lib/gcc/x86_64-linux-gnu/7/include/immintrin.h:29,
aesenc-int.c: from aesenc-int.c:11:
aesenc-int.c: /usr/lib/gcc/x86_64-linux-gnu/7/include/emmintrin.h:701:1: note: expected 'const __vector(2) long long int *' but argument is of type 'const unsigned int *'
aesenc-int.c: _mm_loadu_si128 (__m128i_u const *__P)
aesenc-int.c: ^~~~~~~~~~~~~~~
aesenc-int.c: In file included from /usr/lib/gcc/x86_64-linux-gnu/7/include/immintrin.h:39:0,
aesenc-int.c: from aesenc-int.c:11:
aesenc-int.c: /usr/lib/gcc/x86_64-linux-gnu/7/include/wmmintrin.h:87:1: error: inlining failed in call to always_inline '_mm_aeskeygenassist_si128': target specific option mismatch
aesenc-int.c: _mm_aeskeygenassist_si128 (__m128i __X, const int __C)
aesenc-int.c: ^~~~~~~~~~~~~~~~~~~~~~~~~
aesenc-int.c: aesenc-int.c:48:9: note: called from here
aesenc-int.c: temp1 = _mm_aeskeygenassist_si128(temp0, IMM); \
aesenc-int.c: ~~~~~~^~~~~~~~~~~~~~~~~~~~~~~~~~~~~~~~~~~~~~~
aesenc-int.c: aesenc-int.c:67:3: note: in expansion of macro 'BLOCK1'
aesenc-int.c: BLOCK1(0x36);
aesenc-int.c: ^~~~~~
aesenc-int.c: In file included from /usr/lib/gcc/x86_64-linux-gnu/7/include/immintrin.h:39:0,
aesenc-int.c: from aesenc-int.c:11:
aesenc-int.c: /usr/lib/gcc/x86_64-linux-gnu/7/include/wmmintrin.h:87:1: error: inlining failed in call to always_inline '_mm_aeskeygenassist_si128': target specific option mismatch
aesenc-int.c: _mm_aeskeygenassist_si128 (__m128i __X, const int __C)
aesenc-int.c: ...

Number of similar (compiler,implementation) pairs: 4, namely:
CompilerImplementations
gcc -march=native -mtune=native -O2 -fomit-frame-pointer -fwrapv -fPIC -fPIE dolbeau/aesenc-int
gcc -march=native -mtune=native -O3 -fomit-frame-pointer -fwrapv -fPIC -fPIE dolbeau/aesenc-int
gcc -march=native -mtune=native -O -fomit-frame-pointer -fwrapv -fPIC -fPIE dolbeau/aesenc-int
gcc -march=native -mtune=native -Os -fomit-frame-pointer -fwrapv -fPIC -fPIE dolbeau/aesenc-int

Compiler output

Implementation: openssl
Security model: unknown
Compiler: clang -march=native -O2 -fomit-frame-pointer -fwrapv -Qunused-arguments -fPIC -fPIE
decrypt.c: decrypt.c:1:10: fatal error: 'openssl/evp.h' file not found
decrypt.c: #include <openssl/evp.h>
decrypt.c: ^~~~~~~~~~~~~~~
decrypt.c: 1 error generated.

Number of similar (compiler,implementation) pairs: 5, namely:
CompilerImplementations
clang -march=native -O2 -fomit-frame-pointer -fwrapv -Qunused-arguments -fPIC -fPIE openssl
clang -march=native -O3 -fomit-frame-pointer -fwrapv -Qunused-arguments -fPIC -fPIE openssl
clang -march=native -O -fomit-frame-pointer -fwrapv -Qunused-arguments -fPIC -fPIE openssl
clang -march=native -Os -fomit-frame-pointer -fwrapv -Qunused-arguments -fPIC -fPIE openssl
clang -mcpu=native -O3 -fomit-frame-pointer -fwrapv -Qunused-arguments -fPIC -fPIE openssl

Compiler output

Implementation: openssl
Security model: unknown
Compiler: gcc -march=native -mtune=native -O2 -fomit-frame-pointer -fwrapv -fPIC -fPIE
decrypt.c: decrypt.c:1:10: fatal error: openssl/evp.h: No such file or directory
decrypt.c: #include <openssl/evp.h>
decrypt.c: ^~~~~~~~~~~~~~~
decrypt.c: compilation terminated.

Number of similar (compiler,implementation) pairs: 4, namely:
CompilerImplementations
gcc -march=native -mtune=native -O2 -fomit-frame-pointer -fwrapv -fPIC -fPIE openssl
gcc -march=native -mtune=native -O3 -fomit-frame-pointer -fwrapv -fPIC -fPIE openssl
gcc -march=native -mtune=native -O -fomit-frame-pointer -fwrapv -fPIC -fPIE openssl
gcc -march=native -mtune=native -Os -fomit-frame-pointer -fwrapv -fPIC -fPIE openssl