Implementation notes: amd64, hydra5, crypto_aead/aegis256

Computer: hydra5
Architecture: amd64
CPU ID: AuthenticAMD-00300f10-178bfbff
SUPERCOP version: 20191221
Operation: crypto_aead
Primitive: aegis256
TimeObject sizeTest sizeImplementationCompilerBenchmark dateSUPERCOP version
910005514 4096 021276 4896 928refgcc_-march=native_-mtune=native_-O3_-fomit-frame-pointer_-fwrapv_-fPIC_-fPIE2019122120191221
911635191 4096 018131 4888 928refgcc_-march=native_-mtune=native_-O_-fomit-frame-pointer_-fwrapv_-fPIC_-fPIE2019122120191221
918335650 4096 018899 4888 928refgcc_-march=native_-mtune=native_-O2_-fomit-frame-pointer_-fwrapv_-fPIC_-fPIE2019122120191221

Compiler output

Implementation: aesni
Security model: unknown
Compiler: clang -march=native -O2 -fomit-frame-pointer -fwrapv -Qunused-arguments -fPIC -fPIE
encrypt.c: encrypt.c:42:25: error: always_inline function '_mm_aesenc_si128' requires target feature 'aes', but would be inlined into function 'aegis256_initialization' that is compiled without support for 'aes'
encrypt.c: state[5] = _mm_aesenc_si128(state[4],state[5]);
encrypt.c: ^
encrypt.c: encrypt.c:43:25: error: always_inline function '_mm_aesenc_si128' requires target feature 'aes', but would be inlined into function 'aegis256_initialization' that is compiled without support for 'aes'
encrypt.c: state[4] = _mm_aesenc_si128(state[3],state[4]);
encrypt.c: ^
encrypt.c: encrypt.c:44:25: error: always_inline function '_mm_aesenc_si128' requires target feature 'aes', but would be inlined into function 'aegis256_initialization' that is compiled without support for 'aes'
encrypt.c: state[3] = _mm_aesenc_si128(state[2],state[3]);
encrypt.c: ^
encrypt.c: encrypt.c:45:25: error: always_inline function '_mm_aesenc_si128' requires target feature 'aes', but would be inlined into function 'aegis256_initialization' that is compiled without support for 'aes'
encrypt.c: state[2] = _mm_aesenc_si128(state[1],state[2]);
encrypt.c: ^
encrypt.c: encrypt.c:46:25: error: always_inline function '_mm_aesenc_si128' requires target feature 'aes', but would be inlined into function 'aegis256_initialization' that is compiled without support for 'aes'
encrypt.c: state[1] = _mm_aesenc_si128(state[0],state[1]);
encrypt.c: ^
encrypt.c: encrypt.c:47:25: error: always_inline function '_mm_aesenc_si128' requires target feature 'aes', but would be inlined into function 'aegis256_initialization' that is compiled without support for 'aes'
encrypt.c: state[0] = _mm_aesenc_si128(tmp,state[0]);
encrypt.c: ^
encrypt.c: encrypt.c:56:25: error: always_inline function '_mm_aesenc_si128' requires target feature 'aes', but would be inlined into function 'aegis256_initialization' that is compiled without support for 'aes'
encrypt.c: state[5] = _mm_aesenc_si128(state[4],state[5]);
encrypt.c: ^
encrypt.c: encrypt.c:57:25: error: always_inline function '_mm_aesenc_si128' requires target feature 'aes', but would be inlined into function 'aegis256_initialization' that is compiled without support for 'aes'
encrypt.c: state[4] = _mm_aesenc_si128(state[3],state[4]);
encrypt.c: ^
encrypt.c: encrypt.c:58:25: error: always_inline function '_mm_aesenc_si128' requires target feature 'aes', but would be inlined into function 'aegis256_initialization' that is compiled without support for 'aes'
encrypt.c: ...

Number of similar (compiler,implementation) pairs: 5, namely:
CompilerImplementations
clang -march=native -O2 -fomit-frame-pointer -fwrapv -Qunused-arguments -fPIC -fPIE aesni
clang -march=native -O3 -fomit-frame-pointer -fwrapv -Qunused-arguments -fPIC -fPIE aesni
clang -march=native -O -fomit-frame-pointer -fwrapv -Qunused-arguments -fPIC -fPIE aesni
clang -march=native -Os -fomit-frame-pointer -fwrapv -Qunused-arguments -fPIC -fPIE aesni
clang -mcpu=native -O3 -fomit-frame-pointer -fwrapv -Qunused-arguments -fPIC -fPIE aesni

Compiler output

Implementation: aesni
Security model: unknown
Compiler: gcc -march=native -mtune=native -O2 -fomit-frame-pointer -fwrapv -fPIC -fPIE
encrypt.c: In file included from /usr/lib/gcc/x86_64-linux-gnu/7/include/immintrin.h:39:0,
encrypt.c: from encrypt.c:4:
encrypt.c: encrypt.c: In function 'aegis256_enc_aut_step':
encrypt.c: /usr/lib/gcc/x86_64-linux-gnu/7/include/wmmintrin.h:61:1: error: inlining failed in call to always_inline '_mm_aesenc_si128': target specific option mismatch
encrypt.c: _mm_aesenc_si128 (__m128i __X, __m128i __Y)
encrypt.c: ^~~~~~~~~~~~~~~~
encrypt.c: encrypt.c:132:20: note: called from here
encrypt.c: state[0] = _mm_aesenc_si128(tmp,state[0]);
encrypt.c: ^~~~~~~~~~~~~~~~~~~~~~~~~~~~~~
encrypt.c: In file included from /usr/lib/gcc/x86_64-linux-gnu/7/include/immintrin.h:39:0,
encrypt.c: from encrypt.c:4:
encrypt.c: /usr/lib/gcc/x86_64-linux-gnu/7/include/wmmintrin.h:61:1: error: inlining failed in call to always_inline '_mm_aesenc_si128': target specific option mismatch
encrypt.c: _mm_aesenc_si128 (__m128i __X, __m128i __Y)
encrypt.c: ^~~~~~~~~~~~~~~~
encrypt.c: encrypt.c:131:20: note: called from here
encrypt.c: state[1] = _mm_aesenc_si128(state[0],state[1]);
encrypt.c: ^~~~~~~~~~~~~~~~~~~~~~~~~~~~~~~~~~~
encrypt.c: In file included from /usr/lib/gcc/x86_64-linux-gnu/7/include/immintrin.h:39:0,
encrypt.c: from encrypt.c:4:
encrypt.c: /usr/lib/gcc/x86_64-linux-gnu/7/include/wmmintrin.h:61:1: error: inlining failed in call to always_inline '_mm_aesenc_si128': target specific option mismatch
encrypt.c: _mm_aesenc_si128 (__m128i __X, __m128i __Y)
encrypt.c: ^~~~~~~~~~~~~~~~
encrypt.c: encrypt.c:130:20: note: called from here
encrypt.c: state[2] = _mm_aesenc_si128(state[1],state[2]);
encrypt.c: ^~~~~~~~~~~~~~~~~~~~~~~~~~~~~~~~~~~
encrypt.c: ...

Number of similar (compiler,implementation) pairs: 4, namely:
CompilerImplementations
gcc -march=native -mtune=native -O2 -fomit-frame-pointer -fwrapv -fPIC -fPIE aesni
gcc -march=native -mtune=native -O3 -fomit-frame-pointer -fwrapv -fPIC -fPIE aesni
gcc -march=native -mtune=native -O -fomit-frame-pointer -fwrapv -fPIC -fPIE aesni
gcc -march=native -mtune=native -Os -fomit-frame-pointer -fwrapv -fPIC -fPIE aesni

Compiler output

Implementation: ref
Security model: unknown
Compiler: clang -march=native -O2 -fomit-frame-pointer -fwrapv -Qunused-arguments -fPIC -fPIE
try.c: crypto_aead_aegis256.a(encrypt.o): In function `crypto_aead_aegis256_ref_encrypt':
try.c: encrypt.c:(.text+0x...): undefined reference to `aegis256_initialization'
try.c: crypto_aead_aegis256.a(encrypt.o): In function `crypto_aead_aegis256_ref_decrypt':
try.c: encrypt.c:(.text+0x...): undefined reference to `aegis256_initialization'
try.c: clang: error: linker command failed with exit code 1 (use -v to see invocation)

Number of similar (compiler,implementation) pairs: 5, namely:
CompilerImplementations
clang -march=native -O2 -fomit-frame-pointer -fwrapv -Qunused-arguments -fPIC -fPIE ref
clang -march=native -O3 -fomit-frame-pointer -fwrapv -Qunused-arguments -fPIC -fPIE ref
clang -march=native -O -fomit-frame-pointer -fwrapv -Qunused-arguments -fPIC -fPIE ref
clang -march=native -Os -fomit-frame-pointer -fwrapv -Qunused-arguments -fPIC -fPIE ref
clang -mcpu=native -O3 -fomit-frame-pointer -fwrapv -Qunused-arguments -fPIC -fPIE ref

Compiler output

Implementation: ref
Security model: unknown
Compiler: gcc -march=native -mtune=native -Os -fomit-frame-pointer -fwrapv -fPIC -fPIE
try.c: crypto_aead_aegis256.a(encrypt.o): In function `crypto_aead_aegis256_ref_encrypt':
try.c: encrypt.c:(.text+0x...): undefined reference to `aegis256_initialization'
try.c: encrypt.c:(.text+0x...): undefined reference to `aegis256_enc_aut_step'
try.c: encrypt.c:(.text+0x...): undefined reference to `aegis256_enc_aut_step'
try.c: encrypt.c:(.text+0x...): undefined reference to `aegis256_enc_aut_step'
try.c: encrypt.c:(.text+0x...): undefined reference to `aegis256_enc_aut_step'
try.c: crypto_aead_aegis256.a(encrypt.o): In function `crypto_aead_aegis256_ref_decrypt':
try.c: encrypt.c:(.text+0x...): undefined reference to `aegis256_initialization'
try.c: encrypt.c:(.text+0x...): undefined reference to `aegis256_enc_aut_step'
try.c: encrypt.c:(.text+0x...): undefined reference to `aegis256_enc_aut_step'
try.c: encrypt.c:(.text+0x...): undefined reference to `aegis256_dec_aut_step'
try.c: encrypt.c:(.text+0x...): undefined reference to `aegis256_dec_aut_step'
try.c: collect2: error: ld returned 1 exit status

Number of similar (compiler,implementation) pairs: 1, namely:
CompilerImplementations
gcc -march=native -mtune=native -Os -fomit-frame-pointer -fwrapv -fPIC -fPIE ref

Namespace violations

Implementation: ref
Security model: unknown
Compiler: gcc -march=native -mtune=native -O2 -fomit-frame-pointer -fwrapv -fPIC -fPIE
aes.o AESROUND T
aes.o TE0 D
aes.o TE1 D
aes.o TE2 D
aes.o TE3 D
encrypt.o aegis256_tag_generation T

Number of similar (compiler,implementation) pairs: 3, namely:
CompilerImplementations
gcc -march=native -mtune=native -O2 -fomit-frame-pointer -fwrapv -fPIC -fPIE ref
gcc -march=native -mtune=native -O3 -fomit-frame-pointer -fwrapv -fPIC -fPIE ref
gcc -march=native -mtune=native -O -fomit-frame-pointer -fwrapv -fPIC -fPIE ref