Implementation notes: amd64, hydra4, crypto_kem/titaniumccasuper

Computer: hydra4
Microarchitecture: amd64; K10 32nm (300f10)
Architecture: amd64
CPU ID: AuthenticAMD-00300f10-178bfbff
SUPERCOP version: 20240425
Operation: crypto_kem
Primitive: titaniumccasuper
TimeObject sizeTest sizeImplementationCompilerBenchmark dateSUPERCOP version
1220575191504 0 36195920 820 1752T:optclang_-march=native_-O2_-fomit-frame-pointer_-fwrapv_-Qunused-arguments_-fPIC_-fPIE2024050920240425
1224135398417 0 36203704 820 1752T:optclang_-march=native_-O3_-fomit-frame-pointer_-fwrapv_-Qunused-arguments_-fPIC_-fPIE2024050920240425
1226617298417 0 36203704 820 1752T:optclang_-mcpu=native_-O3_-fomit-frame-pointer_-fwrapv_-Qunused-arguments_-fPIC_-fPIE2024050920240425
1231128282052 0 36184630 812 1752T:optclang_-march=native_-Os_-fomit-frame-pointer_-fwrapv_-Qunused-arguments_-fPIC_-fPIE2024050920240425
156433081272129 0 36177336 820 1752T:refclang_-march=native_-O3_-fomit-frame-pointer_-fwrapv_-Qunused-arguments_-fPIC_-fPIE2024050920240425
156434817672129 0 36177336 820 1752T:refclang_-mcpu=native_-O3_-fomit-frame-pointer_-fwrapv_-Qunused-arguments_-fPIC_-fPIE2024050920240425
156482050960904 0 36165264 820 1752T:refclang_-march=native_-O2_-fomit-frame-pointer_-fwrapv_-Qunused-arguments_-fPIC_-fPIE2024050920240425
165879668355180 0 36157638 812 1752T:refclang_-march=native_-Os_-fomit-frame-pointer_-fwrapv_-Qunused-arguments_-fPIC_-fPIE2024050920240425

Compiler output

Implementation: T:avx2
Security model: timingleaks
Compiler: clang -march=native -O2 -fomit-frame-pointer -fwrapv -Qunused-arguments -fPIC -fPIE
encrypt.c: In file included from encrypt.c:18:
encrypt.c: In file included from /usr/lib/llvm-11/lib/clang/11.0.1/include/x86intrin.h:13:
encrypt.c: /usr/lib/llvm-11/lib/clang/11.0.1/include/ia32intrin.h:210:16: error: expected identifier or '('
encrypt.c: unsigned int D;
encrypt.c: ^
encrypt.c: ./param.h:28:11: note: expanded from macro 'D'
encrypt.c: #define D 256
encrypt.c: ^
encrypt.c: In file included from encrypt.c:18:
encrypt.c: In file included from /usr/lib/llvm-11/lib/clang/11.0.1/include/x86intrin.h:13:
encrypt.c: /usr/lib/llvm-11/lib/clang/11.0.1/include/ia32intrin.h:211:20: error: cannot take the address of an rvalue of type 'int'
encrypt.c: __builtin_memcpy(&D, &__A, sizeof(__A));
encrypt.c: ^~
encrypt.c: /usr/lib/llvm-11/lib/clang/11.0.1/include/ia32intrin.h:227:22: error: expected identifier or '('
encrypt.c: unsigned long long D;
encrypt.c: ^
encrypt.c: ./param.h:28:11: note: expanded from macro 'D'
encrypt.c: #define D 256
encrypt.c: ^
encrypt.c: In file included from encrypt.c:18:
encrypt.c: In file included from /usr/lib/llvm-11/lib/clang/11.0.1/include/x86intrin.h:13:
encrypt.c: /usr/lib/llvm-11/lib/clang/11.0.1/include/ia32intrin.h:228:20: error: cannot take the address of an rvalue of type 'int'
encrypt.c: __builtin_memcpy(&D, &__A, sizeof(__A));
encrypt.c: ^~
encrypt.c: /usr/lib/llvm-11/lib/clang/11.0.1/include/ia32intrin.h:244:9: error: expected identifier or '('
encrypt.c: ...

Number of similar (compiler,implementation) pairs: 5, namely:
CompilerImplementations
clang -march=native -O2 -fomit-frame-pointer -fwrapv -Qunused-arguments -fPIC -fPIE T:avx2
clang -march=native -O3 -fomit-frame-pointer -fwrapv -Qunused-arguments -fPIC -fPIE T:avx2
clang -march=native -O -fomit-frame-pointer -fwrapv -Qunused-arguments -fPIC -fPIE T:avx2
clang -march=native -Os -fomit-frame-pointer -fwrapv -Qunused-arguments -fPIC -fPIE T:avx2
clang -mcpu=native -O3 -fomit-frame-pointer -fwrapv -Qunused-arguments -fPIC -fPIE T:avx2

Compiler output

Implementation: T:avx2
Security model: timingleaks
Compiler: gcc -march=native -mtune=native -O2 -fomit-frame-pointer -fwrapv -fPIC -fPIE
encrypt.c: encrypt.c: In function 'crypto_encrypt_keypair':
encrypt.c: encrypt.c:63:6: warning: AVX vector return without AVX enabled changes the ABI [-Wpsabi]
encrypt.c: 63 | u = _mm256_loadu_si256((__m256i *)(a[i] + j));
encrypt.c: | ~~^~~~~~~~~~~~~~~~~~~~~~~~~~~~~~~~~~~~~~~~~~~
encrypt.c: In file included from /usr/lib/gcc/x86_64-linux-gnu/10/include/immintrin.h:51,
encrypt.c: from /usr/lib/gcc/x86_64-linux-gnu/10/include/x86intrin.h:32,
encrypt.c: from encrypt.c:18:
encrypt.c: /usr/lib/gcc/x86_64-linux-gnu/10/include/avxintrin.h:926:1: error: inlining failed in call to 'always_inline' '_mm256_storeu_si256': target specific option mismatch
encrypt.c: 926 | _mm256_storeu_si256 (__m256i_u *__P, __m256i __A)
encrypt.c: | ^~~~~~~~~~~~~~~~~~~
encrypt.c: encrypt.c:66:4: note: called from here
encrypt.c: 66 | _mm256_storeu_si256((__m256i *)(a[i] + j), t);
encrypt.c: | ^~~~~~~~~~~~~~~~~~~~~~~~~~~~~~~~~~~~~~~~~~~~~
encrypt.c: In file included from /usr/lib/gcc/x86_64-linux-gnu/10/include/immintrin.h:53,
encrypt.c: from /usr/lib/gcc/x86_64-linux-gnu/10/include/x86intrin.h:32,
encrypt.c: from encrypt.c:18:
encrypt.c: /usr/lib/gcc/x86_64-linux-gnu/10/include/avx2intrin.h:567:1: error: inlining failed in call to 'always_inline' '_mm256_mul_epu32': target specific option mismatch
encrypt.c: 567 | _mm256_mul_epu32 (__m256i __A, __m256i __B)
encrypt.c: | ^~~~~~~~~~~~~~~~
encrypt.c: encrypt.c:65:8: note: called from here
encrypt.c: 65 | t = _mm256_mul_epu32(u, v);
encrypt.c: | ^~~~~~~~~~~~~~~~~~~~~~
encrypt.c: In file included from /usr/lib/gcc/x86_64-linux-gnu/10/include/immintrin.h:51,
encrypt.c: from /usr/lib/gcc/x86_64-linux-gnu/10/include/x86intrin.h:32,
encrypt.c: from encrypt.c:18:
encrypt.c: ...

Number of similar (compiler,implementation) pairs: 4, namely:
CompilerImplementations
gcc -march=native -mtune=native -O2 -fomit-frame-pointer -fwrapv -fPIC -fPIE T:avx2
gcc -march=native -mtune=native -O3 -fomit-frame-pointer -fwrapv -fPIC -fPIE T:avx2
gcc -march=native -mtune=native -O -fomit-frame-pointer -fwrapv -fPIC -fPIE T:avx2
gcc -march=native -mtune=native -Os -fomit-frame-pointer -fwrapv -fPIC -fPIE T:avx2

Compiler output

Implementation: T:opt
Security model: timingleaks
Compiler: clang -march=native -O -fomit-frame-pointer -fwrapv -Qunused-arguments -fPIC -fPIE
try.c: /usr/bin/ld: libcrypto_kem_titaniumccasuper.a(encrypt.o): in function `crypto_encrypt_keypair':
try.c: encrypt.c:(.text+0x...): undefined reference to `barrett_4q'
try.c: /usr/bin/ld: libcrypto_kem_titaniumccasuper.a(fastrandombytes.o): in function `fastrandombytes':
try.c: fastrandombytes.c:(.text+0x...): undefined reference to `load_32'
try.c: /usr/bin/ld: fastrandombytes.c:(.text+0x...): undefined reference to `store_32'
try.c: /usr/bin/ld: libcrypto_kem_titaniumccasuper.a(ntt.o): in function `ntt_core':
try.c: ntt.c:(.text+0x...): undefined reference to `montgomery'
try.c: /usr/bin/ld: libcrypto_kem_titaniumccasuper.a(ntt.o): in function `ntt_butterfly_2048_3328':
try.c: ntt.c:(.text+0x...): undefined reference to `barrett_16q'
try.c: /usr/bin/ld: libcrypto_kem_titaniumccasuper.a(ntt.o): in function `intt_core':
try.c: ntt.c:(.text+0x...): undefined reference to `montgomery'
try.c: /usr/bin/ld: ntt.c:(.text+0x...): undefined reference to `montgomery'
try.c: /usr/bin/ld: libcrypto_kem_titaniumccasuper.a(ntt.o): in function `ntt_butterfly_3328_1280':
try.c: ntt.c:(.text+0x...): undefined reference to `barrett_32q'
try.c: /usr/bin/ld: libcrypto_kem_titaniumccasuper.a(ntt.o): in function `ntt_butterfly_2048_3072':
try.c: ntt.c:(.text+0x...): undefined reference to `barrett_4q'
try.c: /usr/bin/ld: libcrypto_kem_titaniumccasuper.a(ntt.o): in function `ntt_butterfly_3072_3072_inv':
try.c: ntt.c:(.text+0x...): undefined reference to `barrett_8q'
try.c: /usr/bin/ld: libcrypto_kem_titaniumccasuper.a(ntt.o): in function `ntt_butterfly_1280_1280_inv':
try.c: ntt.c:(.text+0x...): undefined reference to `barrett_16q'
try.c: /usr/bin/ld: libcrypto_kem_titaniumccasuper.a(ntt.o): in function `ntt_butterfly_1024_1280':
try.c: ntt.c:(.text+0x...): undefined reference to `barrett_8q'
try.c: /usr/bin/ld: libcrypto_kem_titaniumccasuper.a(ntt.o): in function `ntt_butterfly_1280_256':
try.c: ntt.c:(.text+0x...): undefined reference to `barrett_16q'
try.c: /usr/bin/ld: libcrypto_kem_titaniumccasuper.a(ntt.o): in function `ntt_butterfly_3072_3328':
try.c: ...

Number of similar (compiler,implementation) pairs: 1, namely:
CompilerImplementations
clang -march=native -O -fomit-frame-pointer -fwrapv -Qunused-arguments -fPIC -fPIE T:opt

Compiler output

Implementation: T:opt
Security model: timingleaks
Compiler: gcc -march=native -mtune=native -O2 -fomit-frame-pointer -fwrapv -fPIC -fPIE
try.c: /usr/bin/ld: /home/supercop/benchmarking/supercop-20240425/supercop-data/hydra4/amd64/lib/libkeccak.a(KeccakP-1600-x86-64-gas.o): relocation R_X86_64_32S against `.text' can not be used when making a PIE object; recompile with -fPIE
try.c: collect2: error: ld returned 1 exit status

Number of similar (compiler,implementation) pairs: 6, namely:
CompilerImplementations
gcc -march=native -mtune=native -O2 -fomit-frame-pointer -fwrapv -fPIC -fPIE T:opt
gcc -march=native -mtune=native -O3 -fomit-frame-pointer -fwrapv -fPIC -fPIE T:opt
gcc -march=native -mtune=native -O -fomit-frame-pointer -fwrapv -fPIC -fPIE T:opt
gcc -march=native -mtune=native -O2 -fomit-frame-pointer -fwrapv -fPIC -fPIE T:ref
gcc -march=native -mtune=native -O3 -fomit-frame-pointer -fwrapv -fPIC -fPIE T:ref
gcc -march=native -mtune=native -O -fomit-frame-pointer -fwrapv -fPIC -fPIE T:ref

Compiler output

Implementation: T:opt
Security model: timingleaks
Compiler: gcc -march=native -mtune=native -Os -fomit-frame-pointer -fwrapv -fPIC -fPIE
try.c: /usr/bin/ld: /home/supercop/benchmarking/supercop-20240425/supercop-data/hydra4/amd64/lib/libkeccak.a(KeccakP-1600-x86-64-gas.o): relocation R_X86_64_32S against `.text' can not be used when making a PIE object; recompile with -fPIE
try.c: /usr/bin/ld: libcrypto_kem_titaniumccasuper.a(encrypt.o): in function `crypto_encrypt_keypair':
try.c: encrypt.c:(.text+0x...): undefined reference to `barrett_4q'
try.c: /usr/bin/ld: libcrypto_kem_titaniumccasuper.a(fastrandombytes.o): in function `fastrandombytes':
try.c: fastrandombytes.c:(.text+0x...): undefined reference to `load_32'
try.c: /usr/bin/ld: fastrandombytes.c:(.text+0x...): undefined reference to `store_32'
try.c: /usr/bin/ld: libcrypto_kem_titaniumccasuper.a(ntt.o): in function `ntt_2':
try.c: ntt.c:(.text+0x...): undefined reference to `barrett_4q'
try.c: /usr/bin/ld: ntt.c:(.text+0x...): undefined reference to `barrett_4q'
try.c: /usr/bin/ld: ntt.c:(.text+0x...): undefined reference to `barrett_4q'
try.c: /usr/bin/ld: ntt.c:(.text+0x...): undefined reference to `montgomery'
try.c: /usr/bin/ld: ntt.c:(.text+0x...): undefined reference to `barrett_4q'
try.c: /usr/bin/ld: ntt.c:(.text+0x...): undefined reference to `barrett_4q'
try.c: /usr/bin/ld: ntt.c:(.text+0x...): undefined reference to `barrett_4q'
try.c: /usr/bin/ld: ntt.c:(.text+0x...): undefined reference to `montgomery'
try.c: /usr/bin/ld: ntt.c:(.text+0x...): undefined reference to `barrett_4q'
try.c: /usr/bin/ld: ntt.c:(.text+0x...): undefined reference to `barrett_4q'
try.c: /usr/bin/ld: libcrypto_kem_titaniumccasuper.a(ntt.o): in function `ntt_core':
try.c: ntt.c:(.text+0x...): undefined reference to `montgomery'
try.c: /usr/bin/ld: libcrypto_kem_titaniumccasuper.a(ntt.o): in function `intt_core':
try.c: ntt.c:(.text+0x...): undefined reference to `montgomery'
try.c: /usr/bin/ld: ntt.c:(.text+0x...): undefined reference to `montgomery'
try.c: /usr/bin/ld: libcrypto_kem_titaniumccasuper.a(ntt.o): in function `ntt_butterfly_2048_3328':
try.c: ntt.c:(.text+0x...): undefined reference to `barrett_16q'
try.c: /usr/bin/ld: libcrypto_kem_titaniumccasuper.a(ntt.o): in function `ntt_butterfly_3328_1280':
try.c: ...

Number of similar (compiler,implementation) pairs: 1, namely:
CompilerImplementations
gcc -march=native -mtune=native -Os -fomit-frame-pointer -fwrapv -fPIC -fPIE T:opt

Compiler output

Implementation: T:ref
Security model: timingleaks
Compiler: clang -march=native -O -fomit-frame-pointer -fwrapv -Qunused-arguments -fPIC -fPIE
try.c: /usr/bin/ld: libcrypto_kem_titaniumccasuper.a(fastrandombytes.o): in function `fastrandombytes':
try.c: fastrandombytes.c:(.text+0x...): undefined reference to `load_32'
try.c: /usr/bin/ld: fastrandombytes.c:(.text+0x...): undefined reference to `store_32'
try.c: /usr/bin/ld: libcrypto_kem_titaniumccasuper.a(pack.o): in function `poly_encode_c2':
try.c: pack.c:(.text+0x...): undefined reference to `store_8'
try.c: /usr/bin/ld: libcrypto_kem_titaniumccasuper.a(pack.o): in function `poly_decode_c2':
try.c: pack.c:(.text+0x...): undefined reference to `load_8'
try.c: /usr/bin/ld: libcrypto_kem_titaniumccasuper.a(sampler.o): in function `sampler_zb':
try.c: sampler.c:(.text+0x...): undefined reference to `load_8'
try.c: /usr/bin/ld: sampler.c:(.text+0x...): undefined reference to `load_8'
try.c: /usr/bin/ld: sampler.c:(.text+0x...): undefined reference to `load_8'
try.c: /usr/bin/ld: sampler.c:(.text+0x...): undefined reference to `load_8'
try.c: /usr/bin/ld: libcrypto_kem_titaniumccasuper.a(sampler.o): in function `sampler_zq':
try.c: sampler.c:(.text+0x...): undefined reference to `load_24'
try.c: /usr/bin/ld: libcrypto_kem_titaniumccasuper.a(sampler.o): in function `sampler_binomial':
try.c: sampler.c:(.text+0x...): undefined reference to `load_8'
try.c: clang: error: linker command failed with exit code 1 (use -v to see invocation)

Number of similar (compiler,implementation) pairs: 1, namely:
CompilerImplementations
clang -march=native -O -fomit-frame-pointer -fwrapv -Qunused-arguments -fPIC -fPIE T:ref

Compiler output

Implementation: T:ref
Security model: timingleaks
Compiler: gcc -march=native -mtune=native -Os -fomit-frame-pointer -fwrapv -fPIC -fPIE
try.c: /usr/bin/ld: /home/supercop/benchmarking/supercop-20240425/supercop-data/hydra4/amd64/lib/libkeccak.a(KeccakP-1600-x86-64-gas.o): relocation R_X86_64_32S against `.text' can not be used when making a PIE object; recompile with -fPIE
try.c: /usr/bin/ld: libcrypto_kem_titaniumccasuper.a(fastrandombytes.o): in function `fastrandombytes':
try.c: fastrandombytes.c:(.text+0x...): undefined reference to `load_32'
try.c: /usr/bin/ld: fastrandombytes.c:(.text+0x...): undefined reference to `store_32'
try.c: /usr/bin/ld: libcrypto_kem_titaniumccasuper.a(sampler.o): in function `sampler_zq':
try.c: sampler.c:(.text+0x...): undefined reference to `load_24'
try.c: collect2: error: ld returned 1 exit status

Number of similar (compiler,implementation) pairs: 1, namely:
CompilerImplementations
gcc -march=native -mtune=native -Os -fomit-frame-pointer -fwrapv -fPIC -fPIE T:ref