Test results for amd64, hunsnivy, crypto_hash/luffa256

[Page version: 20260922 08:20:24]

Measurements for amd64, hunsnivy, crypto_hash Test results for amd64, hunsnivy, crypto_hash Test results for crypto_hash/luffa256
Computer: hunsnivy
Microarchitecture: amd64; Ivy Bridge+AES (306a9)
Architecture: amd64
CPU ID: GenuineIntel-000306a9-bfebfbff
SUPERCOP version: 20260831
Operation: crypto_hash
Primitive: luffa256
TimeObject sizeTest sizeImplementationCompilerBenchmark dateSUPERCOP version
188579243 0 54432683 1256 2040T:sse2clang -march=native -O2 -fwrapv -Qunused-arguments -fPIC -fPIE -gdwarf-4 -Wall2026090420260831
196209243 0 54432187 1256 2040T:sse2clang -march=native -O3 -fwrapv -Qunused-arguments -fPIC -fPIE -gdwarf-4 -Wall2026090420260831
1969610984 0 54433971 1256 2040T:sse2clang -mcpu=native -O3 -fwrapv -Qunused-arguments -fPIC -fPIE -gdwarf-4 -Wall2026090420260831
202317836 0 54427637 1248 2040T:sse2clang -march=native -Os -fwrapv -Qunused-arguments -fPIC -fPIE -gdwarf-4 -Wall2026090420260831
209429874 0 54430227 1256 2040T:sse2clang -march=native -O -fwrapv -Qunused-arguments -fPIC -fPIE -gdwarf-4 -Wall2026090420260831
215569984 0 54430558 1208 2136T:sse2gcc -march=native -mtune=native -O -fwrapv -fPIC -fPIE -gdwarf-4 -Wall2026090420260831
216407638 0 54426789 1192 2104T:sse2gcc -march=native -mtune=native -Os -fwrapv -fPIC -fPIE -gdwarf-4 -Wall2026090420260831
217099472 0 54430327 1216 2136T:sse2gcc -march=native -mtune=native -O2 -fwrapv -fPIC -fPIE -gdwarf-4 -Wall2026090420260831
2171510229 0 54432807 1216 2136T:sse2gcc -march=native -mtune=native -O3 -fwrapv -fPIC -fPIE -gdwarf-4 -Wall2026090420260831
3363728952 0 049855 1216 1592T:sphlibgcc -march=native -mtune=native -O2 -fwrapv -fPIC -fPIE -gdwarf-4 -Wall2026090420260831
3370628968 0 051647 1216 1592T:sphlibgcc -march=native -mtune=native -O3 -fwrapv -fPIC -fPIE -gdwarf-4 -Wall2026090420260831
3420827579 0 048223 1216 1592T:sphlibgcc -march=native -mtune=native -O -fwrapv -fPIC -fPIE -gdwarf-4 -Wall2026090420260831
3439826913 0 050507 1256 1496T:sphlibclang -march=native -O2 -fwrapv -Qunused-arguments -fPIC -fPIE -gdwarf-4 -Wall2026090420260831
3465526989 0 047443 1256 1496T:sphlibclang -march=native -O -fwrapv -Qunused-arguments -fPIC -fPIE -gdwarf-4 -Wall2026090420260831
3471526945 0 050043 1256 1496T:sphlibclang -march=native -O3 -fwrapv -Qunused-arguments -fPIC -fPIE -gdwarf-4 -Wall2026090420260831
349802958 0 9626395 1256 1592T:thomaz/basicclang -march=native -O2 -fwrapv -Qunused-arguments -fPIC -fPIE -gdwarf-4 -Wall2026090420260831
3498526406 0 046309 1248 1496T:sphlibclang -march=native -Os -fwrapv -Qunused-arguments -fPIC -fPIE -gdwarf-4 -Wall2026090420260831
3504419021 320 042019 1584 1496T:opt32clang -march=native -O3 -fwrapv -Qunused-arguments -fPIC -fPIE -gdwarf-4 -Wall2026090420260831
3520517797 320 041275 1584 1496T:opt32clang -march=native -O2 -fwrapv -Qunused-arguments -fPIC -fPIE -gdwarf-4 -Wall2026090420260831
357702958 0 9625931 1256 1592T:thomaz/basicclang -march=native -O3 -fwrapv -Qunused-arguments -fPIC -fPIE -gdwarf-4 -Wall2026090420260831
359789527 320 029357 1576 1496T:opt32clang -march=native -Os -fwrapv -Qunused-arguments -fPIC -fPIE -gdwarf-4 -Wall2026090420260831
3598226045 0 049147 1256 1496T:sphlibclang -mcpu=native -O3 -fwrapv -Qunused-arguments -fPIC -fPIE -gdwarf-4 -Wall2026090420260831
366602860 0 9625843 1256 1592T:thomaz/basicclang -mcpu=native -O3 -fwrapv -Qunused-arguments -fPIC -fPIE -gdwarf-4 -Wall2026090420260831
3678319255 320 042331 1584 1496T:opt32clang -mcpu=native -O3 -fwrapv -Qunused-arguments -fPIC -fPIE -gdwarf-4 -Wall2026090420260831
370112267 0 9622619 1256 1592T:thomaz/basicclang -march=native -O -fwrapv -Qunused-arguments -fPIC -fPIE -gdwarf-4 -Wall2026090420260831
3753911304 320 032191 1544 1592T:opt32gcc -march=native -mtune=native -O2 -fwrapv -fPIC -fPIE -gdwarf-4 -Wall2026090420260831
3761018010 320 040663 1544 1592T:opt32gcc -march=native -mtune=native -O3 -fwrapv -fPIC -fPIE -gdwarf-4 -Wall2026090420260831
3770024537 0 043773 1192 1560T:sphlibgcc -march=native -mtune=native -Os -fwrapv -fPIC -fPIE -gdwarf-4 -Wall2026090420260831
4213912331 320 032763 1584 1496T:opt32clang -march=native -O -fwrapv -Qunused-arguments -fPIC -fPIE -gdwarf-4 -Wall2026090420260831
431858572 320 027773 1520 1560T:opt32gcc -march=native -mtune=native -Os -fwrapv -fPIC -fPIE -gdwarf-4 -Wall2026090420260831
4467211431 320 032062 1536 1592T:opt32gcc -march=native -mtune=native -O -fwrapv -fPIC -fPIE -gdwarf-4 -Wall2026090420260831
991233088 0 9625663 1216 1688T:thomaz/basicgcc -march=native -mtune=native -O3 -fwrapv -fPIC -fPIE -gdwarf-4 -Wall2026090420260831
1016942587 0 9623431 1216 1688T:thomaz/basicgcc -march=native -mtune=native -O2 -fwrapv -fPIC -fPIE -gdwarf-4 -Wall2026090420260831
1303472039 0 9621837 1248 1592T:thomaz/basicclang -march=native -Os -fwrapv -Qunused-arguments -fPIC -fPIE -gdwarf-4 -Wall2026090420260831
1372441765 0 9620925 1192 1656T:thomaz/basicgcc -march=native -mtune=native -Os -fwrapv -fPIC -fPIE -gdwarf-4 -Wall2026090420260831
1376592102 0 9622662 1208 1688T:thomaz/basicgcc -march=native -mtune=native -O -fwrapv -fPIC -fPIE -gdwarf-4 -Wall2026090420260831

Compiler output


luffa.c: luffa.c:76:22: warning: unused variable 'RC00' [-Wunused-const-variable]
luffa.c:    76 | static const sph_u32 RC00[8] = {
luffa.c:       |                      ^~~~
luffa.c: luffa.c:83:22: warning: unused variable 'RC04' [-Wunused-const-variable]
luffa.c:    83 | static const sph_u32 RC04[8] = {
luffa.c:       |                      ^~~~
luffa.c: luffa.c:90:22: warning: unused variable 'RC10' [-Wunused-const-variable]
luffa.c:    90 | static const sph_u32 RC10[8] = {
luffa.c:       |                      ^~~~
luffa.c: luffa.c:97:22: warning: unused variable 'RC14' [-Wunused-const-variable]
luffa.c:    97 | static const sph_u32 RC14[8] = {
luffa.c:       |                      ^~~~
luffa.c: luffa.c:136:22: warning: unused variable 'RC30' [-Wunused-const-variable]
luffa.c:   136 | static const sph_u32 RC30[8] = {
luffa.c:       |                      ^~~~
luffa.c: luffa.c:143:22: warning: unused variable 'RC34' [-Wunused-const-variable]
luffa.c:   143 | static const sph_u32 RC34[8] = {
luffa.c:       |                      ^~~~
luffa.c: 6 warnings generated.

Number of similar (implementation,compiler) pairs: 5, namely:
ImplementationCompiler
T:sphlibclang -march=native -O2 -fwrapv -Qunused-arguments -fPIC -fPIE -gdwarf-4 -Wall (Debian_Clang_19.1.7_(3+b1))
T:sphlibclang -march=native -O3 -fwrapv -Qunused-arguments -fPIC -fPIE -gdwarf-4 -Wall (Debian_Clang_19.1.7_(3+b1))
T:sphlibclang -march=native -O -fwrapv -Qunused-arguments -fPIC -fPIE -gdwarf-4 -Wall (Debian_Clang_19.1.7_(3+b1))
T:sphlibclang -march=native -Os -fwrapv -Qunused-arguments -fPIC -fPIE -gdwarf-4 -Wall (Debian_Clang_19.1.7_(3+b1))
T:sphlibclang -mcpu=native -O3 -fwrapv -Qunused-arguments -fPIC -fPIE -gdwarf-4 -Wall (Debian_Clang_19.1.7_(3+b1))

Compiler output


luffa.c: luffa.c:143:22: warning: 'RC34' defined but not used [-Wunused-const-variable=]
luffa.c:   143 | static const sph_u32 RC34[8] = {
luffa.c:       |                      ^~~~
luffa.c: luffa.c:136:22: warning: 'RC30' defined but not used [-Wunused-const-variable=]
luffa.c:   136 | static const sph_u32 RC30[8] = {
luffa.c:       |                      ^~~~
luffa.c: luffa.c:97:22: warning: 'RC14' defined but not used [-Wunused-const-variable=]
luffa.c:    97 | static const sph_u32 RC14[8] = {
luffa.c:       |                      ^~~~
luffa.c: luffa.c:90:22: warning: 'RC10' defined but not used [-Wunused-const-variable=]
luffa.c:    90 | static const sph_u32 RC10[8] = {
luffa.c:       |                      ^~~~
luffa.c: luffa.c:83:22: warning: 'RC04' defined but not used [-Wunused-const-variable=]
luffa.c:    83 | static const sph_u32 RC04[8] = {
luffa.c:       |                      ^~~~
luffa.c: luffa.c:76:22: warning: 'RC00' defined but not used [-Wunused-const-variable=]
luffa.c:    76 | static const sph_u32 RC00[8] = {
luffa.c:       |                      ^~~~

Number of similar (implementation,compiler) pairs: 4, namely:
ImplementationCompiler
T:sphlibgcc -march=native -mtune=native -O2 -fwrapv -fPIC -fPIE -gdwarf-4 -Wall (14.2.0)
T:sphlibgcc -march=native -mtune=native -O3 -fwrapv -fPIC -fPIE -gdwarf-4 -Wall (14.2.0)
T:sphlibgcc -march=native -mtune=native -O -fwrapv -fPIC -fPIE -gdwarf-4 -Wall (14.2.0)
T:sphlibgcc -march=native -mtune=native -Os -fwrapv -fPIC -fPIE -gdwarf-4 -Wall (14.2.0)

Compiler output


luffa_x64asm.s: luffa_x64asm.s:780:13: error: unknown token in expression
luffa_x64asm.s:     movaps  %xmm0, [IV   ]
luffa_x64asm.s:             ^
luffa_x64asm.s: luffa_x64asm.s:781:13: error: unknown token in expression
luffa_x64asm.s:     movaps  %xmm1, [IV+16]
luffa_x64asm.s:             ^
luffa_x64asm.s: luffa_x64asm.s:782:13: error: unknown token in expression
luffa_x64asm.s:     movaps  %xmm2, [IV+32]
luffa_x64asm.s:             ^
luffa_x64asm.s: luffa_x64asm.s:783:13: error: unknown token in expression
luffa_x64asm.s:     movaps  %xmm3, [IV+48]
luffa_x64asm.s:             ^
luffa_x64asm.s: luffa_x64asm.s:784:13: error: unknown token in expression
luffa_x64asm.s:     movaps  %xmm4, [IV+64]
luffa_x64asm.s:             ^
luffa_x64asm.s: luffa_x64asm.s:785:13: error: unknown token in expression
luffa_x64asm.s:     movaps  %xmm5, [IV+80]
luffa_x64asm.s:             ^
luffa_x64asm.s: luffa_x64asm.s:786:14: error: unknown token in expression
luffa_x64asm.s:     movups  [%rdi   ], %xmm0
luffa_x64asm.s:              ^
luffa_x64asm.s: luffa_x64asm.s:787:14: error: unknown token in expression
luffa_x64asm.s:     movups  [%rdi+16], %xmm1
luffa_x64asm.s:              ^
luffa_x64asm.s: luffa_x64asm.s:788:14: error: unknown token in expression
luffa_x64asm.s: ...

Number of similar (implementation,compiler) pairs: 10, namely:
ImplementationCompiler
T:sse2_x64asmclang -march=native -O2 -fwrapv -Qunused-arguments -fPIC -fPIE -gdwarf-4 -Wall (Debian_Clang_19.1.7_(3+b1))
T:sse2_x64asmclang -march=native -O3 -fwrapv -Qunused-arguments -fPIC -fPIE -gdwarf-4 -Wall (Debian_Clang_19.1.7_(3+b1))
T:sse2_x64asmclang -march=native -O -fwrapv -Qunused-arguments -fPIC -fPIE -gdwarf-4 -Wall (Debian_Clang_19.1.7_(3+b1))
T:sse2_x64asmclang -march=native -Os -fwrapv -Qunused-arguments -fPIC -fPIE -gdwarf-4 -Wall (Debian_Clang_19.1.7_(3+b1))
T:sse2_x64asmclang -mcpu=native -O3 -fwrapv -Qunused-arguments -fPIC -fPIE -gdwarf-4 -Wall (Debian_Clang_19.1.7_(3+b1))
T:ssse3_x64asmclang -march=native -O2 -fwrapv -Qunused-arguments -fPIC -fPIE -gdwarf-4 -Wall (Debian_Clang_19.1.7_(3+b1))
T:ssse3_x64asmclang -march=native -O3 -fwrapv -Qunused-arguments -fPIC -fPIE -gdwarf-4 -Wall (Debian_Clang_19.1.7_(3+b1))
T:ssse3_x64asmclang -march=native -O -fwrapv -Qunused-arguments -fPIC -fPIE -gdwarf-4 -Wall (Debian_Clang_19.1.7_(3+b1))
T:ssse3_x64asmclang -march=native -Os -fwrapv -Qunused-arguments -fPIC -fPIE -gdwarf-4 -Wall (Debian_Clang_19.1.7_(3+b1))
T:ssse3_x64asmclang -mcpu=native -O3 -fwrapv -Qunused-arguments -fPIC -fPIE -gdwarf-4 -Wall (Debian_Clang_19.1.7_(3+b1))

Compiler output


try.c: /usr/bin/ld: libcrypto_hash_luffa256.a(luffa_x64asm.o): relocation R_X86_64_32S against symbol `IV' can not be used when making a PIE object; recompile with -fPIE
try.c: /usr/bin/ld: failed to set dynamic section sizes: bad value
try.c: collect2: error: ld returned 1 exit status

Number of similar (implementation,compiler) pairs: 16, namely:
ImplementationCompiler
T:sse2_x64asmgcc -march=native -mtune=native -O2 -fwrapv -fPIC -fPIE -gdwarf-4 -Wall (14.2.0)
T:sse2_x64asmgcc -march=native -mtune=native -O3 -fwrapv -fPIC -fPIE -gdwarf-4 -Wall (14.2.0)
T:sse2_x64asmgcc -march=native -mtune=native -O -fwrapv -fPIC -fPIE -gdwarf-4 -Wall (14.2.0)
T:sse2_x64asmgcc -march=native -mtune=native -Os -fwrapv -fPIC -fPIE -gdwarf-4 -Wall (14.2.0)
T:sse2_x64asm-2gcc -march=native -mtune=native -O2 -fwrapv -fPIC -fPIE -gdwarf-4 -Wall (14.2.0)
T:sse2_x64asm-2gcc -march=native -mtune=native -O3 -fwrapv -fPIC -fPIE -gdwarf-4 -Wall (14.2.0)
T:sse2_x64asm-2gcc -march=native -mtune=native -O -fwrapv -fPIC -fPIE -gdwarf-4 -Wall (14.2.0)
T:sse2_x64asm-2gcc -march=native -mtune=native -Os -fwrapv -fPIC -fPIE -gdwarf-4 -Wall (14.2.0)
T:ssse3_x64asmgcc -march=native -mtune=native -O2 -fwrapv -fPIC -fPIE -gdwarf-4 -Wall (14.2.0)
T:ssse3_x64asmgcc -march=native -mtune=native -O3 -fwrapv -fPIC -fPIE -gdwarf-4 -Wall (14.2.0)
T:ssse3_x64asmgcc -march=native -mtune=native -O -fwrapv -fPIC -fPIE -gdwarf-4 -Wall (14.2.0)
T:ssse3_x64asmgcc -march=native -mtune=native -Os -fwrapv -fPIC -fPIE -gdwarf-4 -Wall (14.2.0)
T:ssse3_x64asm-2gcc -march=native -mtune=native -O2 -fwrapv -fPIC -fPIE -gdwarf-4 -Wall (14.2.0)
T:ssse3_x64asm-2gcc -march=native -mtune=native -O3 -fwrapv -fPIC -fPIE -gdwarf-4 -Wall (14.2.0)
T:ssse3_x64asm-2gcc -march=native -mtune=native -O -fwrapv -fPIC -fPIE -gdwarf-4 -Wall (14.2.0)
T:ssse3_x64asm-2gcc -march=native -mtune=native -Os -fwrapv -fPIC -fPIE -gdwarf-4 -Wall (14.2.0)

Compiler output


luffa_x64asm.s: luffa_x64asm.s:780:13: error: unknown token in expression
luffa_x64asm.s:     movdqa  %xmm0, [IV   ]
luffa_x64asm.s:             ^
luffa_x64asm.s: luffa_x64asm.s:781:13: error: unknown token in expression
luffa_x64asm.s:     movdqa  %xmm1, [IV+16]
luffa_x64asm.s:             ^
luffa_x64asm.s: luffa_x64asm.s:782:13: error: unknown token in expression
luffa_x64asm.s:     movdqa  %xmm2, [IV+32]
luffa_x64asm.s:             ^
luffa_x64asm.s: luffa_x64asm.s:783:13: error: unknown token in expression
luffa_x64asm.s:     movdqa  %xmm3, [IV+48]
luffa_x64asm.s:             ^
luffa_x64asm.s: luffa_x64asm.s:784:13: error: unknown token in expression
luffa_x64asm.s:     movdqa  %xmm4, [IV+64]
luffa_x64asm.s:             ^
luffa_x64asm.s: luffa_x64asm.s:785:13: error: unknown token in expression
luffa_x64asm.s:     movdqa  %xmm5, [IV+80]
luffa_x64asm.s:             ^
luffa_x64asm.s: luffa_x64asm.s:786:14: error: unknown token in expression
luffa_x64asm.s:     movups  [%rdi   ], %xmm0
luffa_x64asm.s:              ^
luffa_x64asm.s: luffa_x64asm.s:787:14: error: unknown token in expression
luffa_x64asm.s:     movups  [%rdi+16], %xmm1
luffa_x64asm.s:              ^
luffa_x64asm.s: luffa_x64asm.s:788:14: error: unknown token in expression
luffa_x64asm.s: ...

Number of similar (implementation,compiler) pairs: 10, namely:
ImplementationCompiler
T:sse2_x64asm-2clang -march=native -O2 -fwrapv -Qunused-arguments -fPIC -fPIE -gdwarf-4 -Wall (Debian_Clang_19.1.7_(3+b1))
T:sse2_x64asm-2clang -march=native -O3 -fwrapv -Qunused-arguments -fPIC -fPIE -gdwarf-4 -Wall (Debian_Clang_19.1.7_(3+b1))
T:sse2_x64asm-2clang -march=native -O -fwrapv -Qunused-arguments -fPIC -fPIE -gdwarf-4 -Wall (Debian_Clang_19.1.7_(3+b1))
T:sse2_x64asm-2clang -march=native -Os -fwrapv -Qunused-arguments -fPIC -fPIE -gdwarf-4 -Wall (Debian_Clang_19.1.7_(3+b1))
T:sse2_x64asm-2clang -mcpu=native -O3 -fwrapv -Qunused-arguments -fPIC -fPIE -gdwarf-4 -Wall (Debian_Clang_19.1.7_(3+b1))
T:ssse3_x64asm-2clang -march=native -O2 -fwrapv -Qunused-arguments -fPIC -fPIE -gdwarf-4 -Wall (Debian_Clang_19.1.7_(3+b1))
T:ssse3_x64asm-2clang -march=native -O3 -fwrapv -Qunused-arguments -fPIC -fPIE -gdwarf-4 -Wall (Debian_Clang_19.1.7_(3+b1))
T:ssse3_x64asm-2clang -march=native -O -fwrapv -Qunused-arguments -fPIC -fPIE -gdwarf-4 -Wall (Debian_Clang_19.1.7_(3+b1))
T:ssse3_x64asm-2clang -march=native -Os -fwrapv -Qunused-arguments -fPIC -fPIE -gdwarf-4 -Wall (Debian_Clang_19.1.7_(3+b1))
T:ssse3_x64asm-2clang -mcpu=native -O3 -fwrapv -Qunused-arguments -fPIC -fPIE -gdwarf-4 -Wall (Debian_Clang_19.1.7_(3+b1))

Compiler output


luffa256_x64asm.s: luffa256_x64asm.s:297:9: error: unknown token in expression
luffa256_x64asm.s:         movaps  %xmm0, [IV   ]
luffa256_x64asm.s:                 ^
luffa256_x64asm.s: luffa256_x64asm.s:298:9: error: unknown token in expression
luffa256_x64asm.s:         movaps  %xmm1, [IV+16]
luffa256_x64asm.s:                 ^
luffa256_x64asm.s: luffa256_x64asm.s:299:9: error: unknown token in expression
luffa256_x64asm.s:         movaps  %xmm2, [IV+32]
luffa256_x64asm.s:                 ^
luffa256_x64asm.s: luffa256_x64asm.s:300:9: error: unknown token in expression
luffa256_x64asm.s:         movaps  %xmm3, [IV+48]
luffa256_x64asm.s:                 ^
luffa256_x64asm.s: luffa256_x64asm.s:301:9: error: unknown token in expression
luffa256_x64asm.s:         movaps  %xmm4, [IV+64]
luffa256_x64asm.s:                 ^
luffa256_x64asm.s: luffa256_x64asm.s:302:9: error: unknown token in expression
luffa256_x64asm.s:         movaps  %xmm5, [IV+80]
luffa256_x64asm.s:                 ^
luffa256_x64asm.s: luffa256_x64asm.s:303:10: error: unknown token in expression
luffa256_x64asm.s:         movups  [%rdi   ], %xmm0
luffa256_x64asm.s:                  ^
luffa256_x64asm.s: luffa256_x64asm.s:304:10: error: unknown token in expression
luffa256_x64asm.s:         movups  [%rdi+16], %xmm1
luffa256_x64asm.s:                  ^
luffa256_x64asm.s: luffa256_x64asm.s:305:10: error: unknown token in expression
luffa256_x64asm.s: ...

Number of similar (implementation,compiler) pairs: 5, namely:
ImplementationCompiler
T:ssse3_x64asm-PSclang -march=native -O2 -fwrapv -Qunused-arguments -fPIC -fPIE -gdwarf-4 -Wall (Debian_Clang_19.1.7_(3+b1))
T:ssse3_x64asm-PSclang -march=native -O3 -fwrapv -Qunused-arguments -fPIC -fPIE -gdwarf-4 -Wall (Debian_Clang_19.1.7_(3+b1))
T:ssse3_x64asm-PSclang -march=native -O -fwrapv -Qunused-arguments -fPIC -fPIE -gdwarf-4 -Wall (Debian_Clang_19.1.7_(3+b1))
T:ssse3_x64asm-PSclang -march=native -Os -fwrapv -Qunused-arguments -fPIC -fPIE -gdwarf-4 -Wall (Debian_Clang_19.1.7_(3+b1))
T:ssse3_x64asm-PSclang -mcpu=native -O3 -fwrapv -Qunused-arguments -fPIC -fPIE -gdwarf-4 -Wall (Debian_Clang_19.1.7_(3+b1))

Compiler output


try.c: /usr/bin/ld: libcrypto_hash_luffa256.a(luffa256_x64asm.o): relocation R_X86_64_32S against `.rodata' can not be used when making a PIE object; recompile with -fPIE
try.c: /usr/bin/ld: failed to set dynamic section sizes: bad value
try.c: collect2: error: ld returned 1 exit status

Number of similar (implementation,compiler) pairs: 8, namely:
ImplementationCompiler
T:ssse3_x64asm-PSgcc -march=native -mtune=native -O2 -fwrapv -fPIC -fPIE -gdwarf-4 -Wall (14.2.0)
T:ssse3_x64asm-PSgcc -march=native -mtune=native -O3 -fwrapv -fPIC -fPIE -gdwarf-4 -Wall (14.2.0)
T:ssse3_x64asm-PSgcc -march=native -mtune=native -O -fwrapv -fPIC -fPIE -gdwarf-4 -Wall (14.2.0)
T:ssse3_x64asm-PSgcc -march=native -mtune=native -Os -fwrapv -fPIC -fPIE -gdwarf-4 -Wall (14.2.0)
T:ssse3_x64asm-PS-2gcc -march=native -mtune=native -O2 -fwrapv -fPIC -fPIE -gdwarf-4 -Wall (14.2.0)
T:ssse3_x64asm-PS-2gcc -march=native -mtune=native -O3 -fwrapv -fPIC -fPIE -gdwarf-4 -Wall (14.2.0)
T:ssse3_x64asm-PS-2gcc -march=native -mtune=native -O -fwrapv -fPIC -fPIE -gdwarf-4 -Wall (14.2.0)
T:ssse3_x64asm-PS-2gcc -march=native -mtune=native -Os -fwrapv -fPIC -fPIE -gdwarf-4 -Wall (14.2.0)

Compiler output


luffa256_x64asm.s: luffa256_x64asm.s:297:9: error: unknown token in expression
luffa256_x64asm.s:         movdqa  %xmm0, [IV   ]
luffa256_x64asm.s:                 ^
luffa256_x64asm.s: luffa256_x64asm.s:298:9: error: unknown token in expression
luffa256_x64asm.s:         movdqa  %xmm1, [IV+16]
luffa256_x64asm.s:                 ^
luffa256_x64asm.s: luffa256_x64asm.s:299:9: error: unknown token in expression
luffa256_x64asm.s:         movdqa  %xmm2, [IV+32]
luffa256_x64asm.s:                 ^
luffa256_x64asm.s: luffa256_x64asm.s:300:9: error: unknown token in expression
luffa256_x64asm.s:         movdqa  %xmm3, [IV+48]
luffa256_x64asm.s:                 ^
luffa256_x64asm.s: luffa256_x64asm.s:301:9: error: unknown token in expression
luffa256_x64asm.s:         movdqa  %xmm4, [IV+64]
luffa256_x64asm.s:                 ^
luffa256_x64asm.s: luffa256_x64asm.s:302:9: error: unknown token in expression
luffa256_x64asm.s:         movdqa  %xmm5, [IV+80]
luffa256_x64asm.s:                 ^
luffa256_x64asm.s: luffa256_x64asm.s:303:10: error: unknown token in expression
luffa256_x64asm.s:         movdqu  [%rdi   ], %xmm0
luffa256_x64asm.s:                  ^
luffa256_x64asm.s: luffa256_x64asm.s:304:10: error: unknown token in expression
luffa256_x64asm.s:         movdqu  [%rdi+16], %xmm1
luffa256_x64asm.s:                  ^
luffa256_x64asm.s: luffa256_x64asm.s:305:10: error: unknown token in expression
luffa256_x64asm.s: ...

Number of similar (implementation,compiler) pairs: 5, namely:
ImplementationCompiler
T:ssse3_x64asm-PS-2clang -march=native -O2 -fwrapv -Qunused-arguments -fPIC -fPIE -gdwarf-4 -Wall (Debian_Clang_19.1.7_(3+b1))
T:ssse3_x64asm-PS-2clang -march=native -O3 -fwrapv -Qunused-arguments -fPIC -fPIE -gdwarf-4 -Wall (Debian_Clang_19.1.7_(3+b1))
T:ssse3_x64asm-PS-2clang -march=native -O -fwrapv -Qunused-arguments -fPIC -fPIE -gdwarf-4 -Wall (Debian_Clang_19.1.7_(3+b1))
T:ssse3_x64asm-PS-2clang -march=native -Os -fwrapv -Qunused-arguments -fPIC -fPIE -gdwarf-4 -Wall (Debian_Clang_19.1.7_(3+b1))
T:ssse3_x64asm-PS-2clang -mcpu=native -O3 -fwrapv -Qunused-arguments -fPIC -fPIE -gdwarf-4 -Wall (Debian_Clang_19.1.7_(3+b1))

Compiler output


luffa_256.s: <instantiation>:1:8: error: unknown token in expression
luffa_256.s: pshufb %xmm6, %xmm12
luffa_256.s:        ^
luffa_256.s: <instantiation>:1:1: note: while in macro instantiation
luffa_256.s: mPSSTEPI %xmm6, %xmm7, %xmm12
luffa_256.s: ^
luffa_256.s: luffa_256.s:232:2: note: while in macro instantiation
luffa_256.s:         mPS %xmm6, %xmm7, %xmm8, %xmm9, %xmm10, %xmm11
luffa_256.s:         ^
luffa_256.s: <instantiation>:2:9: error: unknown token in expression
luffa_256.s:         pshufb %xmm7, %xmm12
luffa_256.s:                ^
luffa_256.s: <instantiation>:1:1: note: while in macro instantiation
luffa_256.s: mPSSTEPI %xmm6, %xmm7, %xmm12
luffa_256.s: ^
luffa_256.s: luffa_256.s:232:2: note: while in macro instantiation
luffa_256.s:         mPS %xmm6, %xmm7, %xmm8, %xmm9, %xmm10, %xmm11
luffa_256.s:         ^
luffa_256.s: <instantiation>:1:8: error: unknown token in expression
luffa_256.s: movaps %xmm8, %xmm6
luffa_256.s:        ^
luffa_256.s: <instantiation>:2:2: note: while in macro instantiation
luffa_256.s:         mPSSTEPII %xmm6, %xmm7, %xmm8, %xmm9, %xmm10, %xmm11
luffa_256.s:         ^
luffa_256.s: luffa_256.s:232:2: note: while in macro instantiation
luffa_256.s: ...

Number of similar (implementation,compiler) pairs: 10, namely:
ImplementationCompiler
T:thomaz/asm-PSclang -march=native -O2 -fwrapv -Qunused-arguments -fPIC -fPIE -gdwarf-4 -Wall (Debian_Clang_19.1.7_(3+b1))
T:thomaz/asm-PSclang -march=native -O3 -fwrapv -Qunused-arguments -fPIC -fPIE -gdwarf-4 -Wall (Debian_Clang_19.1.7_(3+b1))
T:thomaz/asm-PSclang -march=native -O -fwrapv -Qunused-arguments -fPIC -fPIE -gdwarf-4 -Wall (Debian_Clang_19.1.7_(3+b1))
T:thomaz/asm-PSclang -march=native -Os -fwrapv -Qunused-arguments -fPIC -fPIE -gdwarf-4 -Wall (Debian_Clang_19.1.7_(3+b1))
T:thomaz/asm-PSclang -mcpu=native -O3 -fwrapv -Qunused-arguments -fPIC -fPIE -gdwarf-4 -Wall (Debian_Clang_19.1.7_(3+b1))
T:thomaz/asm-PS-v2-FPclang -march=native -O2 -fwrapv -Qunused-arguments -fPIC -fPIE -gdwarf-4 -Wall (Debian_Clang_19.1.7_(3+b1))
T:thomaz/asm-PS-v2-FPclang -march=native -O3 -fwrapv -Qunused-arguments -fPIC -fPIE -gdwarf-4 -Wall (Debian_Clang_19.1.7_(3+b1))
T:thomaz/asm-PS-v2-FPclang -march=native -O -fwrapv -Qunused-arguments -fPIC -fPIE -gdwarf-4 -Wall (Debian_Clang_19.1.7_(3+b1))
T:thomaz/asm-PS-v2-FPclang -march=native -Os -fwrapv -Qunused-arguments -fPIC -fPIE -gdwarf-4 -Wall (Debian_Clang_19.1.7_(3+b1))
T:thomaz/asm-PS-v2-FPclang -mcpu=native -O3 -fwrapv -Qunused-arguments -fPIC -fPIE -gdwarf-4 -Wall (Debian_Clang_19.1.7_(3+b1))

Compiler output


luffa_256.s: luffa_256.s: Assembler messages:
luffa_256.s: luffa_256.s:260: Warning: mnemonic suffix used with `add'
luffa_256.s: luffa_256.s:260: Warning: NOTE: Such forms are deprecated and will be rejected by a future version of the assembler
luffa_256.s: luffa_256.s:266: Warning: mnemonic suffix used with `add'
luffa_256.s: luffa_256.s:317: Warning: mnemonic suffix used with `mov'
luffa_256.s: luffa_256.s:334: Warning: mnemonic suffix used with `mov'
try.c: /usr/bin/ld: libcrypto_hash_luffa256.a(luffa_256.o): relocation R_X86_64_32S against `.rodata' can not be used when making a PIE object; recompile with -fPIE
try.c: /usr/bin/ld: failed to set dynamic section sizes: bad value
try.c: collect2: error: ld returned 1 exit status

Number of similar (implementation,compiler) pairs: 12, namely:
ImplementationCompiler
T:thomaz/asm-PSgcc -march=native -mtune=native -O2 -fwrapv -fPIC -fPIE -gdwarf-4 -Wall (14.2.0)
T:thomaz/asm-PSgcc -march=native -mtune=native -O3 -fwrapv -fPIC -fPIE -gdwarf-4 -Wall (14.2.0)
T:thomaz/asm-PSgcc -march=native -mtune=native -O -fwrapv -fPIC -fPIE -gdwarf-4 -Wall (14.2.0)
T:thomaz/asm-PSgcc -march=native -mtune=native -Os -fwrapv -fPIC -fPIE -gdwarf-4 -Wall (14.2.0)
T:thomaz/asm-PS-v2-FPgcc -march=native -mtune=native -O2 -fwrapv -fPIC -fPIE -gdwarf-4 -Wall (14.2.0)
T:thomaz/asm-PS-v2-FPgcc -march=native -mtune=native -O3 -fwrapv -fPIC -fPIE -gdwarf-4 -Wall (14.2.0)
T:thomaz/asm-PS-v2-FPgcc -march=native -mtune=native -O -fwrapv -fPIC -fPIE -gdwarf-4 -Wall (14.2.0)
T:thomaz/asm-PS-v2-FPgcc -march=native -mtune=native -Os -fwrapv -fPIC -fPIE -gdwarf-4 -Wall (14.2.0)
T:thomaz/asm-PS-v2-INTgcc -march=native -mtune=native -O2 -fwrapv -fPIC -fPIE -gdwarf-4 -Wall (14.2.0)
T:thomaz/asm-PS-v2-INTgcc -march=native -mtune=native -O3 -fwrapv -fPIC -fPIE -gdwarf-4 -Wall (14.2.0)
T:thomaz/asm-PS-v2-INTgcc -march=native -mtune=native -O -fwrapv -fPIC -fPIE -gdwarf-4 -Wall (14.2.0)
T:thomaz/asm-PS-v2-INTgcc -march=native -mtune=native -Os -fwrapv -fPIC -fPIE -gdwarf-4 -Wall (14.2.0)

Compiler output


luffa_256.s: <instantiation>:1:8: error: unknown token in expression
luffa_256.s: pshufb %xmm6, %xmm12
luffa_256.s:        ^
luffa_256.s: <instantiation>:1:1: note: while in macro instantiation
luffa_256.s: mPSSTEPI %xmm6, %xmm7, %xmm12
luffa_256.s: ^
luffa_256.s: luffa_256.s:232:2: note: while in macro instantiation
luffa_256.s:         mPS %xmm6, %xmm7, %xmm8, %xmm9, %xmm10, %xmm11
luffa_256.s:         ^
luffa_256.s: <instantiation>:2:9: error: unknown token in expression
luffa_256.s:         pshufb %xmm7, %xmm12
luffa_256.s:                ^
luffa_256.s: <instantiation>:1:1: note: while in macro instantiation
luffa_256.s: mPSSTEPI %xmm6, %xmm7, %xmm12
luffa_256.s: ^
luffa_256.s: luffa_256.s:232:2: note: while in macro instantiation
luffa_256.s:         mPS %xmm6, %xmm7, %xmm8, %xmm9, %xmm10, %xmm11
luffa_256.s:         ^
luffa_256.s: <instantiation>:1:8: error: unknown token in expression
luffa_256.s: movdqa %xmm8, %xmm6
luffa_256.s:        ^
luffa_256.s: <instantiation>:2:2: note: while in macro instantiation
luffa_256.s:         mPSSTEPII %xmm6, %xmm7, %xmm8, %xmm9, %xmm10, %xmm11
luffa_256.s:         ^
luffa_256.s: luffa_256.s:232:2: note: while in macro instantiation
luffa_256.s: ...

Number of similar (implementation,compiler) pairs: 5, namely:
ImplementationCompiler
T:thomaz/asm-PS-v2-INTclang -march=native -O2 -fwrapv -Qunused-arguments -fPIC -fPIE -gdwarf-4 -Wall (Debian_Clang_19.1.7_(3+b1))
T:thomaz/asm-PS-v2-INTclang -march=native -O3 -fwrapv -Qunused-arguments -fPIC -fPIE -gdwarf-4 -Wall (Debian_Clang_19.1.7_(3+b1))
T:thomaz/asm-PS-v2-INTclang -march=native -O -fwrapv -Qunused-arguments -fPIC -fPIE -gdwarf-4 -Wall (Debian_Clang_19.1.7_(3+b1))
T:thomaz/asm-PS-v2-INTclang -march=native -Os -fwrapv -Qunused-arguments -fPIC -fPIE -gdwarf-4 -Wall (Debian_Clang_19.1.7_(3+b1))
T:thomaz/asm-PS-v2-INTclang -mcpu=native -O3 -fwrapv -Qunused-arguments -fPIC -fPIE -gdwarf-4 -Wall (Debian_Clang_19.1.7_(3+b1))

Compiler output


luffa256.s: <instantiation>:1:8: error: unknown token in expression
luffa256.s: pshufb %xmm6, maskShufLittleEndian
luffa256.s:        ^
luffa256.s: <instantiation>:1:1: note: while in macro instantiation
luffa256.s: mPSSTEPI %xmm6, %xmm7, maskShufLittleEndian
luffa256.s: ^
luffa256.s: luffa256.s:445:2: note: while in macro instantiation
luffa256.s:         mPS %xmm6, %xmm7, %xmm8, %xmm9, %xmm10, %xmm11
luffa256.s:         ^
luffa256.s: <instantiation>:2:9: error: unknown token in expression
luffa256.s:         pshufb %xmm7, maskShufLittleEndian
luffa256.s:                ^
luffa256.s: <instantiation>:1:1: note: while in macro instantiation
luffa256.s: mPSSTEPI %xmm6, %xmm7, maskShufLittleEndian
luffa256.s: ^
luffa256.s: luffa256.s:445:2: note: while in macro instantiation
luffa256.s:         mPS %xmm6, %xmm7, %xmm8, %xmm9, %xmm10, %xmm11
luffa256.s:         ^
luffa256.s: <instantiation>:1:8: error: unknown token in expression
luffa256.s: movaps %xmm8, %xmm6
luffa256.s:        ^
luffa256.s: <instantiation>:2:2: note: while in macro instantiation
luffa256.s:         mPSSTEPII %xmm6, %xmm7, %xmm8, %xmm9, %xmm10, %xmm11
luffa256.s:         ^
luffa256.s: luffa256.s:445:2: note: while in macro instantiation
luffa256.s: ...

Number of similar (implementation,compiler) pairs: 5, namely:
ImplementationCompiler
T:thomaz/asm-PSPar-v2-FPclang -march=native -O2 -fwrapv -Qunused-arguments -fPIC -fPIE -gdwarf-4 -Wall (Debian_Clang_19.1.7_(3+b1))
T:thomaz/asm-PSPar-v2-FPclang -march=native -O3 -fwrapv -Qunused-arguments -fPIC -fPIE -gdwarf-4 -Wall (Debian_Clang_19.1.7_(3+b1))
T:thomaz/asm-PSPar-v2-FPclang -march=native -O -fwrapv -Qunused-arguments -fPIC -fPIE -gdwarf-4 -Wall (Debian_Clang_19.1.7_(3+b1))
T:thomaz/asm-PSPar-v2-FPclang -march=native -Os -fwrapv -Qunused-arguments -fPIC -fPIE -gdwarf-4 -Wall (Debian_Clang_19.1.7_(3+b1))
T:thomaz/asm-PSPar-v2-FPclang -mcpu=native -O3 -fwrapv -Qunused-arguments -fPIC -fPIE -gdwarf-4 -Wall (Debian_Clang_19.1.7_(3+b1))

Compiler output


luffa256.s: luffa256.s: Assembler messages:
luffa256.s: luffa256.s:477: Warning: mnemonic suffix used with `add'
luffa256.s: luffa256.s:477: Warning: NOTE: Such forms are deprecated and will be rejected by a future version of the assembler
luffa256.s: luffa256.s:483: Warning: mnemonic suffix used with `add'
luffa256.s: luffa256.s:530: Warning: mnemonic suffix used with `mov'
luffa256.s: luffa256.s:547: Warning: mnemonic suffix used with `mov'
try.c: /usr/bin/ld: libcrypto_hash_luffa256.a(luffa256.o): relocation R_X86_64_32S against `.rodata' can not be used when making a PIE object; recompile with -fPIE
try.c: /usr/bin/ld: failed to set dynamic section sizes: bad value
try.c: collect2: error: ld returned 1 exit status

Number of similar (implementation,compiler) pairs: 8, namely:
ImplementationCompiler
T:thomaz/asm-PSPar-v2-FPgcc -march=native -mtune=native -O2 -fwrapv -fPIC -fPIE -gdwarf-4 -Wall (14.2.0)
T:thomaz/asm-PSPar-v2-FPgcc -march=native -mtune=native -O3 -fwrapv -fPIC -fPIE -gdwarf-4 -Wall (14.2.0)
T:thomaz/asm-PSPar-v2-FPgcc -march=native -mtune=native -O -fwrapv -fPIC -fPIE -gdwarf-4 -Wall (14.2.0)
T:thomaz/asm-PSPar-v2-FPgcc -march=native -mtune=native -Os -fwrapv -fPIC -fPIE -gdwarf-4 -Wall (14.2.0)
T:thomaz/asm-PSPar-v2-INTgcc -march=native -mtune=native -O2 -fwrapv -fPIC -fPIE -gdwarf-4 -Wall (14.2.0)
T:thomaz/asm-PSPar-v2-INTgcc -march=native -mtune=native -O3 -fwrapv -fPIC -fPIE -gdwarf-4 -Wall (14.2.0)
T:thomaz/asm-PSPar-v2-INTgcc -march=native -mtune=native -O -fwrapv -fPIC -fPIE -gdwarf-4 -Wall (14.2.0)
T:thomaz/asm-PSPar-v2-INTgcc -march=native -mtune=native -Os -fwrapv -fPIC -fPIE -gdwarf-4 -Wall (14.2.0)

Compiler output


luffa256.s: <instantiation>:1:8: error: unknown token in expression
luffa256.s: pshufb %xmm6, maskShufLittleEndian
luffa256.s:        ^
luffa256.s: <instantiation>:1:1: note: while in macro instantiation
luffa256.s: mPSSTEPI %xmm6, %xmm7, maskShufLittleEndian
luffa256.s: ^
luffa256.s: luffa256.s:445:2: note: while in macro instantiation
luffa256.s:         mPS %xmm6, %xmm7, %xmm8, %xmm9, %xmm10, %xmm11
luffa256.s:         ^
luffa256.s: <instantiation>:2:9: error: unknown token in expression
luffa256.s:         pshufb %xmm7, maskShufLittleEndian
luffa256.s:                ^
luffa256.s: <instantiation>:1:1: note: while in macro instantiation
luffa256.s: mPSSTEPI %xmm6, %xmm7, maskShufLittleEndian
luffa256.s: ^
luffa256.s: luffa256.s:445:2: note: while in macro instantiation
luffa256.s:         mPS %xmm6, %xmm7, %xmm8, %xmm9, %xmm10, %xmm11
luffa256.s:         ^
luffa256.s: <instantiation>:1:8: error: unknown token in expression
luffa256.s: movdqa %xmm8, %xmm6
luffa256.s:        ^
luffa256.s: <instantiation>:2:2: note: while in macro instantiation
luffa256.s:         mPSSTEPII %xmm6, %xmm7, %xmm8, %xmm9, %xmm10, %xmm11
luffa256.s:         ^
luffa256.s: luffa256.s:445:2: note: while in macro instantiation
luffa256.s: ...

Number of similar (implementation,compiler) pairs: 5, namely:
ImplementationCompiler
T:thomaz/asm-PSPar-v2-INTclang -march=native -O2 -fwrapv -Qunused-arguments -fPIC -fPIE -gdwarf-4 -Wall (Debian_Clang_19.1.7_(3+b1))
T:thomaz/asm-PSPar-v2-INTclang -march=native -O3 -fwrapv -Qunused-arguments -fPIC -fPIE -gdwarf-4 -Wall (Debian_Clang_19.1.7_(3+b1))
T:thomaz/asm-PSPar-v2-INTclang -march=native -O -fwrapv -Qunused-arguments -fPIC -fPIE -gdwarf-4 -Wall (Debian_Clang_19.1.7_(3+b1))
T:thomaz/asm-PSPar-v2-INTclang -march=native -Os -fwrapv -Qunused-arguments -fPIC -fPIE -gdwarf-4 -Wall (Debian_Clang_19.1.7_(3+b1))
T:thomaz/asm-PSPar-v2-INTclang -mcpu=native -O3 -fwrapv -Qunused-arguments -fPIC -fPIE -gdwarf-4 -Wall (Debian_Clang_19.1.7_(3+b1))

Namespace violations


luffa_for_32.o CNS D
luffa_for_32.o Final T
luffa_for_32.o Hash T
luffa_for_32.o IV R
luffa_for_32.o Init T
luffa_for_32.o Update T
luffa_for_32.o Update256 T
luffa_for_32.o Update384 T
luffa_for_32.o Update512 T
luffa_for_32.o finalization224 T
luffa_for_32.o finalization256 T
luffa_for_32.o finalization384 T
luffa_for_32.o finalization512 T
luffa_for_32.o process_last_msgs256 T
luffa_for_32.o process_last_msgs384 T
luffa_for_32.o process_last_msgs512 T
luffa_for_32.o rnd256 T
luffa_for_32.o rnd384 T
luffa_for_32.o rnd512 T

Number of similar (implementation,compiler) pairs: 9, namely:
ImplementationCompiler
T:opt32clang -march=native -O2 -fwrapv -Qunused-arguments -fPIC -fPIE -gdwarf-4 -Wall (Debian_Clang_19.1.7_(3+b1))
T:opt32clang -march=native -O3 -fwrapv -Qunused-arguments -fPIC -fPIE -gdwarf-4 -Wall (Debian_Clang_19.1.7_(3+b1))
T:opt32clang -march=native -O -fwrapv -Qunused-arguments -fPIC -fPIE -gdwarf-4 -Wall (Debian_Clang_19.1.7_(3+b1))
T:opt32clang -march=native -Os -fwrapv -Qunused-arguments -fPIC -fPIE -gdwarf-4 -Wall (Debian_Clang_19.1.7_(3+b1))
T:opt32clang -mcpu=native -O3 -fwrapv -Qunused-arguments -fPIC -fPIE -gdwarf-4 -Wall (Debian_Clang_19.1.7_(3+b1))
T:opt32gcc -march=native -mtune=native -O2 -fwrapv -fPIC -fPIE -gdwarf-4 -Wall (14.2.0)
T:opt32gcc -march=native -mtune=native -O3 -fwrapv -fPIC -fPIE -gdwarf-4 -Wall (14.2.0)
T:opt32gcc -march=native -mtune=native -O -fwrapv -fPIC -fPIE -gdwarf-4 -Wall (14.2.0)
T:opt32gcc -march=native -mtune=native -Os -fwrapv -fPIC -fPIE -gdwarf-4 -Wall (14.2.0)

Namespace violations


luffa.o sph_luffa224 T
luffa.o sph_luffa224_addbits_and_close T
luffa.o sph_luffa224_close T
luffa.o sph_luffa224_init T
luffa.o sph_luffa256 T
luffa.o sph_luffa256_addbits_and_close T
luffa.o sph_luffa256_close T
luffa.o sph_luffa256_init T
luffa.o sph_luffa384 T
luffa.o sph_luffa384_addbits_and_close T
luffa.o sph_luffa384_close T
luffa.o sph_luffa384_init T
luffa.o sph_luffa512 T
luffa.o sph_luffa512_addbits_and_close T
luffa.o sph_luffa512_close T
luffa.o sph_luffa512_init T

Number of similar (implementation,compiler) pairs: 9, namely:
ImplementationCompiler
T:sphlibclang -march=native -O2 -fwrapv -Qunused-arguments -fPIC -fPIE -gdwarf-4 -Wall (Debian_Clang_19.1.7_(3+b1))
T:sphlibclang -march=native -O3 -fwrapv -Qunused-arguments -fPIC -fPIE -gdwarf-4 -Wall (Debian_Clang_19.1.7_(3+b1))
T:sphlibclang -march=native -O -fwrapv -Qunused-arguments -fPIC -fPIE -gdwarf-4 -Wall (Debian_Clang_19.1.7_(3+b1))
T:sphlibclang -march=native -Os -fwrapv -Qunused-arguments -fPIC -fPIE -gdwarf-4 -Wall (Debian_Clang_19.1.7_(3+b1))
T:sphlibclang -mcpu=native -O3 -fwrapv -Qunused-arguments -fPIC -fPIE -gdwarf-4 -Wall (Debian_Clang_19.1.7_(3+b1))
T:sphlibgcc -march=native -mtune=native -O2 -fwrapv -fPIC -fPIE -gdwarf-4 -Wall (14.2.0)
T:sphlibgcc -march=native -mtune=native -O3 -fwrapv -fPIC -fPIE -gdwarf-4 -Wall (14.2.0)
T:sphlibgcc -march=native -mtune=native -O -fwrapv -fPIC -fPIE -gdwarf-4 -Wall (14.2.0)
T:sphlibgcc -march=native -mtune=native -Os -fwrapv -fPIC -fPIE -gdwarf-4 -Wall (14.2.0)

Namespace violations


luffa_for_sse2.o ALLONE B
luffa_for_sse2.o CNS128 B
luffa_for_sse2.o Final T
luffa_for_sse2.o Hash T
luffa_for_sse2.o Init T
luffa_for_sse2.o MASK B
luffa_for_sse2.o Update T

Number of similar (implementation,compiler) pairs: 9, namely:
ImplementationCompiler
T:sse2clang -march=native -O2 -fwrapv -Qunused-arguments -fPIC -fPIE -gdwarf-4 -Wall (Debian_Clang_19.1.7_(3+b1))
T:sse2clang -march=native -O3 -fwrapv -Qunused-arguments -fPIC -fPIE -gdwarf-4 -Wall (Debian_Clang_19.1.7_(3+b1))
T:sse2clang -march=native -O -fwrapv -Qunused-arguments -fPIC -fPIE -gdwarf-4 -Wall (Debian_Clang_19.1.7_(3+b1))
T:sse2clang -march=native -Os -fwrapv -Qunused-arguments -fPIC -fPIE -gdwarf-4 -Wall (Debian_Clang_19.1.7_(3+b1))
T:sse2clang -mcpu=native -O3 -fwrapv -Qunused-arguments -fPIC -fPIE -gdwarf-4 -Wall (Debian_Clang_19.1.7_(3+b1))
T:sse2gcc -march=native -mtune=native -O2 -fwrapv -fPIC -fPIE -gdwarf-4 -Wall (14.2.0)
T:sse2gcc -march=native -mtune=native -O3 -fwrapv -fPIC -fPIE -gdwarf-4 -Wall (14.2.0)
T:sse2gcc -march=native -mtune=native -O -fwrapv -fPIC -fPIE -gdwarf-4 -Wall (14.2.0)
T:sse2gcc -march=native -mtune=native -Os -fwrapv -fPIC -fPIE -gdwarf-4 -Wall (14.2.0)