Implementation notes: amd64, hiphop, crypto_hash/prh42s256

Computer: hiphop
Architecture: amd64
CPU ID: GenuineIntel-000306c3-bfebfbff
SUPERCOP version: 20210604
Operation: crypto_hash
Primitive: prh42s256
TimeObject sizeTest sizeImplementationCompilerBenchmark dateSUPERCOP version
11124225 0 018649 804 952refgcc_-march=native_-mtune=native_-O3_-fomit-frame-pointer_-fwrapv_-fPIC_-fPIE2021011420210114
11843661 0 014816 796 952refgcc_-march=native_-mtune=native_-O2_-fomit-frame-pointer_-fwrapv_-fPIC_-fPIE2021011420210114
12763641 0 014680 796 952refgcc_-march=native_-mtune=native_-O_-fomit-frame-pointer_-fwrapv_-fPIC_-fPIE2021011420210114

Compiler output

Implementation: ref
Security model: constbranchindex
Compiler: clang -march=native -O2 -fomit-frame-pointer -fwrapv -Qunused-arguments -fPIC -fPIE
try.c: crypto_hash_prh42s256.a(hash.o): In function `crypto_hash_prh42s256_ref_constbranchindex':
try.c: hash.c:(.text+0x...): undefined reference to `prvhash42s_oneshot'
try.c: clang: error: linker command failed with exit code 1 (use -v to see invocation)

Number of similar (compiler,implementation) pairs: 3, namely:
CompilerImplementations
clang -march=native -O2 -fomit-frame-pointer -fwrapv -Qunused-arguments -fPIC -fPIE ref
clang -march=native -O -fomit-frame-pointer -fwrapv -Qunused-arguments -fPIC -fPIE ref
clang -march=native -Os -fomit-frame-pointer -fwrapv -Qunused-arguments -fPIC -fPIE ref

Compiler output

Implementation: ref
Security model: constbranchindex
Compiler: clang -march=native -O3 -fomit-frame-pointer -fwrapv -Qunused-arguments -fPIC -fPIE
try.c: crypto_hash_prh42s256.a(hash.o): In function `crypto_hash_prh42s256_ref_constbranchindex':
try.c: hash.c:(.text+0x...): undefined reference to `prvhash42s_init'
try.c: hash.c:(.text+0x...): undefined reference to `prvhash42s_update'
try.c: hash.c:(.text+0x...): undefined reference to `prvhash42s_final'
try.c: clang: error: linker command failed with exit code 1 (use -v to see invocation)

Number of similar (compiler,implementation) pairs: 2, namely:
CompilerImplementations
clang -march=native -O3 -fomit-frame-pointer -fwrapv -Qunused-arguments -fPIC -fPIE ref
clang -mcpu=native -O3 -fomit-frame-pointer -fwrapv -Qunused-arguments -fPIC -fPIE ref

Compiler output

Implementation: ref
Security model: constbranchindex
Compiler: gcc -march=native -mtune=native -Os -fomit-frame-pointer -fwrapv -fPIC -fPIE
try.c: crypto_hash_prh42s256.a(hash.o): In function `crypto_hash_prh42s256_ref_constbranchindex':
try.c: hash.c:(.text+0x...): undefined reference to `prvhash42s_oneshot'
try.c: collect2: error: ld returned 1 exit status

Number of similar (compiler,implementation) pairs: 1, namely:
CompilerImplementations
gcc -march=native -mtune=native -Os -fomit-frame-pointer -fwrapv -fPIC -fPIE ref