Test results for amd64, hertz, crypto_kem/sikep610

[Page version: 20250310 13:41:42]

Measurements for amd64, hertz, crypto_kem Test results for amd64, hertz, crypto_kem Test results for crypto_kem/sikep610
Computer: hertz
Microarchitecture: amd64; Zen 4 (a60f12)
Architecture: amd64
CPU ID: AuthenticAMD-00a60f12-178bfbff
SUPERCOP version: 20250307
Operation: crypto_kem
Primitive: sikep610
TimeObject sizeTest sizeImplementationCompilerBenchmark dateSUPERCOP version
5279806679598 0 0103497 844 1832T:mulxadxclang -march=native -O3 -fwrapv -Qunused-arguments -fPIC -fPIE -gdwarf-4 -Wall2025030820250307
5284777479026 0 0102889 844 1832T:mulxadxclang -march=native -O2 -fwrapv -Qunused-arguments -fPIC -fPIE -gdwarf-4 -Wall2025030820250307
5298639541466 0 061731 836 1832T:mulxadxclang -march=native -Os -fwrapv -Qunused-arguments -fPIC -fPIE -gdwarf-4 -Wall2025030820250307
5328900845374 0 065780 820 1864T:mulxadxgcc -march=native -mtune=native -O2 -fwrapv -fPIC -fPIE -gdwarf-4 -Wall2025030820250307
5337983855874 0 078148 820 1864T:mulxadxgcc -march=native -mtune=native -O3 -fwrapv -fPIC -fPIE -gdwarf-4 -Wall2025030820250307
5545051529499 0 048156 812 1768T:mulxadxgcc -march=native -mtune=native -Os -fwrapv -fPIC -fPIE -gdwarf-4 -Wall2025030820250307
6236703779242 0 0103145 844 1832T:mulxclang -march=native -O3 -fwrapv -Qunused-arguments -fPIC -fPIE -gdwarf-4 -Wall2025030820250307
6244697178670 0 0102537 844 1832T:mulxclang -march=native -O2 -fwrapv -Qunused-arguments -fPIC -fPIE -gdwarf-4 -Wall2025030820250307
6273904041110 0 061379 836 1832T:mulxclang -march=native -Os -fwrapv -Qunused-arguments -fPIC -fPIE -gdwarf-4 -Wall2025030820250307
6296048755518 0 077796 820 1864T:mulxgcc -march=native -mtune=native -O3 -fwrapv -fPIC -fPIE -gdwarf-4 -Wall2025030820250307
6298657745018 0 065428 820 1864T:mulxgcc -march=native -mtune=native -O2 -fwrapv -fPIC -fPIE -gdwarf-4 -Wall2025030820250307
6529280129143 0 047788 812 1768T:mulxgcc -march=native -mtune=native -Os -fwrapv -fPIC -fPIE -gdwarf-4 -Wall2025030820250307
464654550106299 0 0130161 844 1832T:amd64clang -march=native -O3 -fwrapv -Qunused-arguments -fPIC -fPIE -gdwarf-4 -Wall2025030820250307
465387590105663 0 0129489 844 1832T:amd64clang -march=native -O2 -fwrapv -Qunused-arguments -fPIC -fPIE -gdwarf-4 -Wall2025030820250307
49353206042096 0 062411 836 1832T:amd64clang -march=native -Os -fwrapv -Qunused-arguments -fPIC -fPIE -gdwarf-4 -Wall2025030820250307
494010050100187 0 0122468 820 1864T:amd64gcc -march=native -mtune=native -O3 -fwrapv -fPIC -fPIE -gdwarf-4 -Wall2025030820250307
54761490948438 0 068828 820 1864T:amd64gcc -march=native -mtune=native -O2 -fwrapv -fPIC -fPIE -gdwarf-4 -Wall2025030820250307
84571622225641 0 044300 812 1768T:amd64gcc -march=native -mtune=native -Os -fwrapv -fPIC -fPIE -gdwarf-4 -Wall2025030820250307

Compiler output


fp_x64_asm.S: fp_x64_asm.S:724:3: error: "CONFIGURATION NOT SUPPORTED. TRY USE_MULX=TRUE"
fp_x64_asm.S:   724 | # error "CONFIGURATION NOT SUPPORTED. TRY USE_MULX=TRUE"
fp_x64_asm.S:       |   ^
fp_x64_asm.S: fp_x64_asm.S:1042:3: error: "CONFIGURATION NOT SUPPORTED. TRY USE_MULX=TRUE"
fp_x64_asm.S:  1042 | # error "CONFIGURATION NOT SUPPORTED. TRY USE_MULX=TRUE"
fp_x64_asm.S:       |   ^
fp_x64_asm.S: 2 errors generated.

Number of similar (implementation,compiler) pairs: 3, namely:
ImplementationCompiler
T:amd64asmclang -march=native -O2 -fwrapv -Qunused-arguments -fPIC -fPIE -gdwarf-4 -Wall (Ubuntu_Clang_19.1.1_(1ubuntu1))
T:amd64asmclang -march=native -O3 -fwrapv -Qunused-arguments -fPIC -fPIE -gdwarf-4 -Wall (Ubuntu_Clang_19.1.1_(1ubuntu1))
T:amd64asmclang -march=native -Os -fwrapv -Qunused-arguments -fPIC -fPIE -gdwarf-4 -Wall (Ubuntu_Clang_19.1.1_(1ubuntu1))

Compiler output


fp_x64_asm.S: fp_x64_asm.S:724:3: error: #error "CONFIGURATION NOT SUPPORTED. TRY USE_MULX=TRUE"
fp_x64_asm.S:   724 | # error "CONFIGURATION NOT SUPPORTED. TRY USE_MULX=TRUE"
fp_x64_asm.S:       |   ^~~~~
fp_x64_asm.S: fp_x64_asm.S:1042:3: error: #error "CONFIGURATION NOT SUPPORTED. TRY USE_MULX=TRUE"
fp_x64_asm.S:  1042 | # error "CONFIGURATION NOT SUPPORTED. TRY USE_MULX=TRUE"
fp_x64_asm.S:       |   ^~~~~

Number of similar (implementation,compiler) pairs: 3, namely:
ImplementationCompiler
T:amd64asmgcc -march=native -mtune=native -O2 -fwrapv -fPIC -fPIE -gdwarf-4 -Wall (14.2.0)
T:amd64asmgcc -march=native -mtune=native -O3 -fwrapv -fPIC -fPIE -gdwarf-4 -Wall (14.2.0)
T:amd64asmgcc -march=native -mtune=native -Os -fwrapv -fPIC -fPIE -gdwarf-4 -Wall (14.2.0)

Compiler output


api.c: In file included from api.c:9:
api.c: In file included from ./sike_params.h:15:
api.c: In file included from ./montgomery.h:15:
api.c: In file included from ./fp2.h:16:
api.c: ./fp.h:15:10: fatal error: 'gmp.h' file not found
api.c:    15 | #include <gmp.h>
api.c:       |          ^~~~~~~
api.c: 1 error generated.

Number of similar (implementation,compiler) pairs: 3, namely:
ImplementationCompiler
T:refclang -march=native -O2 -fwrapv -Qunused-arguments -fPIC -fPIE -gdwarf-4 -Wall (Ubuntu_Clang_19.1.1_(1ubuntu1))
T:refclang -march=native -O3 -fwrapv -Qunused-arguments -fPIC -fPIE -gdwarf-4 -Wall (Ubuntu_Clang_19.1.1_(1ubuntu1))
T:refclang -march=native -Os -fwrapv -Qunused-arguments -fPIC -fPIE -gdwarf-4 -Wall (Ubuntu_Clang_19.1.1_(1ubuntu1))

Compiler output


api.c: In file included from ./fp2.h:16,
api.c:                  from ./montgomery.h:15,
api.c:                  from ./sike_params.h:15,
api.c:                  from api.c:9:
api.c: ./fp.h:15:10: fatal error: gmp.h: No such file or directory
api.c:    15 | #include <gmp.h>
api.c:       |          ^~~~~~~
api.c: compilation terminated.

Number of similar (implementation,compiler) pairs: 3, namely:
ImplementationCompiler
T:refgcc -march=native -mtune=native -O2 -fwrapv -fPIC -fPIE -gdwarf-4 -Wall (14.2.0)
T:refgcc -march=native -mtune=native -O3 -fwrapv -fPIC -fPIE -gdwarf-4 -Wall (14.2.0)
T:refgcc -march=native -mtune=native -Os -fwrapv -fPIC -fPIE -gdwarf-4 -Wall (14.2.0)

Namespace violations


P610.o A_gen R
P610.o Alice_order R
P610.o B_gen R
P610.o Bob_order R
P610.o EphemeralKeyGeneration_A_SIDHp610 T
P610.o EphemeralKeyGeneration_B_SIDHp610 T
P610.o EphemeralSecretAgreement_A_SIDHp610 T
P610.o EphemeralSecretAgreement_B_SIDHp610 T
P610.o Montgomery_R2 R
P610.o Montgomery_one R
P610.o clear_words T
P610.o copy_words T
P610.o ct_cmov T
P610.o ct_compare T
P610.o eval_2_isog T
P610.o eval_3_isog T
P610.o eval_4_isog T
P610.o fp2add610 T
P610.o fp2copy610 T
P610.o fp2correction610 T
P610.o fp2div2_610 T
P610.o fp2inv610_mont T
P610.o fp2mul610_mont T
P610.o fp2neg610 T
P610.o fp2sqr610_mont T
P610.o fp2sub610 T
P610.o fp2zero610 T
P610.o fpcopy610 T
P610.o fpinv610_chain_mont T
P610.o fpinv610_mont T
P610.o fpmul610_mont T
P610.o fpsqr610_mont T
P610.o fpzero610 T
P610.o from_fp2mont T
P610.o from_mont T
P610.o get_2_isog T
P610.o get_3_isog T
P610.o get_4_isog T
P610.o get_A T
P610.o inv_3_way T
P610.o j_inv T
P610.o mp_add T
P610.o mp_shiftl1 T
P610.o mp_shiftleft T
P610.o mp_shiftr1 T
P610.o mp_sub T
P610.o p610 R
P610.o p610p1 R
P610.o p610x16p R
P610.o p610x2 R
P610.o p610x4 R
P610.o random_mod_order_A_SIDHp610 T
P610.o random_mod_order_B_SIDHp610 T
P610.o strat_Alice R
P610.o strat_Bob R
P610.o to_fp2mont T
P610.o to_mont T
P610.o xDBL T
P610.o xDBLADD T
P610.o xDBLe T
P610.o xTPL T
P610.o xTPLe T
fips202.o KeccakF1600_StatePermute T
fips202.o shake128 T
fips202.o shake128_absorb T
fips202.o shake128_squeezeblocks T
fips202.o shake256 T
fips202.o shake256_absorb T
fips202.o shake256_squeezeblocks T
fp_generic.o digit_x_digit T
fp_generic.o fpadd610 T
fp_generic.o fpcorrection610 T
fp_generic.o fpdiv2_610 T
fp_generic.o fpneg610 T
fp_generic.o fpsub610 T
fp_generic.o mp_mul T
fp_generic.o mp_sub610_p2 T
fp_generic.o mp_sub610_p4 T
fp_generic.o rdc_mont T

Number of similar (implementation,compiler) pairs: 6, namely:
ImplementationCompiler
T:amd64clang -march=native -O2 -fwrapv -Qunused-arguments -fPIC -fPIE -gdwarf-4 -Wall (Ubuntu_Clang_19.1.1_(1ubuntu1))
T:amd64clang -march=native -O3 -fwrapv -Qunused-arguments -fPIC -fPIE -gdwarf-4 -Wall (Ubuntu_Clang_19.1.1_(1ubuntu1))
T:amd64clang -march=native -Os -fwrapv -Qunused-arguments -fPIC -fPIE -gdwarf-4 -Wall (Ubuntu_Clang_19.1.1_(1ubuntu1))
T:amd64gcc -march=native -mtune=native -O2 -fwrapv -fPIC -fPIE -gdwarf-4 -Wall (14.2.0)
T:amd64gcc -march=native -mtune=native -O3 -fwrapv -fPIC -fPIE -gdwarf-4 -Wall (14.2.0)
T:amd64gcc -march=native -mtune=native -Os -fwrapv -fPIC -fPIE -gdwarf-4 -Wall (14.2.0)

Namespace violations


P610.o A_gen R
P610.o Alice_order R
P610.o B_gen R
P610.o Bob_order R
P610.o EphemeralKeyGeneration_A_SIDHp610 T
P610.o EphemeralKeyGeneration_B_SIDHp610 T
P610.o EphemeralSecretAgreement_A_SIDHp610 T
P610.o EphemeralSecretAgreement_B_SIDHp610 T
P610.o Montgomery_R2 R
P610.o Montgomery_one R
P610.o clear_words T
P610.o copy_words T
P610.o ct_cmov T
P610.o ct_compare T
P610.o eval_2_isog T
P610.o eval_3_isog T
P610.o eval_4_isog T
P610.o fp2add610 T
P610.o fp2copy610 T
P610.o fp2correction610 T
P610.o fp2div2_610 T
P610.o fp2inv610_mont T
P610.o fp2mul610_mont T
P610.o fp2neg610 T
P610.o fp2sqr610_mont T
P610.o fp2sub610 T
P610.o fp2zero610 T
P610.o fpcopy610 T
P610.o fpinv610_chain_mont T
P610.o fpinv610_mont T
P610.o fpmul610_mont T
P610.o fpsqr610_mont T
P610.o fpzero610 T
P610.o from_fp2mont T
P610.o from_mont T
P610.o get_2_isog T
P610.o get_3_isog T
P610.o get_4_isog T
P610.o get_A T
P610.o inv_3_way T
P610.o j_inv T
P610.o mp_add T
P610.o mp_shiftl1 T
P610.o mp_shiftleft T
P610.o mp_shiftr1 T
P610.o mp_sub T
P610.o p610 R
P610.o p610p1 R
P610.o p610x16p R
P610.o p610x2 R
P610.o p610x4 R
P610.o random_mod_order_A_SIDHp610 T
P610.o random_mod_order_B_SIDHp610 T
P610.o strat_Alice R
P610.o strat_Bob R
P610.o to_fp2mont T
P610.o to_mont T
P610.o xDBL T
P610.o xDBLADD T
P610.o xDBLe T
P610.o xTPL T
P610.o xTPLe T
fips202.o KeccakF1600_StatePermute T
fips202.o shake128 T
fips202.o shake128_absorb T
fips202.o shake128_squeezeblocks T
fips202.o shake256 T
fips202.o shake256_absorb T
fips202.o shake256_squeezeblocks T
fp_x64.o fpadd610 T
fp_x64.o fpcorrection610 T
fp_x64.o fpdiv2_610 T
fp_x64.o fpneg610 T
fp_x64.o fpsub610 T
fp_x64.o mp_mul T
fp_x64.o mp_sub610_p2 T
fp_x64.o mp_sub610_p4 T
fp_x64.o rdc_mont T
fp_x64_asm.o fpadd610_asm T
fp_x64_asm.o fpsub610_asm T
fp_x64_asm.o mp_add610_asm T
fp_x64_asm.o mp_dblsub610x2_asm T
fp_x64_asm.o mp_sub610_p2_asm T
fp_x64_asm.o mp_sub610_p4_asm T
fp_x64_asm.o mp_subadd610x2_asm T
fp_x64_asm.o mul610_asm T
fp_x64_asm.o rdc610_asm T

Number of similar (implementation,compiler) pairs: 12, namely:
ImplementationCompiler
T:mulxclang -march=native -O2 -fwrapv -Qunused-arguments -fPIC -fPIE -gdwarf-4 -Wall (Ubuntu_Clang_19.1.1_(1ubuntu1))
T:mulxclang -march=native -O3 -fwrapv -Qunused-arguments -fPIC -fPIE -gdwarf-4 -Wall (Ubuntu_Clang_19.1.1_(1ubuntu1))
T:mulxclang -march=native -Os -fwrapv -Qunused-arguments -fPIC -fPIE -gdwarf-4 -Wall (Ubuntu_Clang_19.1.1_(1ubuntu1))
T:mulxgcc -march=native -mtune=native -O2 -fwrapv -fPIC -fPIE -gdwarf-4 -Wall (14.2.0)
T:mulxgcc -march=native -mtune=native -O3 -fwrapv -fPIC -fPIE -gdwarf-4 -Wall (14.2.0)
T:mulxgcc -march=native -mtune=native -Os -fwrapv -fPIC -fPIE -gdwarf-4 -Wall (14.2.0)
T:mulxadxclang -march=native -O2 -fwrapv -Qunused-arguments -fPIC -fPIE -gdwarf-4 -Wall (Ubuntu_Clang_19.1.1_(1ubuntu1))
T:mulxadxclang -march=native -O3 -fwrapv -Qunused-arguments -fPIC -fPIE -gdwarf-4 -Wall (Ubuntu_Clang_19.1.1_(1ubuntu1))
T:mulxadxclang -march=native -Os -fwrapv -Qunused-arguments -fPIC -fPIE -gdwarf-4 -Wall (Ubuntu_Clang_19.1.1_(1ubuntu1))
T:mulxadxgcc -march=native -mtune=native -O2 -fwrapv -fPIC -fPIE -gdwarf-4 -Wall (14.2.0)
T:mulxadxgcc -march=native -mtune=native -O3 -fwrapv -fPIC -fPIE -gdwarf-4 -Wall (14.2.0)
T:mulxadxgcc -march=native -mtune=native -Os -fwrapv -fPIC -fPIE -gdwarf-4 -Wall (14.2.0)