Implementation notes: amd64, hertz, crypto_kem/r5n15kem0d

Computer: hertz
Microarchitecture: amd64; Zen 4 (a60f12)
Architecture: amd64
CPU ID: AuthenticAMD-00a60f12-178bfbff
SUPERCOP version: 20240107
Operation: crypto_kem
Primitive: r5n15kem0d
TimeObject sizeTest sizeImplementationCompilerBenchmark dateSUPERCOP version
223370045374 0 0152925 916 1832T:avx2clang-17_-march=native_-O3_-fomit-frame-pointer_-fwrapv_-Qunused-arguments_-fPIC_-fPIE2023122020231217
275206238138 0 0145367 892 1832T:avx2gcc_-march=native_-mtune=native_-O3_-fomit-frame-pointer_-fwrapv_-fPIC_-fPIE2023122020231217
322426736644 0 0148829 916 1832T:avx2clang-17_-march=native_-O2_-fomit-frame-pointer_-fwrapv_-Qunused-arguments_-fPIC_-fPIE2023122020231217
410337026701 0 0138103 908 1832T:avx2clang-17_-march=native_-Os_-fomit-frame-pointer_-fwrapv_-Qunused-arguments_-fPIC_-fPIE2023122020231217
413580027233 0 0138799 892 1800T:avx2gcc_-march=native_-mtune=native_-O2_-fomit-frame-pointer_-fwrapv_-fPIC_-fPIE2023122020231217
467226923677 0 0135207 884 1768T:avx2gcc_-march=native_-mtune=native_-Os_-fomit-frame-pointer_-fwrapv_-fPIC_-fPIE2023122020231217
1884408844875 0 0152405 916 1832T:optclang-17_-march=native_-O3_-fomit-frame-pointer_-fwrapv_-Qunused-arguments_-fPIC_-fPIE2023122020231217
1979311636145 0 0148309 916 1832T:optclang-17_-march=native_-O2_-fomit-frame-pointer_-fwrapv_-Qunused-arguments_-fPIC_-fPIE2023122020231217
2324770935402 0 0142647 892 1832T:optgcc_-march=native_-mtune=native_-O3_-fomit-frame-pointer_-fwrapv_-fPIC_-fPIE2023122020231217
2532137925999 0 0137447 908 1832T:optclang-17_-march=native_-Os_-fomit-frame-pointer_-fwrapv_-Qunused-arguments_-fPIC_-fPIE2023122020231217
2704890826206 0 0137735 892 1800T:optgcc_-march=native_-mtune=native_-O2_-fomit-frame-pointer_-fwrapv_-fPIC_-fPIE2023122020231217
3108652722787 0 0134271 884 1768T:optgcc_-march=native_-mtune=native_-Os_-fomit-frame-pointer_-fwrapv_-fPIC_-fPIE2023122020231217

Compiler output

Implementation: T:avx2
Security model: timingleaks
Compiler: clang-17 -march=native -O2 -fomit-frame-pointer -fwrapv -Qunused-arguments -fPIC -fPIE
try.c: /usr/bin/ld: warning: KeccakP-1600-AVX2.o: missing .note.GNU-stack section implies executable stack
try.c: /usr/bin/ld: NOTE: This behaviour is deprecated and will be removed in a future version of the linker
try.c: /usr/bin/ld: warning: KeccakP-1600-AVX2.o: missing .note.GNU-stack section implies executable stack
try.c: /usr/bin/ld: NOTE: This behaviour is deprecated and will be removed in a future version of the linker
measure.c: /usr/bin/ld: warning: KeccakP-1600-AVX2.o: missing .note.GNU-stack section implies executable stack
measure.c: /usr/bin/ld: NOTE: This behaviour is deprecated and will be removed in a future version of the linker

Number of similar (compiler,implementation) pairs: 12, namely:
CompilerImplementations
clang-17 -march=native -O2 -fomit-frame-pointer -fwrapv -Qunused-arguments -fPIC -fPIE T:avx2
clang-17 -march=native -O3 -fomit-frame-pointer -fwrapv -Qunused-arguments -fPIC -fPIE T:avx2
clang-17 -march=native -Os -fomit-frame-pointer -fwrapv -Qunused-arguments -fPIC -fPIE T:avx2
gcc -march=native -mtune=native -O2 -fomit-frame-pointer -fwrapv -fPIC -fPIE T:avx2
gcc -march=native -mtune=native -O3 -fomit-frame-pointer -fwrapv -fPIC -fPIE T:avx2
gcc -march=native -mtune=native -Os -fomit-frame-pointer -fwrapv -fPIC -fPIE T:avx2
clang-17 -march=native -O2 -fomit-frame-pointer -fwrapv -Qunused-arguments -fPIC -fPIE T:opt
clang-17 -march=native -O3 -fomit-frame-pointer -fwrapv -Qunused-arguments -fPIC -fPIE T:opt
clang-17 -march=native -Os -fomit-frame-pointer -fwrapv -Qunused-arguments -fPIC -fPIE T:opt
gcc -march=native -mtune=native -O2 -fomit-frame-pointer -fwrapv -fPIC -fPIE T:opt
gcc -march=native -mtune=native -O3 -fomit-frame-pointer -fwrapv -fPIC -fPIE T:opt
gcc -march=native -mtune=native -Os -fomit-frame-pointer -fwrapv -fPIC -fPIE T:opt

Compiler output

Implementation: T:ref
Security model: timingleaks
Compiler: clang-17 -march=native -O2 -fomit-frame-pointer -fwrapv -Qunused-arguments -fPIC -fPIE
try.c: /usr/bin/ld: libcrypto_kem_r5n15kem0d.a(parameters.o):(.rodata+0x0): multiple definition of `r5_parameter_sets'; libcrypto_kem_r5n15kem0d.a(cpa_kem.o):(.rodata+0x0): first defined here
try.c: /usr/bin/ld: libcrypto_kem_r5n15kem0d.a(parameters.o):(.bss+0x40): multiple definition of `r5_parameter_set_names'; libcrypto_kem_r5n15kem0d.a(cpa_kem.o):(.bss+0x0): first defined here
try.c: /usr/bin/ld: libcrypto_kem_r5n15kem0d.a(r5_cpa_kem.o):(.rodata+0x0): multiple definition of `r5_parameter_sets'; libcrypto_kem_r5n15kem0d.a(cpa_kem.o):(.rodata+0x0): first defined here
try.c: /usr/bin/ld: libcrypto_kem_r5n15kem0d.a(r5_cpa_kem.o):(.bss+0x0): multiple definition of `r5_parameter_set_names'; libcrypto_kem_r5n15kem0d.a(cpa_kem.o):(.bss+0x0): first defined here
try.c: /usr/bin/ld: libcrypto_kem_r5n15kem0d.a(r5_cpa_pke.o):(.rodata+0x0): multiple definition of `r5_parameter_sets'; libcrypto_kem_r5n15kem0d.a(cpa_kem.o):(.rodata+0x0): first defined here
try.c: /usr/bin/ld: libcrypto_kem_r5n15kem0d.a(r5_cpa_pke.o):(.bss+0x0): multiple definition of `r5_parameter_set_names'; libcrypto_kem_r5n15kem0d.a(cpa_kem.o):(.bss+0x0): first defined here
try.c: /usr/bin/ld: libcrypto_kem_r5n15kem0d.a(r5_core.o):(.rodata+0x40): multiple definition of `r5_parameter_sets'; libcrypto_kem_r5n15kem0d.a(cpa_kem.o):(.rodata+0x0): first defined here
try.c: /usr/bin/ld: libcrypto_kem_r5n15kem0d.a(r5_core.o):(.bss+0x0): multiple definition of `r5_parameter_set_names'; libcrypto_kem_r5n15kem0d.a(cpa_kem.o):(.bss+0x0): first defined here
try.c: /usr/bin/ld: libcrypto_kem_r5n15kem0d.a(a_fixed.o):(.rodata+0x0): multiple definition of `r5_parameter_sets'; libcrypto_kem_r5n15kem0d.a(cpa_kem.o):(.rodata+0x0): first defined here
try.c: /usr/bin/ld: libcrypto_kem_r5n15kem0d.a(a_fixed.o):(.bss+0x10): multiple definition of `r5_parameter_set_names'; libcrypto_kem_r5n15kem0d.a(cpa_kem.o):(.bss+0x0): first defined here
try.c: /usr/bin/ld: libcrypto_kem_r5n15kem0d.a(a_random.o):(.rodata+0x0): multiple definition of `r5_parameter_sets'; libcrypto_kem_r5n15kem0d.a(cpa_kem.o):(.rodata+0x0): first defined here
try.c: /usr/bin/ld: libcrypto_kem_r5n15kem0d.a(a_random.o):(.bss+0x0): multiple definition of `r5_parameter_set_names'; libcrypto_kem_r5n15kem0d.a(cpa_kem.o):(.bss+0x0): first defined here
try.c: /usr/bin/ld: warning: KeccakP-1600-AVX2.o: missing .note.GNU-stack section implies executable stack
try.c: /usr/bin/ld: NOTE: This behaviour is deprecated and will be removed in a future version of the linker
try.c: clang-17: error: linker command failed with exit code 1 (use -v to see invocation)

Number of similar (compiler,implementation) pairs: 2, namely:
CompilerImplementations
clang-17 -march=native -O2 -fomit-frame-pointer -fwrapv -Qunused-arguments -fPIC -fPIE T:ref
clang-17 -march=native -O3 -fomit-frame-pointer -fwrapv -Qunused-arguments -fPIC -fPIE T:ref

Compiler output

Implementation: T:ref
Security model: timingleaks
Compiler: clang-17 -march=native -Os -fomit-frame-pointer -fwrapv -Qunused-arguments -fPIC -fPIE
try.c: /usr/bin/ld: libcrypto_kem_r5n15kem0d.a(parameters.o):(.rodata+0x0): multiple definition of `r5_parameter_sets'; libcrypto_kem_r5n15kem0d.a(cpa_kem.o):(.rodata+0x0): first defined here
try.c: /usr/bin/ld: libcrypto_kem_r5n15kem0d.a(parameters.o):(.bss+0x40): multiple definition of `r5_parameter_set_names'; libcrypto_kem_r5n15kem0d.a(cpa_kem.o):(.bss+0x0): first defined here
try.c: /usr/bin/ld: libcrypto_kem_r5n15kem0d.a(r5_cpa_kem.o):(.rodata+0x0): multiple definition of `r5_parameter_sets'; libcrypto_kem_r5n15kem0d.a(cpa_kem.o):(.rodata+0x0): first defined here
try.c: /usr/bin/ld: libcrypto_kem_r5n15kem0d.a(r5_cpa_kem.o):(.bss+0x0): multiple definition of `r5_parameter_set_names'; libcrypto_kem_r5n15kem0d.a(cpa_kem.o):(.bss+0x0): first defined here
try.c: /usr/bin/ld: libcrypto_kem_r5n15kem0d.a(r5_cpa_pke.o):(.rodata+0x100): multiple definition of `r5_parameter_sets'; libcrypto_kem_r5n15kem0d.a(cpa_kem.o):(.rodata+0x0): first defined here
try.c: /usr/bin/ld: libcrypto_kem_r5n15kem0d.a(r5_cpa_pke.o):(.bss+0x0): multiple definition of `r5_parameter_set_names'; libcrypto_kem_r5n15kem0d.a(cpa_kem.o):(.bss+0x0): first defined here
try.c: /usr/bin/ld: libcrypto_kem_r5n15kem0d.a(r5_core.o):(.rodata+0x340): multiple definition of `r5_parameter_sets'; libcrypto_kem_r5n15kem0d.a(cpa_kem.o):(.rodata+0x0): first defined here
try.c: /usr/bin/ld: libcrypto_kem_r5n15kem0d.a(r5_core.o):(.bss+0x0): multiple definition of `r5_parameter_set_names'; libcrypto_kem_r5n15kem0d.a(cpa_kem.o):(.bss+0x0): first defined here
try.c: /usr/bin/ld: libcrypto_kem_r5n15kem0d.a(a_fixed.o):(.rodata+0x100): multiple definition of `r5_parameter_sets'; libcrypto_kem_r5n15kem0d.a(cpa_kem.o):(.rodata+0x0): first defined here
try.c: /usr/bin/ld: libcrypto_kem_r5n15kem0d.a(a_fixed.o):(.bss+0x10): multiple definition of `r5_parameter_set_names'; libcrypto_kem_r5n15kem0d.a(cpa_kem.o):(.bss+0x0): first defined here
try.c: /usr/bin/ld: libcrypto_kem_r5n15kem0d.a(a_random.o):(.rodata+0x0): multiple definition of `r5_parameter_sets'; libcrypto_kem_r5n15kem0d.a(cpa_kem.o):(.rodata+0x0): first defined here
try.c: /usr/bin/ld: libcrypto_kem_r5n15kem0d.a(a_random.o):(.bss+0x0): multiple definition of `r5_parameter_set_names'; libcrypto_kem_r5n15kem0d.a(cpa_kem.o):(.bss+0x0): first defined here
try.c: /usr/bin/ld: warning: KeccakP-1600-AVX2.o: missing .note.GNU-stack section implies executable stack
try.c: /usr/bin/ld: NOTE: This behaviour is deprecated and will be removed in a future version of the linker
try.c: clang-17: error: linker command failed with exit code 1 (use -v to see invocation)

Number of similar (compiler,implementation) pairs: 1, namely:
CompilerImplementations
clang-17 -march=native -Os -fomit-frame-pointer -fwrapv -Qunused-arguments -fPIC -fPIE T:ref

Compiler output

Implementation: T:ref
Security model: timingleaks
Compiler: gcc -march=native -mtune=native -O2 -fomit-frame-pointer -fwrapv -fPIC -fPIE
try.c: /usr/bin/ld: libcrypto_kem_r5n15kem0d.a(parameters.o):(.bss+0x0): multiple definition of `r5_parameter_set_names'; libcrypto_kem_r5n15kem0d.a(cpa_kem.o):(.bss+0x0): first defined here
try.c: /usr/bin/ld: libcrypto_kem_r5n15kem0d.a(parameters.o):(.rodata+0x60): multiple definition of `r5_parameter_sets'; libcrypto_kem_r5n15kem0d.a(cpa_kem.o):(.rodata+0x0): first defined here
try.c: /usr/bin/ld: libcrypto_kem_r5n15kem0d.a(r5_cpa_kem.o):(.bss+0x0): multiple definition of `r5_parameter_set_names'; libcrypto_kem_r5n15kem0d.a(cpa_kem.o):(.bss+0x0): first defined here
try.c: /usr/bin/ld: libcrypto_kem_r5n15kem0d.a(r5_cpa_kem.o):(.rodata+0x0): multiple definition of `r5_parameter_sets'; libcrypto_kem_r5n15kem0d.a(cpa_kem.o):(.rodata+0x0): first defined here
try.c: /usr/bin/ld: libcrypto_kem_r5n15kem0d.a(r5_cpa_pke.o):(.bss+0x0): multiple definition of `r5_parameter_set_names'; libcrypto_kem_r5n15kem0d.a(cpa_kem.o):(.bss+0x0): first defined here
try.c: /usr/bin/ld: libcrypto_kem_r5n15kem0d.a(r5_cpa_pke.o):(.rodata+0x0): multiple definition of `r5_parameter_sets'; libcrypto_kem_r5n15kem0d.a(cpa_kem.o):(.rodata+0x0): first defined here
try.c: /usr/bin/ld: libcrypto_kem_r5n15kem0d.a(r5_core.o):(.bss+0x0): multiple definition of `r5_parameter_set_names'; libcrypto_kem_r5n15kem0d.a(cpa_kem.o):(.bss+0x0): first defined here
try.c: /usr/bin/ld: libcrypto_kem_r5n15kem0d.a(r5_core.o):(.rodata+0x20): multiple definition of `r5_parameter_sets'; libcrypto_kem_r5n15kem0d.a(cpa_kem.o):(.rodata+0x0): first defined here
try.c: /usr/bin/ld: libcrypto_kem_r5n15kem0d.a(a_fixed.o):(.bss+0x20): multiple definition of `r5_parameter_set_names'; libcrypto_kem_r5n15kem0d.a(cpa_kem.o):(.bss+0x0): first defined here
try.c: /usr/bin/ld: libcrypto_kem_r5n15kem0d.a(a_fixed.o):(.rodata+0x0): multiple definition of `r5_parameter_sets'; libcrypto_kem_r5n15kem0d.a(cpa_kem.o):(.rodata+0x0): first defined here
try.c: /usr/bin/ld: libcrypto_kem_r5n15kem0d.a(a_random.o):(.bss+0x0): multiple definition of `r5_parameter_set_names'; libcrypto_kem_r5n15kem0d.a(cpa_kem.o):(.bss+0x0): first defined here
try.c: /usr/bin/ld: libcrypto_kem_r5n15kem0d.a(a_random.o):(.rodata+0x0): multiple definition of `r5_parameter_sets'; libcrypto_kem_r5n15kem0d.a(cpa_kem.o):(.rodata+0x0): first defined here
try.c: /usr/bin/ld: warning: KeccakP-1600-AVX2.o: missing .note.GNU-stack section implies executable stack
try.c: /usr/bin/ld: NOTE: This behaviour is deprecated and will be removed in a future version of the linker
try.c: collect2: error: ld returned 1 exit status

Number of similar (compiler,implementation) pairs: 3, namely:
CompilerImplementations
gcc -march=native -mtune=native -O2 -fomit-frame-pointer -fwrapv -fPIC -fPIE T:ref
gcc -march=native -mtune=native -O3 -fomit-frame-pointer -fwrapv -fPIC -fPIE T:ref
gcc -march=native -mtune=native -Os -fomit-frame-pointer -fwrapv -fPIC -fPIE T:ref