Test results for amd64, hertz, crypto_hash/sha3256

[Page version: 20261007 20:07:58]

Measurements for amd64, hertz, crypto_hash Test results for amd64, hertz, crypto_hash Test results for crypto_hash/sha3256
Computer: hertz
Microarchitecture: amd64; Zen 4 (a60f12)
Architecture: amd64
CPU ID: AuthenticAMD-00a60f12-178bfbff
SUPERCOP version: 20261004
Operation: crypto_hash
Primitive: sha3256
TimeObject sizeTest sizeImplementationCompilerBenchmark dateSUPERCOP version
107641508 0 0107738 1296 1568oncore64bitsclang -march=native -O3 -fwrapv -Qunused-arguments -fPIC -fPIE -gdwarf-4 -Wall2026100620261004
10764632 0 099042 1296 1504oncore64bitsclang -march=native -O -fwrapv -Qunused-arguments -fPIC -fPIE -gdwarf-4 -Wall2026100620261004
107661508 0 0106266 1296 1568oncore64bitsclang -march=native -O2 -fwrapv -Qunused-arguments -fPIC -fPIE -gdwarf-4 -Wall2026100620261004
10770902 0 0100781 1264 1664oncore64bitsgcc -march=native -mtune=native -O2 -fwrapv -fPIC -fPIE -gdwarf-4 -Wall2026100620261004
10820603 0 099045 1256 1568oncore64bitsgcc -march=native -mtune=native -Os -fwrapv -fPIC -fPIE -gdwarf-4 -Wall2026100620261004
10833789 0 0100549 1264 1600oncore64bitsgcc -march=native -mtune=native -O -fwrapv -fPIC -fPIE -gdwarf-4 -Wall2026100620261004
11019590 0 099708 1288 1568oncore64bitsclang -march=native -Os -fwrapv -Qunused-arguments -fPIC -fPIE -gdwarf-4 -Wall2026100620261004
118811191 0 0104717 1264 1664oncore64bitsgcc -march=native -mtune=native -O3 -fwrapv -fPIC -fPIE -gdwarf-4 -Wall2026100620261004
12692317 0 028392 1328 1664opensslgcc -march=native -mtune=native -O3 -fwrapv -fPIC -fPIE -gdwarf-4 -Wall2026100620261004
12700327 0 024519 1320 1600opensslgcc -march=native -mtune=native -O -fwrapv -fPIC -fPIE -gdwarf-4 -Wall2026100620261004
12701245 0 029438 1344 1568opensslclang -march=native -O2 -fwrapv -Qunused-arguments -fPIC -fPIE -gdwarf-4 -Wall2026100620261004
12711245 0 023784 1336 1568opensslclang -march=native -Os -fwrapv -Qunused-arguments -fPIC -fPIE -gdwarf-4 -Wall2026100620261004
12712243 0 022990 1344 1504opensslclang -march=native -O -fwrapv -Qunused-arguments -fPIC -fPIE -gdwarf-4 -Wall2026100620261004
12727245 0 030910 1344 1568opensslclang -march=native -O3 -fwrapv -Qunused-arguments -fPIC -fPIE -gdwarf-4 -Wall2026100620261004
12801295 0 023011 1304 1568opensslgcc -march=native -mtune=native -Os -fwrapv -fPIC -fPIE -gdwarf-4 -Wall2026100620261004
12899133 0 028737 1232 1568usekcpgcc -march=native -mtune=native -Os -fwrapv -fPIC -fPIE -gdwarf-4 -Wall2026100620261004
1296989 0 029443 1288 1504usekcpclang -march=native -O -fwrapv -Qunused-arguments -fPIC -fPIE -gdwarf-4 -Wall2026100620261004
1304689 0 037363 1288 1568usekcpclang -march=native -O3 -fwrapv -Qunused-arguments -fPIC -fPIE -gdwarf-4 -Wall2026100620261004
13101317 0 024712 1328 1664opensslgcc -march=native -mtune=native -O2 -fwrapv -fPIC -fPIE -gdwarf-4 -Wall2026100620261004
1311889 0 035891 1288 1568usekcpclang -march=native -O2 -fwrapv -Qunused-arguments -fPIC -fPIE -gdwarf-4 -Wall2026100620261004
13132133 0 030205 1248 1600usekcpgcc -march=native -mtune=native -O -fwrapv -fPIC -fPIE -gdwarf-4 -Wall2026100620261004
13175133 0 034062 1256 1664usekcpgcc -march=native -mtune=native -O3 -fwrapv -fPIC -fPIE -gdwarf-4 -Wall2026100620261004
1320389 0 030237 1280 1568usekcpclang -march=native -Os -fwrapv -Qunused-arguments -fPIC -fPIE -gdwarf-4 -Wall2026100620261004
13334133 0 030382 1256 1664usekcpgcc -march=native -mtune=native -O2 -fwrapv -fPIC -fPIE -gdwarf-4 -Wall2026100620261004
1600732366 0 062555 1288 1568kcp/optimized1600AVX512clang -march=native -O3 -fwrapv -Qunused-arguments -fPIC -fPIE -gdwarf-4 -Wall2026100620261004
1603828195 0 050749 1280 1568kcp/optimized1600AVX512clang -march=native -Os -fwrapv -Qunused-arguments -fPIC -fPIE -gdwarf-4 -Wall2026100620261004
1605531565 0 060331 1288 1568kcp/optimized1600AVX512clang -march=native -O2 -fwrapv -Qunused-arguments -fPIC -fPIE -gdwarf-4 -Wall2026100620261004
1624325378 0 049174 1256 1664kcp/optimized1600AVX512gcc -march=native -mtune=native -O2 -fwrapv -fPIC -fPIE -gdwarf-4 -Wall2026100620261004
1624528235 0 050547 1288 1504kcp/optimized1600AVX512clang -march=native -O -fwrapv -Qunused-arguments -fPIC -fPIE -gdwarf-4 -Wall2026100620261004
1653625757 0 049470 1256 1600kcp/optimized1600AVX512gcc -march=native -mtune=native -O -fwrapv -fPIC -fPIE -gdwarf-4 -Wall2026100620261004
1655226137 0 053598 1256 1664kcp/optimized1600AVX512gcc -march=native -mtune=native -O3 -fwrapv -fPIC -fPIE -gdwarf-4 -Wall2026100620261004
1665623670 0 045713 1232 1568kcp/optimized1600AVX512gcc -march=native -mtune=native -Os -fwrapv -fPIC -fPIE -gdwarf-4 -Wall2026100620261004
287663207 0 054891 1288 1568oncore32bitsclang -march=native -O2 -fwrapv -Qunused-arguments -fPIC -fPIE -gdwarf-4 -Wall2026100620261004
288372827 0 055915 1288 1568oncore32bitsclang -march=native -O3 -fwrapv -Qunused-arguments -fPIC -fPIE -gdwarf-4 -Wall2026100620261004
289046789 0 056606 1256 1664oncore32bitsgcc -march=native -mtune=native -O3 -fwrapv -fPIC -fPIE -gdwarf-4 -Wall2026100620261004
304271941 0 048190 1256 1664oncore32bitsgcc -march=native -mtune=native -O2 -fwrapv -fPIC -fPIE -gdwarf-4 -Wall2026100620261004
315801333 0 046635 1288 1504oncore32bitsclang -march=native -O -fwrapv -Qunused-arguments -fPIC -fPIE -gdwarf-4 -Wall2026100620261004
316041507 0 047493 1280 1568oncore32bitsclang -march=native -Os -fwrapv -Qunused-arguments -fPIC -fPIE -gdwarf-4 -Wall2026100620261004
319341668 0 046414 1248 1568oncore32bitsgcc -march=native -mtune=native -Os -fwrapv -fPIC -fPIE -gdwarf-4 -Wall2026100620261004
319931932 0 048181 1264 1600oncore32bitsgcc -march=native -mtune=native -O -fwrapv -fPIC -fPIE -gdwarf-4 -Wall2026100620261004
747424110 0 034195 1288 1568compactclang -march=native -O3 -fwrapv -Qunused-arguments -fPIC -fPIE -gdwarf-4 -Wall2026100620261004
945565785 0 033022 1256 1664compactgcc -march=native -mtune=native -O3 -fwrapv -fPIC -fPIE -gdwarf-4 -Wall2026100620261004
1018943048 0 031675 1288 1568compactclang -march=native -O2 -fwrapv -Qunused-arguments -fPIC -fPIE -gdwarf-4 -Wall2026100620261004
1199011168 0 023275 1288 1504compactclang -march=native -O -fwrapv -Qunused-arguments -fPIC -fPIE -gdwarf-4 -Wall2026100620261004
1429731925 0 025606 1256 1664compactgcc -march=native -mtune=native -O2 -fwrapv -fPIC -fPIE -gdwarf-4 -Wall2026100620261004
2008961379 0 024829 1248 1600compactgcc -march=native -mtune=native -O -fwrapv -fPIC -fPIE -gdwarf-4 -Wall2026100620261004
2162721603 0 024581 1280 1568compactclang -march=native -Os -fwrapv -Qunused-arguments -fPIC -fPIE -gdwarf-4 -Wall2026100620261004
222326951 0 022897 1232 1568compactgcc -march=native -mtune=native -Os -fwrapv -fPIC -fPIE -gdwarf-4 -Wall2026100620261004

Compiler output


KeccakP-1600-AVX2.c: KeccakP-1600-AVX2.c:28:17: warning: unknown pragma ignored [-Wunknown-pragmas]
KeccakP-1600-AVX2.c:    28 |     #pragma GCC optimize("2")
KeccakP-1600-AVX2.c:       |                 ^
KeccakP-1600-AVX2.c: KeccakP-1600-AVX2.c:637:5: warning: unused variable 'SLLV_A0' [-Wunused-variable]
KeccakP-1600-AVX2.c:   637 |     KECCAK_CONSTANTS
KeccakP-1600-AVX2.c:       |     ^~~~~~~~~~~~~~~~
KeccakP-1600-AVX2.c: KeccakP-1600-AVX2.c:94:32: note: expanded from macro 'KECCAK_CONSTANTS'
KeccakP-1600-AVX2.c:    94 | ROLV_CONST(C4, 27, 20, 39,  8) \
KeccakP-1600-AVX2.c:       |                                ^
KeccakP-1600-AVX2.c:    95 | _ROLV_CONST(_A0,  0,  1, 62, 28) \
KeccakP-1600-AVX2.c:       | ~~~~~~~~~~~~~~~~~~~~~~~~~~~~~~~~
KeccakP-1600-AVX2.c: KeccakP-1600-AVX2.c:85:17: note: expanded from macro '\
KeccakP-1600-AVX2.c: _ROLV_CONST'
KeccakP-1600-AVX2.c:    85 |     _ROLV_TYPE  SLLV##name = SET(i0, i1, i2, i3); \
KeccakP-1600-AVX2.c:       |                 ^~~~~~~~~~
KeccakP-1600-AVX2.c: <scratch space>:153:1: note: expanded from here
KeccakP-1600-AVX2.c:   153 | SLLV_A0
KeccakP-1600-AVX2.c:       | ^~~~~~~
KeccakP-1600-AVX2.c: KeccakP-1600-AVX2.c:637:5: warning: unused variable 'SRLV_A0' [-Wunused-variable]
KeccakP-1600-AVX2.c:   637 |     KECCAK_CONSTANTS
KeccakP-1600-AVX2.c:       |     ^~~~~~~~~~~~~~~~
KeccakP-1600-AVX2.c: KeccakP-1600-AVX2.c:94:32: note: expanded from macro 'KECCAK_CONSTANTS'
KeccakP-1600-AVX2.c:    94 | ROLV_CONST(C4, 27, 20, 39,  8) \
KeccakP-1600-AVX2.c:       |                                ^
KeccakP-1600-AVX2.c:    95 | _ROLV_CONST(_A0,  0,  1, 62, 28) \
KeccakP-1600-AVX2.c: ...
try.c: /usr/bin/x86_64-linux-gnu-ld.bfd: libcrypto_hash_sha3256.a(SHA3-256.o): in function `crypto_hash_sha3256_kcp_optimized1600AVX2_constbranchindex':
try.c: .../supercop-data/hertz/amd64/try/c/clang_-march=native_-O2_-fwrapv_-Qunused-arguments_-fPIC_-fPIE_-gdwarf-4_-Wall/constbranchindex/crypto_hash/sha3256/kcp/optimized1600AVX2/work/SHA3-256.c:24:(.text+0x...): undefined reference to `KeccakWidth1600_Sponge'
try.c: clang: error: linker command failed with exit code 1 (use -v to see invocation)

Number of similar (implementation,compiler) pairs: 1, namely:
ImplementationCompiler
kcp/optimized1600AVX2clang -march=native -O2 -fwrapv -Qunused-arguments -fPIC -fPIE -gdwarf-4 -Wall (Ubuntu_Clang_21.1.8_(6ubuntu1))

Compiler output


KeccakP-1600-AVX2.c: KeccakP-1600-AVX2.c:28:17: warning: unknown pragma ignored [-Wunknown-pragmas]
KeccakP-1600-AVX2.c:    28 |     #pragma GCC optimize("2")
KeccakP-1600-AVX2.c:       |                 ^
KeccakP-1600-AVX2.c: KeccakP-1600-AVX2.c:637:5: warning: unused variable 'SLLV_A0' [-Wunused-variable]
KeccakP-1600-AVX2.c:   637 |     KECCAK_CONSTANTS
KeccakP-1600-AVX2.c:       |     ^~~~~~~~~~~~~~~~
KeccakP-1600-AVX2.c: KeccakP-1600-AVX2.c:94:32: note: expanded from macro 'KECCAK_CONSTANTS'
KeccakP-1600-AVX2.c:    94 | ROLV_CONST(C4, 27, 20, 39,  8) \
KeccakP-1600-AVX2.c:       |                                ^
KeccakP-1600-AVX2.c:    95 | _ROLV_CONST(_A0,  0,  1, 62, 28) \
KeccakP-1600-AVX2.c:       | ~~~~~~~~~~~~~~~~~~~~~~~~~~~~~~~~
KeccakP-1600-AVX2.c: KeccakP-1600-AVX2.c:85:17: note: expanded from macro '\
KeccakP-1600-AVX2.c: _ROLV_CONST'
KeccakP-1600-AVX2.c:    85 |     _ROLV_TYPE  SLLV##name = SET(i0, i1, i2, i3); \
KeccakP-1600-AVX2.c:       |                 ^~~~~~~~~~
KeccakP-1600-AVX2.c: <scratch space>:153:1: note: expanded from here
KeccakP-1600-AVX2.c:   153 | SLLV_A0
KeccakP-1600-AVX2.c:       | ^~~~~~~
KeccakP-1600-AVX2.c: KeccakP-1600-AVX2.c:637:5: warning: unused variable 'SRLV_A0' [-Wunused-variable]
KeccakP-1600-AVX2.c:   637 |     KECCAK_CONSTANTS
KeccakP-1600-AVX2.c:       |     ^~~~~~~~~~~~~~~~
KeccakP-1600-AVX2.c: KeccakP-1600-AVX2.c:94:32: note: expanded from macro 'KECCAK_CONSTANTS'
KeccakP-1600-AVX2.c:    94 | ROLV_CONST(C4, 27, 20, 39,  8) \
KeccakP-1600-AVX2.c:       |                                ^
KeccakP-1600-AVX2.c:    95 | _ROLV_CONST(_A0,  0,  1, 62, 28) \
KeccakP-1600-AVX2.c: ...
try.c: /usr/bin/x86_64-linux-gnu-ld.bfd: libcrypto_hash_sha3256.a(SHA3-256.o): in function `crypto_hash_sha3256_kcp_optimized1600AVX2_constbranchindex':
try.c: .../supercop-data/hertz/amd64/try/c/clang_-march=native_-O3_-fwrapv_-Qunused-arguments_-fPIC_-fPIE_-gdwarf-4_-Wall/constbranchindex/crypto_hash/sha3256/kcp/optimized1600AVX2/work/SHA3-256.c:24:(.text+0x...): undefined reference to `KeccakWidth1600_Sponge'
try.c: clang: error: linker command failed with exit code 1 (use -v to see invocation)

Number of similar (implementation,compiler) pairs: 1, namely:
ImplementationCompiler
kcp/optimized1600AVX2clang -march=native -O3 -fwrapv -Qunused-arguments -fPIC -fPIE -gdwarf-4 -Wall (Ubuntu_Clang_21.1.8_(6ubuntu1))

Compiler output


KeccakP-1600-AVX2.c: KeccakP-1600-AVX2.c:28:17: warning: unknown pragma ignored [-Wunknown-pragmas]
KeccakP-1600-AVX2.c:    28 |     #pragma GCC optimize("2")
KeccakP-1600-AVX2.c:       |                 ^
KeccakP-1600-AVX2.c: KeccakP-1600-AVX2.c:637:5: warning: unused variable 'SLLV_A0' [-Wunused-variable]
KeccakP-1600-AVX2.c:   637 |     KECCAK_CONSTANTS
KeccakP-1600-AVX2.c:       |     ^~~~~~~~~~~~~~~~
KeccakP-1600-AVX2.c: KeccakP-1600-AVX2.c:94:32: note: expanded from macro 'KECCAK_CONSTANTS'
KeccakP-1600-AVX2.c:    94 | ROLV_CONST(C4, 27, 20, 39,  8) \
KeccakP-1600-AVX2.c:       |                                ^
KeccakP-1600-AVX2.c:    95 | _ROLV_CONST(_A0,  0,  1, 62, 28) \
KeccakP-1600-AVX2.c:       | ~~~~~~~~~~~~~~~~~~~~~~~~~~~~~~~~
KeccakP-1600-AVX2.c: KeccakP-1600-AVX2.c:85:17: note: expanded from macro '\
KeccakP-1600-AVX2.c: _ROLV_CONST'
KeccakP-1600-AVX2.c:    85 |     _ROLV_TYPE  SLLV##name = SET(i0, i1, i2, i3); \
KeccakP-1600-AVX2.c:       |                 ^~~~~~~~~~
KeccakP-1600-AVX2.c: <scratch space>:153:1: note: expanded from here
KeccakP-1600-AVX2.c:   153 | SLLV_A0
KeccakP-1600-AVX2.c:       | ^~~~~~~
KeccakP-1600-AVX2.c: KeccakP-1600-AVX2.c:637:5: warning: unused variable 'SRLV_A0' [-Wunused-variable]
KeccakP-1600-AVX2.c:   637 |     KECCAK_CONSTANTS
KeccakP-1600-AVX2.c:       |     ^~~~~~~~~~~~~~~~
KeccakP-1600-AVX2.c: KeccakP-1600-AVX2.c:94:32: note: expanded from macro 'KECCAK_CONSTANTS'
KeccakP-1600-AVX2.c:    94 | ROLV_CONST(C4, 27, 20, 39,  8) \
KeccakP-1600-AVX2.c:       |                                ^
KeccakP-1600-AVX2.c:    95 | _ROLV_CONST(_A0,  0,  1, 62, 28) \
KeccakP-1600-AVX2.c: ...
try.c: /usr/bin/x86_64-linux-gnu-ld.bfd: libcrypto_hash_sha3256.a(SHA3-256.o): in function `crypto_hash_sha3256_kcp_optimized1600AVX2_constbranchindex':
try.c: .../supercop-data/hertz/amd64/try/c/clang_-march=native_-O_-fwrapv_-Qunused-arguments_-fPIC_-fPIE_-gdwarf-4_-Wall/constbranchindex/crypto_hash/sha3256/kcp/optimized1600AVX2/work/SHA3-256.c:24:(.text+0x...): undefined reference to `KeccakWidth1600_Sponge'
try.c: clang: error: linker command failed with exit code 1 (use -v to see invocation)

Number of similar (implementation,compiler) pairs: 1, namely:
ImplementationCompiler
kcp/optimized1600AVX2clang -march=native -O -fwrapv -Qunused-arguments -fPIC -fPIE -gdwarf-4 -Wall (Ubuntu_Clang_21.1.8_(6ubuntu1))

Compiler output


KeccakP-1600-AVX2.c: KeccakP-1600-AVX2.c:28:17: warning: unknown pragma ignored [-Wunknown-pragmas]
KeccakP-1600-AVX2.c:    28 |     #pragma GCC optimize("2")
KeccakP-1600-AVX2.c:       |                 ^
KeccakP-1600-AVX2.c: KeccakP-1600-AVX2.c:637:5: warning: unused variable 'SLLV_A0' [-Wunused-variable]
KeccakP-1600-AVX2.c:   637 |     KECCAK_CONSTANTS
KeccakP-1600-AVX2.c:       |     ^~~~~~~~~~~~~~~~
KeccakP-1600-AVX2.c: KeccakP-1600-AVX2.c:94:32: note: expanded from macro 'KECCAK_CONSTANTS'
KeccakP-1600-AVX2.c:    94 | ROLV_CONST(C4, 27, 20, 39,  8) \
KeccakP-1600-AVX2.c:       |                                ^
KeccakP-1600-AVX2.c:    95 | _ROLV_CONST(_A0,  0,  1, 62, 28) \
KeccakP-1600-AVX2.c:       | ~~~~~~~~~~~~~~~~~~~~~~~~~~~~~~~~
KeccakP-1600-AVX2.c: KeccakP-1600-AVX2.c:85:17: note: expanded from macro '\
KeccakP-1600-AVX2.c: _ROLV_CONST'
KeccakP-1600-AVX2.c:    85 |     _ROLV_TYPE  SLLV##name = SET(i0, i1, i2, i3); \
KeccakP-1600-AVX2.c:       |                 ^~~~~~~~~~
KeccakP-1600-AVX2.c: <scratch space>:153:1: note: expanded from here
KeccakP-1600-AVX2.c:   153 | SLLV_A0
KeccakP-1600-AVX2.c:       | ^~~~~~~
KeccakP-1600-AVX2.c: KeccakP-1600-AVX2.c:637:5: warning: unused variable 'SRLV_A0' [-Wunused-variable]
KeccakP-1600-AVX2.c:   637 |     KECCAK_CONSTANTS
KeccakP-1600-AVX2.c:       |     ^~~~~~~~~~~~~~~~
KeccakP-1600-AVX2.c: KeccakP-1600-AVX2.c:94:32: note: expanded from macro 'KECCAK_CONSTANTS'
KeccakP-1600-AVX2.c:    94 | ROLV_CONST(C4, 27, 20, 39,  8) \
KeccakP-1600-AVX2.c:       |                                ^
KeccakP-1600-AVX2.c:    95 | _ROLV_CONST(_A0,  0,  1, 62, 28) \
KeccakP-1600-AVX2.c: ...
try.c: /usr/bin/x86_64-linux-gnu-ld.bfd: libcrypto_hash_sha3256.a(SHA3-256.o): in function `crypto_hash_sha3256_kcp_optimized1600AVX2_constbranchindex':
try.c: .../supercop-data/hertz/amd64/try/c/clang_-march=native_-Os_-fwrapv_-Qunused-arguments_-fPIC_-fPIE_-gdwarf-4_-Wall/constbranchindex/crypto_hash/sha3256/kcp/optimized1600AVX2/work/SHA3-256.c:24:(.text+0x...): undefined reference to `KeccakWidth1600_Sponge'
try.c: clang: error: linker command failed with exit code 1 (use -v to see invocation)

Number of similar (implementation,compiler) pairs: 1, namely:
ImplementationCompiler
kcp/optimized1600AVX2clang -march=native -Os -fwrapv -Qunused-arguments -fPIC -fPIE -gdwarf-4 -Wall (Ubuntu_Clang_21.1.8_(6ubuntu1))

Compiler output


KeccakP-1600-AVX2.c: KeccakP-1600-AVX2.c: In function 'crypto_hash_sha3256_kcp_optimized1600AVX2_constbranchindex_KeccakP1600_Permute_Nrounds':
KeccakP-1600-AVX2.c: KeccakP-1600-AVX2.c:86:17: warning: unused variable 'SRLV_C4' [-Wunused-variable]
KeccakP-1600-AVX2.c:    86 |     _ROLV_TYPE  SRLV##name = SET(64 - i0, 64 - i1, 64 - i2, 64 - i3);
KeccakP-1600-AVX2.c:       |                 ^~~~
KeccakP-1600-AVX2.c: KeccakP-1600-AVX2.c:100:1: note: in expansion of macro '_ROLV_CONST'
KeccakP-1600-AVX2.c:   100 | _ROLV_CONST(_C4, 27, 20, 39,  8)
KeccakP-1600-AVX2.c:       | ^~~~~~~~~~~
KeccakP-1600-AVX2.c: KeccakP-1600-AVX2.c:637:5: note: in expansion of macro 'KECCAK_CONSTANTS'
KeccakP-1600-AVX2.c:   637 |     KECCAK_CONSTANTS
KeccakP-1600-AVX2.c:       |     ^~~~~~~~~~~~~~~~
KeccakP-1600-AVX2.c: KeccakP-1600-AVX2.c:85:17: warning: unused variable 'SLLV_C4' [-Wunused-variable]
KeccakP-1600-AVX2.c:    85 |     _ROLV_TYPE  SLLV##name = SET(i0, i1, i2, i3); \
KeccakP-1600-AVX2.c:       |                 ^~~~
KeccakP-1600-AVX2.c: KeccakP-1600-AVX2.c:100:1: note: in expansion of macro '_ROLV_CONST'
KeccakP-1600-AVX2.c:   100 | _ROLV_CONST(_C4, 27, 20, 39,  8)
KeccakP-1600-AVX2.c:       | ^~~~~~~~~~~
KeccakP-1600-AVX2.c: KeccakP-1600-AVX2.c:637:5: note: in expansion of macro 'KECCAK_CONSTANTS'
KeccakP-1600-AVX2.c:   637 |     KECCAK_CONSTANTS
KeccakP-1600-AVX2.c:       |     ^~~~~~~~~~~~~~~~
KeccakP-1600-AVX2.c: KeccakP-1600-AVX2.c:86:17: warning: unused variable 'SRLV_A4' [-Wunused-variable]
KeccakP-1600-AVX2.c:    86 |     _ROLV_TYPE  SRLV##name = SET(64 - i0, 64 - i1, 64 - i2, 64 - i3);
KeccakP-1600-AVX2.c:       |                 ^~~~
KeccakP-1600-AVX2.c: KeccakP-1600-AVX2.c:99:1: note: in expansion of macro '_ROLV_CONST'
KeccakP-1600-AVX2.c:    99 | _ROLV_CONST(_A4, 18,  2, 61, 56) \
KeccakP-1600-AVX2.c:       | ^~~~~~~~~~~
KeccakP-1600-AVX2.c: ...
try.c: /usr/bin/x86_64-linux-gnu-ld.bfd: libcrypto_hash_sha3256.a(SHA3-256.o): in function `crypto_hash_sha3256_kcp_optimized1600AVX2_constbranchindex':
try.c: .../supercop-data/hertz/amd64/try/c/gcc_-march=native_-mtune=native_-O2_-fwrapv_-fPIC_-fPIE_-gdwarf-4_-Wall/constbranchindex/crypto_hash/sha3256/kcp/optimized1600AVX2/work/SHA3-256.c:24:(.text+0x...): undefined reference to `KeccakWidth1600_Sponge'
try.c: collect2: error: ld returned 1 exit status

Number of similar (implementation,compiler) pairs: 1, namely:
ImplementationCompiler
kcp/optimized1600AVX2gcc -march=native -mtune=native -O2 -fwrapv -fPIC -fPIE -gdwarf-4 -Wall (15.2.0)

Compiler output


KeccakP-1600-AVX2.c: KeccakP-1600-AVX2.c: In function 'crypto_hash_sha3256_kcp_optimized1600AVX2_constbranchindex_KeccakP1600_Permute_Nrounds':
KeccakP-1600-AVX2.c: KeccakP-1600-AVX2.c:86:17: warning: unused variable 'SRLV_C4' [-Wunused-variable]
KeccakP-1600-AVX2.c:    86 |     _ROLV_TYPE  SRLV##name = SET(64 - i0, 64 - i1, 64 - i2, 64 - i3);
KeccakP-1600-AVX2.c:       |                 ^~~~
KeccakP-1600-AVX2.c: KeccakP-1600-AVX2.c:100:1: note: in expansion of macro '_ROLV_CONST'
KeccakP-1600-AVX2.c:   100 | _ROLV_CONST(_C4, 27, 20, 39,  8)
KeccakP-1600-AVX2.c:       | ^~~~~~~~~~~
KeccakP-1600-AVX2.c: KeccakP-1600-AVX2.c:637:5: note: in expansion of macro 'KECCAK_CONSTANTS'
KeccakP-1600-AVX2.c:   637 |     KECCAK_CONSTANTS
KeccakP-1600-AVX2.c:       |     ^~~~~~~~~~~~~~~~
KeccakP-1600-AVX2.c: KeccakP-1600-AVX2.c:85:17: warning: unused variable 'SLLV_C4' [-Wunused-variable]
KeccakP-1600-AVX2.c:    85 |     _ROLV_TYPE  SLLV##name = SET(i0, i1, i2, i3); \
KeccakP-1600-AVX2.c:       |                 ^~~~
KeccakP-1600-AVX2.c: KeccakP-1600-AVX2.c:100:1: note: in expansion of macro '_ROLV_CONST'
KeccakP-1600-AVX2.c:   100 | _ROLV_CONST(_C4, 27, 20, 39,  8)
KeccakP-1600-AVX2.c:       | ^~~~~~~~~~~
KeccakP-1600-AVX2.c: KeccakP-1600-AVX2.c:637:5: note: in expansion of macro 'KECCAK_CONSTANTS'
KeccakP-1600-AVX2.c:   637 |     KECCAK_CONSTANTS
KeccakP-1600-AVX2.c:       |     ^~~~~~~~~~~~~~~~
KeccakP-1600-AVX2.c: KeccakP-1600-AVX2.c:86:17: warning: unused variable 'SRLV_A4' [-Wunused-variable]
KeccakP-1600-AVX2.c:    86 |     _ROLV_TYPE  SRLV##name = SET(64 - i0, 64 - i1, 64 - i2, 64 - i3);
KeccakP-1600-AVX2.c:       |                 ^~~~
KeccakP-1600-AVX2.c: KeccakP-1600-AVX2.c:99:1: note: in expansion of macro '_ROLV_CONST'
KeccakP-1600-AVX2.c:    99 | _ROLV_CONST(_A4, 18,  2, 61, 56) \
KeccakP-1600-AVX2.c:       | ^~~~~~~~~~~
KeccakP-1600-AVX2.c: ...
try.c: /usr/bin/x86_64-linux-gnu-ld.bfd: libcrypto_hash_sha3256.a(SHA3-256.o): in function `crypto_hash_sha3256_kcp_optimized1600AVX2_constbranchindex':
try.c: .../supercop-data/hertz/amd64/try/c/gcc_-march=native_-mtune=native_-O3_-fwrapv_-fPIC_-fPIE_-gdwarf-4_-Wall/constbranchindex/crypto_hash/sha3256/kcp/optimized1600AVX2/work/SHA3-256.c:24:(.text+0x...): undefined reference to `KeccakWidth1600_Sponge'
try.c: collect2: error: ld returned 1 exit status

Number of similar (implementation,compiler) pairs: 1, namely:
ImplementationCompiler
kcp/optimized1600AVX2gcc -march=native -mtune=native -O3 -fwrapv -fPIC -fPIE -gdwarf-4 -Wall (15.2.0)

Compiler output


KeccakP-1600-AVX2.c: KeccakP-1600-AVX2.c: In function 'crypto_hash_sha3256_kcp_optimized1600AVX2_constbranchindex_KeccakP1600_Permute_Nrounds':
KeccakP-1600-AVX2.c: KeccakP-1600-AVX2.c:86:17: warning: unused variable 'SRLV_C4' [-Wunused-variable]
KeccakP-1600-AVX2.c:    86 |     _ROLV_TYPE  SRLV##name = SET(64 - i0, 64 - i1, 64 - i2, 64 - i3);
KeccakP-1600-AVX2.c:       |                 ^~~~
KeccakP-1600-AVX2.c: KeccakP-1600-AVX2.c:100:1: note: in expansion of macro '_ROLV_CONST'
KeccakP-1600-AVX2.c:   100 | _ROLV_CONST(_C4, 27, 20, 39,  8)
KeccakP-1600-AVX2.c:       | ^~~~~~~~~~~
KeccakP-1600-AVX2.c: KeccakP-1600-AVX2.c:637:5: note: in expansion of macro 'KECCAK_CONSTANTS'
KeccakP-1600-AVX2.c:   637 |     KECCAK_CONSTANTS
KeccakP-1600-AVX2.c:       |     ^~~~~~~~~~~~~~~~
KeccakP-1600-AVX2.c: KeccakP-1600-AVX2.c:85:17: warning: unused variable 'SLLV_C4' [-Wunused-variable]
KeccakP-1600-AVX2.c:    85 |     _ROLV_TYPE  SLLV##name = SET(i0, i1, i2, i3); \
KeccakP-1600-AVX2.c:       |                 ^~~~
KeccakP-1600-AVX2.c: KeccakP-1600-AVX2.c:100:1: note: in expansion of macro '_ROLV_CONST'
KeccakP-1600-AVX2.c:   100 | _ROLV_CONST(_C4, 27, 20, 39,  8)
KeccakP-1600-AVX2.c:       | ^~~~~~~~~~~
KeccakP-1600-AVX2.c: KeccakP-1600-AVX2.c:637:5: note: in expansion of macro 'KECCAK_CONSTANTS'
KeccakP-1600-AVX2.c:   637 |     KECCAK_CONSTANTS
KeccakP-1600-AVX2.c:       |     ^~~~~~~~~~~~~~~~
KeccakP-1600-AVX2.c: KeccakP-1600-AVX2.c:86:17: warning: unused variable 'SRLV_A4' [-Wunused-variable]
KeccakP-1600-AVX2.c:    86 |     _ROLV_TYPE  SRLV##name = SET(64 - i0, 64 - i1, 64 - i2, 64 - i3);
KeccakP-1600-AVX2.c:       |                 ^~~~
KeccakP-1600-AVX2.c: KeccakP-1600-AVX2.c:99:1: note: in expansion of macro '_ROLV_CONST'
KeccakP-1600-AVX2.c:    99 | _ROLV_CONST(_A4, 18,  2, 61, 56) \
KeccakP-1600-AVX2.c:       | ^~~~~~~~~~~
KeccakP-1600-AVX2.c: ...
try.c: /usr/bin/x86_64-linux-gnu-ld.bfd: libcrypto_hash_sha3256.a(SHA3-256.o): in function `crypto_hash_sha3256_kcp_optimized1600AVX2_constbranchindex':
try.c: .../supercop-data/hertz/amd64/try/c/gcc_-march=native_-mtune=native_-O_-fwrapv_-fPIC_-fPIE_-gdwarf-4_-Wall/constbranchindex/crypto_hash/sha3256/kcp/optimized1600AVX2/work/SHA3-256.c:24:(.text+0x...): undefined reference to `KeccakWidth1600_Sponge'
try.c: collect2: error: ld returned 1 exit status

Number of similar (implementation,compiler) pairs: 1, namely:
ImplementationCompiler
kcp/optimized1600AVX2gcc -march=native -mtune=native -O -fwrapv -fPIC -fPIE -gdwarf-4 -Wall (15.2.0)

Compiler output


KeccakP-1600-AVX2.c: KeccakP-1600-AVX2.c: In function 'crypto_hash_sha3256_kcp_optimized1600AVX2_constbranchindex_KeccakP1600_Permute_Nrounds':
KeccakP-1600-AVX2.c: KeccakP-1600-AVX2.c:86:17: warning: unused variable 'SRLV_C4' [-Wunused-variable]
KeccakP-1600-AVX2.c:    86 |     _ROLV_TYPE  SRLV##name = SET(64 - i0, 64 - i1, 64 - i2, 64 - i3);
KeccakP-1600-AVX2.c:       |                 ^~~~
KeccakP-1600-AVX2.c: KeccakP-1600-AVX2.c:100:1: note: in expansion of macro '_ROLV_CONST'
KeccakP-1600-AVX2.c:   100 | _ROLV_CONST(_C4, 27, 20, 39,  8)
KeccakP-1600-AVX2.c:       | ^~~~~~~~~~~
KeccakP-1600-AVX2.c: KeccakP-1600-AVX2.c:637:5: note: in expansion of macro 'KECCAK_CONSTANTS'
KeccakP-1600-AVX2.c:   637 |     KECCAK_CONSTANTS
KeccakP-1600-AVX2.c:       |     ^~~~~~~~~~~~~~~~
KeccakP-1600-AVX2.c: KeccakP-1600-AVX2.c:85:17: warning: unused variable 'SLLV_C4' [-Wunused-variable]
KeccakP-1600-AVX2.c:    85 |     _ROLV_TYPE  SLLV##name = SET(i0, i1, i2, i3); \
KeccakP-1600-AVX2.c:       |                 ^~~~
KeccakP-1600-AVX2.c: KeccakP-1600-AVX2.c:100:1: note: in expansion of macro '_ROLV_CONST'
KeccakP-1600-AVX2.c:   100 | _ROLV_CONST(_C4, 27, 20, 39,  8)
KeccakP-1600-AVX2.c:       | ^~~~~~~~~~~
KeccakP-1600-AVX2.c: KeccakP-1600-AVX2.c:637:5: note: in expansion of macro 'KECCAK_CONSTANTS'
KeccakP-1600-AVX2.c:   637 |     KECCAK_CONSTANTS
KeccakP-1600-AVX2.c:       |     ^~~~~~~~~~~~~~~~
KeccakP-1600-AVX2.c: KeccakP-1600-AVX2.c:86:17: warning: unused variable 'SRLV_A4' [-Wunused-variable]
KeccakP-1600-AVX2.c:    86 |     _ROLV_TYPE  SRLV##name = SET(64 - i0, 64 - i1, 64 - i2, 64 - i3);
KeccakP-1600-AVX2.c:       |                 ^~~~
KeccakP-1600-AVX2.c: KeccakP-1600-AVX2.c:99:1: note: in expansion of macro '_ROLV_CONST'
KeccakP-1600-AVX2.c:    99 | _ROLV_CONST(_A4, 18,  2, 61, 56) \
KeccakP-1600-AVX2.c:       | ^~~~~~~~~~~
KeccakP-1600-AVX2.c: ...
try.c: /usr/bin/x86_64-linux-gnu-ld.bfd: libcrypto_hash_sha3256.a(SHA3-256.o): in function `crypto_hash_sha3256_kcp_optimized1600AVX2_constbranchindex':
try.c: .../supercop-data/hertz/amd64/try/c/gcc_-march=native_-mtune=native_-Os_-fwrapv_-fPIC_-fPIE_-gdwarf-4_-Wall/constbranchindex/crypto_hash/sha3256/kcp/optimized1600AVX2/work/SHA3-256.c:24:(.text+0x...): undefined reference to `KeccakWidth1600_Sponge'
try.c: collect2: error: ld returned 1 exit status

Number of similar (implementation,compiler) pairs: 1, namely:
ImplementationCompiler
kcp/optimized1600AVX2gcc -march=native -mtune=native -Os -fwrapv -fPIC -fPIE -gdwarf-4 -Wall (15.2.0)

Compiler output


KeccakP-1600-AVX512.c: KeccakP-1600-AVX512.c:525:18: warning: unused variable 'i' [-Wunused-variable]
KeccakP-1600-AVX512.c:   525 |     unsigned int i;
KeccakP-1600-AVX512.c:       |                  ^
KeccakP-1600-AVX512.c: 1 warning generated.

Number of similar (implementation,compiler) pairs: 4, namely:
ImplementationCompiler
kcp/optimized1600AVX512clang -march=native -O2 -fwrapv -Qunused-arguments -fPIC -fPIE -gdwarf-4 -Wall (Ubuntu_Clang_21.1.8_(6ubuntu1))
kcp/optimized1600AVX512clang -march=native -O3 -fwrapv -Qunused-arguments -fPIC -fPIE -gdwarf-4 -Wall (Ubuntu_Clang_21.1.8_(6ubuntu1))
kcp/optimized1600AVX512clang -march=native -O -fwrapv -Qunused-arguments -fPIC -fPIE -gdwarf-4 -Wall (Ubuntu_Clang_21.1.8_(6ubuntu1))
kcp/optimized1600AVX512clang -march=native -Os -fwrapv -Qunused-arguments -fPIC -fPIE -gdwarf-4 -Wall (Ubuntu_Clang_21.1.8_(6ubuntu1))

Compiler output


KeccakP-1600-AVX512.c: KeccakP-1600-AVX512.c: In function 'KeccakP1600_Permute_12rounds':
KeccakP-1600-AVX512.c: KeccakP-1600-AVX512.c:525:18: warning: unused variable 'i' [-Wunused-variable]
KeccakP-1600-AVX512.c:   525 |     unsigned int i;
KeccakP-1600-AVX512.c:       |                  ^

Number of similar (implementation,compiler) pairs: 4, namely:
ImplementationCompiler
kcp/optimized1600AVX512gcc -march=native -mtune=native -O2 -fwrapv -fPIC -fPIE -gdwarf-4 -Wall (15.2.0)
kcp/optimized1600AVX512gcc -march=native -mtune=native -O3 -fwrapv -fPIC -fPIE -gdwarf-4 -Wall (15.2.0)
kcp/optimized1600AVX512gcc -march=native -mtune=native -O -fwrapv -fPIC -fPIE -gdwarf-4 -Wall (15.2.0)
kcp/optimized1600AVX512gcc -march=native -mtune=native -Os -fwrapv -fPIC -fPIE -gdwarf-4 -Wall (15.2.0)

Namespace violations


KeccakP-1600-AVX512.o KeccakF1600_FastLoop_Absorb T
KeccakP-1600-AVX512.o KeccakP1600RoundConstants R
KeccakP-1600-AVX512.o KeccakP1600_12rounds_FastLoop_Absorb T
KeccakP-1600-AVX512.o KeccakP1600_AddBytes T
KeccakP-1600-AVX512.o KeccakP1600_ExtractAndAddBytes T
KeccakP-1600-AVX512.o KeccakP1600_ExtractBytes T
KeccakP-1600-AVX512.o KeccakP1600_Initialize T
KeccakP-1600-AVX512.o KeccakP1600_OverwriteBytes T
KeccakP-1600-AVX512.o KeccakP1600_OverwriteWithZeroes T
KeccakP-1600-AVX512.o KeccakP1600_Permute_12rounds T
KeccakP-1600-AVX512.o KeccakP1600_Permute_24rounds T
KeccakP-1600-AVX512.o KeccakP1600_Permute_Nrounds T
KeccakSpongeWidth1600.o KeccakWidth1600_12rounds_Sponge T
KeccakSpongeWidth1600.o KeccakWidth1600_12rounds_SpongeAbsorb T
KeccakSpongeWidth1600.o KeccakWidth1600_12rounds_SpongeAbsorbLastFewBits T
KeccakSpongeWidth1600.o KeccakWidth1600_12rounds_SpongeInitialize T
KeccakSpongeWidth1600.o KeccakWidth1600_12rounds_SpongeSqueeze T
KeccakSpongeWidth1600.o KeccakWidth1600_Sponge T
KeccakSpongeWidth1600.o KeccakWidth1600_SpongeAbsorb T
KeccakSpongeWidth1600.o KeccakWidth1600_SpongeAbsorbLastFewBits T
KeccakSpongeWidth1600.o KeccakWidth1600_SpongeInitialize T
KeccakSpongeWidth1600.o KeccakWidth1600_SpongeSqueeze T

Number of similar (implementation,compiler) pairs: 8, namely:
ImplementationCompiler
kcp/optimized1600AVX512clang -march=native -O2 -fwrapv -Qunused-arguments -fPIC -fPIE -gdwarf-4 -Wall (Ubuntu_Clang_21.1.8_(6ubuntu1))
kcp/optimized1600AVX512clang -march=native -O3 -fwrapv -Qunused-arguments -fPIC -fPIE -gdwarf-4 -Wall (Ubuntu_Clang_21.1.8_(6ubuntu1))
kcp/optimized1600AVX512clang -march=native -O -fwrapv -Qunused-arguments -fPIC -fPIE -gdwarf-4 -Wall (Ubuntu_Clang_21.1.8_(6ubuntu1))
kcp/optimized1600AVX512clang -march=native -Os -fwrapv -Qunused-arguments -fPIC -fPIE -gdwarf-4 -Wall (Ubuntu_Clang_21.1.8_(6ubuntu1))
kcp/optimized1600AVX512gcc -march=native -mtune=native -O2 -fwrapv -fPIC -fPIE -gdwarf-4 -Wall (15.2.0)
kcp/optimized1600AVX512gcc -march=native -mtune=native -O3 -fwrapv -fPIC -fPIE -gdwarf-4 -Wall (15.2.0)
kcp/optimized1600AVX512gcc -march=native -mtune=native -O -fwrapv -fPIC -fPIE -gdwarf-4 -Wall (15.2.0)
kcp/optimized1600AVX512gcc -march=native -mtune=native -Os -fwrapv -fPIC -fPIE -gdwarf-4 -Wall (15.2.0)

TIMECOP error (can be valgrind bug)


error 132

Process terminating with default action of signal 4 (SIGILL)
 Illegal opcode at address 0x40055D8
   at 0x...: memset (string_fortified.h:59)
   by 0x...: cpucycles_works (wrapper.c:59)
   by 0x...: supercop_cpucycles_ticks_amd64_tsc_setup (amd64-tsc.c:28)
   by 0x...: cpucycles_init (wrapper.c:314)
   by 0x...: main (try-anything.c:330)
Illegal instruction (core dumped)

Number of similar (implementation,compiler) pairs: 1, namely:
ImplementationCompiler
compactclang -march=native -O2 -fwrapv -Qunused-arguments -fPIC -fPIE -gdwarf-4 -Wall (Ubuntu_Clang_21.1.8_(6ubuntu1))

TIMECOP error (can be valgrind bug)


error 132

Process terminating with default action of signal 4 (SIGILL)
 Illegal opcode at address 0x40058D8
   at 0x...: memset (string_fortified.h:59)
   by 0x...: cpucycles_works (wrapper.c:59)
   by 0x...: supercop_cpucycles_ticks_amd64_tsc_setup (amd64-tsc.c:28)
   by 0x...: cpucycles_init (wrapper.c:314)
   by 0x...: main (try-anything.c:330)
Illegal instruction (core dumped)

Number of similar (implementation,compiler) pairs: 1, namely:
ImplementationCompiler
compactclang -march=native -O3 -fwrapv -Qunused-arguments -fPIC -fPIE -gdwarf-4 -Wall (Ubuntu_Clang_21.1.8_(6ubuntu1))

TIMECOP error (can be valgrind bug)


error 132

Process terminating with default action of signal 4 (SIGILL)
 Illegal opcode at address 0x40047D8
   at 0x...: memset (string_fortified.h:59)
   by 0x...: cpucycles_works (wrapper.c:59)
   by 0x...: supercop_cpucycles_ticks_amd64_tsc_setup (amd64-tsc.c:28)
   by 0x...: cpucycles_init (wrapper.c:314)
   by 0x...: main (try-anything.c:330)
Illegal instruction (core dumped)

Number of similar (implementation,compiler) pairs: 1, namely:
ImplementationCompiler
compactclang -march=native -O -fwrapv -Qunused-arguments -fPIC -fPIE -gdwarf-4 -Wall (Ubuntu_Clang_21.1.8_(6ubuntu1))

TIMECOP error (can be valgrind bug)


error 132

Process terminating with default action of signal 4 (SIGILL)
 Illegal opcode at address 0x4004A18
   at 0x...: memset (string_fortified.h:59)
   by 0x...: cpucycles_works (wrapper.c:59)
   by 0x...: supercop_cpucycles_ticks_amd64_tsc_setup (amd64-tsc.c:28)
   by 0x...: cpucycles_init (wrapper.c:314)
   by 0x...: main (try-anything.c:330)
Illegal instruction (core dumped)

Number of similar (implementation,compiler) pairs: 1, namely:
ImplementationCompiler
compactclang -march=native -Os -fwrapv -Qunused-arguments -fPIC -fPIE -gdwarf-4 -Wall (Ubuntu_Clang_21.1.8_(6ubuntu1))

TIMECOP error (can be valgrind bug)


error 132

Process terminating with default action of signal 4 (SIGILL)
 Illegal opcode at address 0x4005058
   at 0x...: memset (string_fortified.h:59)
   by 0x...: cpucycles_works (wrapper.c:59)
   by 0x...: supercop_cpucycles_ticks_amd64_tsc_setup (amd64-tsc.c:28)
   by 0x...: cpucycles_init (wrapper.c:314)
   by 0x...: main (try-anything.c:330)
Illegal instruction (core dumped)

Number of similar (implementation,compiler) pairs: 2, namely:
ImplementationCompiler
compactgcc -march=native -mtune=native -O2 -fwrapv -fPIC -fPIE -gdwarf-4 -Wall (15.2.0)
opensslgcc -march=native -mtune=native -O3 -fwrapv -fPIC -fPIE -gdwarf-4 -Wall (15.2.0)

TIMECOP error (can be valgrind bug)


error 132

Process terminating with default action of signal 4 (SIGILL)
 Illegal opcode at address 0x4006418
   at 0x...: memset (string_fortified.h:59)
   by 0x...: cpucycles_works (wrapper.c:59)
   by 0x...: supercop_cpucycles_ticks_amd64_tsc_setup (amd64-tsc.c:28)
   by 0x...: cpucycles_init (wrapper.c:314)
   by 0x...: main (try-anything.c:330)
Illegal instruction (core dumped)

Number of similar (implementation,compiler) pairs: 1, namely:
ImplementationCompiler
compactgcc -march=native -mtune=native -O3 -fwrapv -fPIC -fPIE -gdwarf-4 -Wall (15.2.0)

TIMECOP error (can be valgrind bug)


error 132

Process terminating with default action of signal 4 (SIGILL)
 Illegal opcode at address 0x4004C18
   at 0x...: memset (string_fortified.h:59)
   by 0x...: cpucycles_works (wrapper.c:59)
   by 0x...: supercop_cpucycles_ticks_amd64_tsc_setup (amd64-tsc.c:28)
   by 0x...: cpucycles_init (wrapper.c:314)
   by 0x...: main (try-anything.c:330)
Illegal instruction (core dumped)

Number of similar (implementation,compiler) pairs: 1, namely:
ImplementationCompiler
compactgcc -march=native -mtune=native -O -fwrapv -fPIC -fPIE -gdwarf-4 -Wall (15.2.0)

TIMECOP error (can be valgrind bug)


error 132

Process terminating with default action of signal 4 (SIGILL)
 Illegal opcode at address 0x4004698
   at 0x...: memset (string_fortified.h:59)
   by 0x...: cpucycles_works (wrapper.c:59)
   by 0x...: supercop_cpucycles_ticks_amd64_tsc_setup (amd64-tsc.c:28)
   by 0x...: cpucycles_init (wrapper.c:314)
   by 0x...: main (try-anything.c:330)
Illegal instruction (core dumped)

Number of similar (implementation,compiler) pairs: 1, namely:
ImplementationCompiler
compactgcc -march=native -mtune=native -Os -fwrapv -fPIC -fPIE -gdwarf-4 -Wall (15.2.0)

TIMECOP error (can be valgrind bug)


error 132

Process terminating with default action of signal 4 (SIGILL)
 Illegal opcode at address 0x400AF18
   at 0x...: memset (string_fortified.h:59)
   by 0x...: cpucycles_works (wrapper.c:59)
   by 0x...: supercop_cpucycles_ticks_amd64_tsc_setup (amd64-tsc.c:28)
   by 0x...: cpucycles_init (wrapper.c:314)
   by 0x...: main (try-anything.c:330)
Illegal instruction (core dumped)

Number of similar (implementation,compiler) pairs: 1, namely:
ImplementationCompiler
kcp/optimized1600AVX512clang -march=native -O2 -fwrapv -Qunused-arguments -fPIC -fPIE -gdwarf-4 -Wall (Ubuntu_Clang_21.1.8_(6ubuntu1))

TIMECOP error (can be valgrind bug)


error 132

Process terminating with default action of signal 4 (SIGILL)
 Illegal opcode at address 0x400B3D8
   at 0x...: memset (string_fortified.h:59)
   by 0x...: cpucycles_works (wrapper.c:59)
   by 0x...: supercop_cpucycles_ticks_amd64_tsc_setup (amd64-tsc.c:28)
   by 0x...: cpucycles_init (wrapper.c:314)
   by 0x...: main (try-anything.c:330)
Illegal instruction (core dumped)

Number of similar (implementation,compiler) pairs: 1, namely:
ImplementationCompiler
kcp/optimized1600AVX512clang -march=native -O3 -fwrapv -Qunused-arguments -fPIC -fPIE -gdwarf-4 -Wall (Ubuntu_Clang_21.1.8_(6ubuntu1))

TIMECOP error (can be valgrind bug)


error 132

Process terminating with default action of signal 4 (SIGILL)
 Illegal opcode at address 0x4009798
   at 0x...: memset (string_fortified.h:59)
   by 0x...: cpucycles_works (wrapper.c:59)
   by 0x...: supercop_cpucycles_ticks_amd64_tsc_setup (amd64-tsc.c:28)
   by 0x...: cpucycles_init (wrapper.c:314)
   by 0x...: main (try-anything.c:330)
Illegal instruction (core dumped)

Number of similar (implementation,compiler) pairs: 1, namely:
ImplementationCompiler
kcp/optimized1600AVX512clang -march=native -O -fwrapv -Qunused-arguments -fPIC -fPIE -gdwarf-4 -Wall (Ubuntu_Clang_21.1.8_(6ubuntu1))

TIMECOP error (can be valgrind bug)


error 132

Process terminating with default action of signal 4 (SIGILL)
 Illegal opcode at address 0x4009758
   at 0x...: memset (string_fortified.h:59)
   by 0x...: cpucycles_works (wrapper.c:59)
   by 0x...: supercop_cpucycles_ticks_amd64_tsc_setup (amd64-tsc.c:28)
   by 0x...: cpucycles_init (wrapper.c:314)
   by 0x...: main (try-anything.c:330)
Illegal instruction (core dumped)

Number of similar (implementation,compiler) pairs: 1, namely:
ImplementationCompiler
kcp/optimized1600AVX512clang -march=native -Os -fwrapv -Qunused-arguments -fPIC -fPIE -gdwarf-4 -Wall (Ubuntu_Clang_21.1.8_(6ubuntu1))

TIMECOP error (can be valgrind bug)


error 132

Process terminating with default action of signal 4 (SIGILL)
 Illegal opcode at address 0x400A3D8
   at 0x...: memset (string_fortified.h:59)
   by 0x...: cpucycles_works (wrapper.c:59)
   by 0x...: supercop_cpucycles_ticks_amd64_tsc_setup (amd64-tsc.c:28)
   by 0x...: cpucycles_init (wrapper.c:314)
   by 0x...: main (try-anything.c:330)
Illegal instruction (core dumped)

Number of similar (implementation,compiler) pairs: 1, namely:
ImplementationCompiler
kcp/optimized1600AVX512gcc -march=native -mtune=native -O2 -fwrapv -fPIC -fPIE -gdwarf-4 -Wall (15.2.0)

TIMECOP error (can be valgrind bug)


error 132

Process terminating with default action of signal 4 (SIGILL)
 Illegal opcode at address 0x400AC18
   at 0x...: memset (string_fortified.h:59)
   by 0x...: cpucycles_works (wrapper.c:59)
   by 0x...: supercop_cpucycles_ticks_amd64_tsc_setup (amd64-tsc.c:28)
   by 0x...: cpucycles_init (wrapper.c:314)
   by 0x...: main (try-anything.c:330)
Illegal instruction (core dumped)

Number of similar (implementation,compiler) pairs: 1, namely:
ImplementationCompiler
kcp/optimized1600AVX512gcc -march=native -mtune=native -O3 -fwrapv -fPIC -fPIE -gdwarf-4 -Wall (15.2.0)

TIMECOP error (can be valgrind bug)


error 132

Process terminating with default action of signal 4 (SIGILL)
 Illegal opcode at address 0x400A318
   at 0x...: memset (string_fortified.h:59)
   by 0x...: cpucycles_works (wrapper.c:59)
   by 0x...: supercop_cpucycles_ticks_amd64_tsc_setup (amd64-tsc.c:28)
   by 0x...: cpucycles_init (wrapper.c:314)
   by 0x...: main (try-anything.c:330)
Illegal instruction (core dumped)

Number of similar (implementation,compiler) pairs: 1, namely:
ImplementationCompiler
kcp/optimized1600AVX512gcc -march=native -mtune=native -O -fwrapv -fPIC -fPIE -gdwarf-4 -Wall (15.2.0)

TIMECOP error (can be valgrind bug)


error 132

Process terminating with default action of signal 4 (SIGILL)
 Illegal opcode at address 0x40096D8
   at 0x...: memset (string_fortified.h:59)
   by 0x...: cpucycles_works (wrapper.c:59)
   by 0x...: supercop_cpucycles_ticks_amd64_tsc_setup (amd64-tsc.c:28)
   by 0x...: cpucycles_init (wrapper.c:314)
   by 0x...: main (try-anything.c:330)
Illegal instruction (core dumped)

Number of similar (implementation,compiler) pairs: 1, namely:
ImplementationCompiler
kcp/optimized1600AVX512gcc -march=native -mtune=native -Os -fwrapv -fPIC -fPIE -gdwarf-4 -Wall (15.2.0)

TIMECOP error (can be valgrind bug)


error 132

Process terminating with default action of signal 4 (SIGILL)
 Illegal opcode at address 0x400A598
   at 0x...: memset (string_fortified.h:59)
   by 0x...: cpucycles_works (wrapper.c:59)
   by 0x...: supercop_cpucycles_ticks_amd64_tsc_setup (amd64-tsc.c:28)
   by 0x...: cpucycles_init (wrapper.c:314)
   by 0x...: main (try-anything.c:330)
Illegal instruction (core dumped)

Number of similar (implementation,compiler) pairs: 2, namely:
ImplementationCompiler
oncore32bitsclang -march=native -O2 -fwrapv -Qunused-arguments -fPIC -fPIE -gdwarf-4 -Wall (Ubuntu_Clang_21.1.8_(6ubuntu1))
oncore32bitsclang -march=native -O3 -fwrapv -Qunused-arguments -fPIC -fPIE -gdwarf-4 -Wall (Ubuntu_Clang_21.1.8_(6ubuntu1))

TIMECOP error (can be valgrind bug)


error 132

Process terminating with default action of signal 4 (SIGILL)
 Illegal opcode at address 0x40095D8
   at 0x...: memset (string_fortified.h:59)
   by 0x...: cpucycles_works (wrapper.c:59)
   by 0x...: supercop_cpucycles_ticks_amd64_tsc_setup (amd64-tsc.c:28)
   by 0x...: cpucycles_init (wrapper.c:314)
   by 0x...: main (try-anything.c:330)
Illegal instruction (core dumped)

Number of similar (implementation,compiler) pairs: 1, namely:
ImplementationCompiler
oncore32bitsclang -march=native -O -fwrapv -Qunused-arguments -fPIC -fPIE -gdwarf-4 -Wall (Ubuntu_Clang_21.1.8_(6ubuntu1))

TIMECOP error (can be valgrind bug)


error 132

Process terminating with default action of signal 4 (SIGILL)
 Illegal opcode at address 0x4009858
   at 0x...: memset (string_fortified.h:59)
   by 0x...: cpucycles_works (wrapper.c:59)
   by 0x...: supercop_cpucycles_ticks_amd64_tsc_setup (amd64-tsc.c:28)
   by 0x...: cpucycles_init (wrapper.c:314)
   by 0x...: main (try-anything.c:330)
Illegal instruction (core dumped)

Number of similar (implementation,compiler) pairs: 1, namely:
ImplementationCompiler
oncore32bitsclang -march=native -Os -fwrapv -Qunused-arguments -fPIC -fPIE -gdwarf-4 -Wall (Ubuntu_Clang_21.1.8_(6ubuntu1))

TIMECOP error (can be valgrind bug)


error 132

Process terminating with default action of signal 4 (SIGILL)
 Illegal opcode at address 0x4009B18
   at 0x...: memset (string_fortified.h:59)
   by 0x...: cpucycles_works (wrapper.c:59)
   by 0x...: supercop_cpucycles_ticks_amd64_tsc_setup (amd64-tsc.c:28)
   by 0x...: cpucycles_init (wrapper.c:314)
   by 0x...: main (try-anything.c:330)
Illegal instruction (core dumped)

Number of similar (implementation,compiler) pairs: 1, namely:
ImplementationCompiler
oncore32bitsgcc -march=native -mtune=native -O2 -fwrapv -fPIC -fPIE -gdwarf-4 -Wall (15.2.0)

TIMECOP error (can be valgrind bug)


error 132

Process terminating with default action of signal 4 (SIGILL)
 Illegal opcode at address 0x400B218
   at 0x...: memset (string_fortified.h:59)
   by 0x...: cpucycles_works (wrapper.c:59)
   by 0x...: supercop_cpucycles_ticks_amd64_tsc_setup (amd64-tsc.c:28)
   by 0x...: cpucycles_init (wrapper.c:314)
   by 0x...: main (try-anything.c:330)
Illegal instruction (core dumped)

Number of similar (implementation,compiler) pairs: 1, namely:
ImplementationCompiler
oncore32bitsgcc -march=native -mtune=native -O3 -fwrapv -fPIC -fPIE -gdwarf-4 -Wall (15.2.0)

TIMECOP error (can be valgrind bug)


error 132

Process terminating with default action of signal 4 (SIGILL)
 Illegal opcode at address 0x4009958
   at 0x...: memset (string_fortified.h:59)
   by 0x...: cpucycles_works (wrapper.c:59)
   by 0x...: supercop_cpucycles_ticks_amd64_tsc_setup (amd64-tsc.c:28)
   by 0x...: cpucycles_init (wrapper.c:314)
   by 0x...: main (try-anything.c:330)
Illegal instruction (core dumped)

Number of similar (implementation,compiler) pairs: 1, namely:
ImplementationCompiler
oncore32bitsgcc -march=native -mtune=native -O -fwrapv -fPIC -fPIE -gdwarf-4 -Wall (15.2.0)

TIMECOP error (can be valgrind bug)


error 132

Process terminating with default action of signal 4 (SIGILL)
 Illegal opcode at address 0x4009518
   at 0x...: memset (string_fortified.h:59)
   by 0x...: cpucycles_works (wrapper.c:59)
   by 0x...: supercop_cpucycles_ticks_amd64_tsc_setup (amd64-tsc.c:28)
   by 0x...: cpucycles_init (wrapper.c:314)
   by 0x...: main (try-anything.c:330)
Illegal instruction (core dumped)

Number of similar (implementation,compiler) pairs: 1, namely:
ImplementationCompiler
oncore32bitsgcc -march=native -mtune=native -Os -fwrapv -fPIC -fPIE -gdwarf-4 -Wall (15.2.0)

TIMECOP error (can be valgrind bug)


error 132

Process terminating with default action of signal 4 (SIGILL)
 Illegal opcode at address 0x40178D8
   at 0x...: memset (string_fortified.h:59)
   by 0x...: cpucycles_works (wrapper.c:59)
   by 0x...: supercop_cpucycles_ticks_amd64_tsc_setup (amd64-tsc.c:28)
   by 0x...: cpucycles_init (wrapper.c:314)
   by 0x...: main (try-anything.c:330)
Illegal instruction (core dumped)

Number of similar (implementation,compiler) pairs: 1, namely:
ImplementationCompiler
oncore64bitsclang -march=native -O2 -fwrapv -Qunused-arguments -fPIC -fPIE -gdwarf-4 -Wall (Ubuntu_Clang_21.1.8_(6ubuntu1))

TIMECOP error (can be valgrind bug)


error 132

Process terminating with default action of signal 4 (SIGILL)
 Illegal opcode at address 0x4017A98
   at 0x...: memset (string_fortified.h:59)
   by 0x...: cpucycles_works (wrapper.c:59)
   by 0x...: supercop_cpucycles_ticks_amd64_tsc_setup (amd64-tsc.c:28)
   by 0x...: cpucycles_init (wrapper.c:314)
   by 0x...: main (try-anything.c:330)
Illegal instruction (core dumped)

Number of similar (implementation,compiler) pairs: 1, namely:
ImplementationCompiler
oncore64bitsclang -march=native -O3 -fwrapv -Qunused-arguments -fPIC -fPIE -gdwarf-4 -Wall (Ubuntu_Clang_21.1.8_(6ubuntu1))

TIMECOP error (can be valgrind bug)


error 132

Process terminating with default action of signal 4 (SIGILL)
 Illegal opcode at address 0x4016AD8
   at 0x...: memset (string_fortified.h:59)
   by 0x...: cpucycles_works (wrapper.c:59)
   by 0x...: supercop_cpucycles_ticks_amd64_tsc_setup (amd64-tsc.c:28)
   by 0x...: cpucycles_init (wrapper.c:314)
   by 0x...: main (try-anything.c:330)
Illegal instruction (core dumped)

Number of similar (implementation,compiler) pairs: 2, namely:
ImplementationCompiler
oncore64bitsclang -march=native -O -fwrapv -Qunused-arguments -fPIC -fPIE -gdwarf-4 -Wall (Ubuntu_Clang_21.1.8_(6ubuntu1))
oncore64bitsgcc -march=native -mtune=native -Os -fwrapv -fPIC -fPIE -gdwarf-4 -Wall (15.2.0)

TIMECOP error (can be valgrind bug)


error 132

Process terminating with default action of signal 4 (SIGILL)
 Illegal opcode at address 0x4016D18
   at 0x...: memset (string_fortified.h:59)
   by 0x...: cpucycles_works (wrapper.c:59)
   by 0x...: supercop_cpucycles_ticks_amd64_tsc_setup (amd64-tsc.c:28)
   by 0x...: cpucycles_init (wrapper.c:314)
   by 0x...: main (try-anything.c:330)
Illegal instruction (core dumped)

Number of similar (implementation,compiler) pairs: 1, namely:
ImplementationCompiler
oncore64bitsclang -march=native -Os -fwrapv -Qunused-arguments -fPIC -fPIE -gdwarf-4 -Wall (Ubuntu_Clang_21.1.8_(6ubuntu1))

TIMECOP error (can be valgrind bug)


error 132

Process terminating with default action of signal 4 (SIGILL)
 Illegal opcode at address 0x4017198
   at 0x...: memset (string_fortified.h:59)
   by 0x...: cpucycles_works (wrapper.c:59)
   by 0x...: supercop_cpucycles_ticks_amd64_tsc_setup (amd64-tsc.c:28)
   by 0x...: cpucycles_init (wrapper.c:314)
   by 0x...: main (try-anything.c:330)
Illegal instruction (core dumped)

Number of similar (implementation,compiler) pairs: 1, namely:
ImplementationCompiler
oncore64bitsgcc -march=native -mtune=native -O2 -fwrapv -fPIC -fPIE -gdwarf-4 -Wall (15.2.0)

TIMECOP error (can be valgrind bug)


error 132

Process terminating with default action of signal 4 (SIGILL)
 Illegal opcode at address 0x40177D8
   at 0x...: memset (string_fortified.h:59)
   by 0x...: cpucycles_works (wrapper.c:59)
   by 0x...: supercop_cpucycles_ticks_amd64_tsc_setup (amd64-tsc.c:28)
   by 0x...: cpucycles_init (wrapper.c:314)
   by 0x...: main (try-anything.c:330)
Illegal instruction (core dumped)

Number of similar (implementation,compiler) pairs: 1, namely:
ImplementationCompiler
oncore64bitsgcc -march=native -mtune=native -O3 -fwrapv -fPIC -fPIE -gdwarf-4 -Wall (15.2.0)

TIMECOP error (can be valgrind bug)


error 132

Process terminating with default action of signal 4 (SIGILL)
 Illegal opcode at address 0x4016F58
   at 0x...: memset (string_fortified.h:59)
   by 0x...: cpucycles_works (wrapper.c:59)
   by 0x...: supercop_cpucycles_ticks_amd64_tsc_setup (amd64-tsc.c:28)
   by 0x...: cpucycles_init (wrapper.c:314)
   by 0x...: main (try-anything.c:330)
Illegal instruction (core dumped)

Number of similar (implementation,compiler) pairs: 1, namely:
ImplementationCompiler
oncore64bitsgcc -march=native -mtune=native -O -fwrapv -fPIC -fPIE -gdwarf-4 -Wall (15.2.0)

TIMECOP error (can be valgrind bug)


error 132

Process terminating with default action of signal 4 (SIGILL)
 Illegal opcode at address 0x4004F58
   at 0x...: memset (string_fortified.h:59)
   by 0x...: cpucycles_works (wrapper.c:59)
   by 0x...: supercop_cpucycles_ticks_amd64_tsc_setup (amd64-tsc.c:28)
   by 0x...: cpucycles_init (wrapper.c:314)
   by 0x...: main (try-anything.c:330)
Illegal instruction (core dumped)

Number of similar (implementation,compiler) pairs: 1, namely:
ImplementationCompiler
opensslclang -march=native -O2 -fwrapv -Qunused-arguments -fPIC -fPIE -gdwarf-4 -Wall (Ubuntu_Clang_21.1.8_(6ubuntu1))

TIMECOP error (can be valgrind bug)


error 132

Process terminating with default action of signal 4 (SIGILL)
 Illegal opcode at address 0x4005118
   at 0x...: memset (string_fortified.h:59)
   by 0x...: cpucycles_works (wrapper.c:59)
   by 0x...: supercop_cpucycles_ticks_amd64_tsc_setup (amd64-tsc.c:28)
   by 0x...: cpucycles_init (wrapper.c:314)
   by 0x...: main (try-anything.c:330)
Illegal instruction (core dumped)

Number of similar (implementation,compiler) pairs: 1, namely:
ImplementationCompiler
opensslclang -march=native -O3 -fwrapv -Qunused-arguments -fPIC -fPIE -gdwarf-4 -Wall (Ubuntu_Clang_21.1.8_(6ubuntu1))

TIMECOP error (can be valgrind bug)


error 132

Process terminating with default action of signal 4 (SIGILL)
 Illegal opcode at address 0x40044D8
   at 0x...: memset (string_fortified.h:59)
   by 0x...: cpucycles_works (wrapper.c:59)
   by 0x...: supercop_cpucycles_ticks_amd64_tsc_setup (amd64-tsc.c:28)
   by 0x...: cpucycles_init (wrapper.c:314)
   by 0x...: main (try-anything.c:330)
Illegal instruction (core dumped)

Number of similar (implementation,compiler) pairs: 1, namely:
ImplementationCompiler
opensslclang -march=native -O -fwrapv -Qunused-arguments -fPIC -fPIE -gdwarf-4 -Wall (Ubuntu_Clang_21.1.8_(6ubuntu1))

TIMECOP error (can be valgrind bug)


error 132

Process terminating with default action of signal 4 (SIGILL)
 Illegal opcode at address 0x4004758
   at 0x...: memset (string_fortified.h:59)
   by 0x...: cpucycles_works (wrapper.c:59)
   by 0x...: supercop_cpucycles_ticks_amd64_tsc_setup (amd64-tsc.c:28)
   by 0x...: cpucycles_init (wrapper.c:314)
   by 0x...: main (try-anything.c:330)
Illegal instruction (core dumped)

Number of similar (implementation,compiler) pairs: 1, namely:
ImplementationCompiler
opensslclang -march=native -Os -fwrapv -Qunused-arguments -fPIC -fPIE -gdwarf-4 -Wall (Ubuntu_Clang_21.1.8_(6ubuntu1))

TIMECOP error (can be valgrind bug)


error 132

Process terminating with default action of signal 4 (SIGILL)
 Illegal opcode at address 0x4004B18
   at 0x...: memset (string_fortified.h:59)
   by 0x...: cpucycles_works (wrapper.c:59)
   by 0x...: supercop_cpucycles_ticks_amd64_tsc_setup (amd64-tsc.c:28)
   by 0x...: cpucycles_init (wrapper.c:314)
   by 0x...: main (try-anything.c:330)
Illegal instruction (core dumped)

Number of similar (implementation,compiler) pairs: 1, namely:
ImplementationCompiler
opensslgcc -march=native -mtune=native -O2 -fwrapv -fPIC -fPIE -gdwarf-4 -Wall (15.2.0)

TIMECOP error (can be valgrind bug)


error 132

Process terminating with default action of signal 4 (SIGILL)
 Illegal opcode at address 0x4004918
   at 0x...: memset (string_fortified.h:59)
   by 0x...: cpucycles_works (wrapper.c:59)
   by 0x...: supercop_cpucycles_ticks_amd64_tsc_setup (amd64-tsc.c:28)
   by 0x...: cpucycles_init (wrapper.c:314)
   by 0x...: main (try-anything.c:330)
Illegal instruction (core dumped)

Number of similar (implementation,compiler) pairs: 1, namely:
ImplementationCompiler
opensslgcc -march=native -mtune=native -O -fwrapv -fPIC -fPIE -gdwarf-4 -Wall (15.2.0)

TIMECOP error (can be valgrind bug)


error 132

Process terminating with default action of signal 4 (SIGILL)
 Illegal opcode at address 0x4004558
   at 0x...: memset (string_fortified.h:59)
   by 0x...: cpucycles_works (wrapper.c:59)
   by 0x...: supercop_cpucycles_ticks_amd64_tsc_setup (amd64-tsc.c:28)
   by 0x...: cpucycles_init (wrapper.c:314)
   by 0x...: main (try-anything.c:330)
Illegal instruction (core dumped)

Number of similar (implementation,compiler) pairs: 1, namely:
ImplementationCompiler
opensslgcc -march=native -mtune=native -Os -fwrapv -fPIC -fPIE -gdwarf-4 -Wall (15.2.0)

TIMECOP error (can be valgrind bug)


error 132

Process terminating with default action of signal 4 (SIGILL)
 Illegal opcode at address 0x4006958
   at 0x...: memset (string_fortified.h:59)
   by 0x...: cpucycles_works (wrapper.c:59)
   by 0x...: supercop_cpucycles_ticks_amd64_tsc_setup (amd64-tsc.c:28)
   by 0x...: cpucycles_init (wrapper.c:314)
   by 0x...: main (try-anything.c:330)
Illegal instruction (core dumped)

Number of similar (implementation,compiler) pairs: 1, namely:
ImplementationCompiler
usekcpclang -march=native -O2 -fwrapv -Qunused-arguments -fPIC -fPIE -gdwarf-4 -Wall (Ubuntu_Clang_21.1.8_(6ubuntu1))

TIMECOP error (can be valgrind bug)


error 132

Process terminating with default action of signal 4 (SIGILL)
 Illegal opcode at address 0x4006B18
   at 0x...: memset (string_fortified.h:59)
   by 0x...: cpucycles_works (wrapper.c:59)
   by 0x...: supercop_cpucycles_ticks_amd64_tsc_setup (amd64-tsc.c:28)
   by 0x...: cpucycles_init (wrapper.c:314)
   by 0x...: main (try-anything.c:330)
Illegal instruction (core dumped)

Number of similar (implementation,compiler) pairs: 1, namely:
ImplementationCompiler
usekcpclang -march=native -O3 -fwrapv -Qunused-arguments -fPIC -fPIE -gdwarf-4 -Wall (Ubuntu_Clang_21.1.8_(6ubuntu1))

TIMECOP error (can be valgrind bug)


error 132

Process terminating with default action of signal 4 (SIGILL)
 Illegal opcode at address 0x4005ED8
   at 0x...: memset (string_fortified.h:59)
   by 0x...: cpucycles_works (wrapper.c:59)
   by 0x...: supercop_cpucycles_ticks_amd64_tsc_setup (amd64-tsc.c:28)
   by 0x...: cpucycles_init (wrapper.c:314)
   by 0x...: main (try-anything.c:330)
Illegal instruction (core dumped)

Number of similar (implementation,compiler) pairs: 1, namely:
ImplementationCompiler
usekcpclang -march=native -O -fwrapv -Qunused-arguments -fPIC -fPIE -gdwarf-4 -Wall (Ubuntu_Clang_21.1.8_(6ubuntu1))

TIMECOP error (can be valgrind bug)


error 132

Process terminating with default action of signal 4 (SIGILL)
 Illegal opcode at address 0x4006118
   at 0x...: memset (string_fortified.h:59)
   by 0x...: cpucycles_works (wrapper.c:59)
   by 0x...: supercop_cpucycles_ticks_amd64_tsc_setup (amd64-tsc.c:28)
   by 0x...: cpucycles_init (wrapper.c:314)
   by 0x...: main (try-anything.c:330)
Illegal instruction (core dumped)

Number of similar (implementation,compiler) pairs: 1, namely:
ImplementationCompiler
usekcpclang -march=native -Os -fwrapv -Qunused-arguments -fPIC -fPIE -gdwarf-4 -Wall (Ubuntu_Clang_21.1.8_(6ubuntu1))

TIMECOP error (can be valgrind bug)


error 132

Process terminating with default action of signal 4 (SIGILL)
 Illegal opcode at address 0x4006298
   at 0x...: memset (string_fortified.h:59)
   by 0x...: cpucycles_works (wrapper.c:59)
   by 0x...: supercop_cpucycles_ticks_amd64_tsc_setup (amd64-tsc.c:28)
   by 0x...: cpucycles_init (wrapper.c:314)
   by 0x...: main (try-anything.c:330)
Illegal instruction (core dumped)

Number of similar (implementation,compiler) pairs: 1, namely:
ImplementationCompiler
usekcpgcc -march=native -mtune=native -O2 -fwrapv -fPIC -fPIE -gdwarf-4 -Wall (15.2.0)

TIMECOP error (can be valgrind bug)


error 132

Process terminating with default action of signal 4 (SIGILL)
 Illegal opcode at address 0x40067D8
   at 0x...: memset (string_fortified.h:59)
   by 0x...: cpucycles_works (wrapper.c:59)
   by 0x...: supercop_cpucycles_ticks_amd64_tsc_setup (amd64-tsc.c:28)
   by 0x...: cpucycles_init (wrapper.c:314)
   by 0x...: main (try-anything.c:330)
Illegal instruction (core dumped)

Number of similar (implementation,compiler) pairs: 1, namely:
ImplementationCompiler
usekcpgcc -march=native -mtune=native -O3 -fwrapv -fPIC -fPIE -gdwarf-4 -Wall (15.2.0)

TIMECOP error (can be valgrind bug)


error 132

Process terminating with default action of signal 4 (SIGILL)
 Illegal opcode at address 0x4006098
   at 0x...: memset (string_fortified.h:59)
   by 0x...: cpucycles_works (wrapper.c:59)
   by 0x...: supercop_cpucycles_ticks_amd64_tsc_setup (amd64-tsc.c:28)
   by 0x...: cpucycles_init (wrapper.c:314)
   by 0x...: main (try-anything.c:330)
Illegal instruction (core dumped)

Number of similar (implementation,compiler) pairs: 1, namely:
ImplementationCompiler
usekcpgcc -march=native -mtune=native -O -fwrapv -fPIC -fPIE -gdwarf-4 -Wall (15.2.0)

TIMECOP error (can be valgrind bug)


error 132

Process terminating with default action of signal 4 (SIGILL)
 Illegal opcode at address 0x4005CD8
   at 0x...: memset (string_fortified.h:59)
   by 0x...: cpucycles_works (wrapper.c:59)
   by 0x...: supercop_cpucycles_ticks_amd64_tsc_setup (amd64-tsc.c:28)
   by 0x...: cpucycles_init (wrapper.c:314)
   by 0x...: main (try-anything.c:330)
Illegal instruction (core dumped)

Number of similar (implementation,compiler) pairs: 1, namely:
ImplementationCompiler
usekcpgcc -march=native -mtune=native -Os -fwrapv -fPIC -fPIE -gdwarf-4 -Wall (15.2.0)