Test results for amd64, hertz, crypto_hash/echo256

[Page version: 20261007 20:07:58]

Measurements for amd64, hertz, crypto_hash Test results for amd64, hertz, crypto_hash Test results for crypto_hash/echo256
Computer: hertz
Microarchitecture: amd64; Zen 4 (a60f12)
Architecture: amd64
CPU ID: AuthenticAMD-00a60f12-178bfbff
SUPERCOP version: 20261004
Operation: crypto_hash
Primitive: echo256
TimeObject sizeTest sizeImplementationCompilerBenchmark dateSUPERCOP version
36959019 0 037555 1288 1568T:ccalik/aesniclang -march=native -O2 -fwrapv -Qunused-arguments -fPIC -fPIE -gdwarf-4 -Wall2026100620261004
36986086 0 029085 1280 1568T:ccalik/aesniclang -march=native -Os -fwrapv -Qunused-arguments -fPIC -fPIE -gdwarf-4 -Wall2026100620261004
38419003 0 039027 1288 1568T:ccalik/aesniclang -march=native -O3 -fwrapv -Qunused-arguments -fPIC -fPIE -gdwarf-4 -Wall2026100620261004
38606305 0 028353 1232 1568T:ccalik/aesnigcc -march=native -mtune=native -Os -fwrapv -fPIC -fPIE -gdwarf-4 -Wall2026100620261004
39236764 0 030358 1256 1600T:ccalik/aesnigcc -march=native -mtune=native -O -fwrapv -fPIC -fPIE -gdwarf-4 -Wall2026100620261004
39416827 0 028931 1288 1504T:ccalik/aesniclang -march=native -O -fwrapv -Qunused-arguments -fPIC -fPIE -gdwarf-4 -Wall2026100620261004
39428317 0 035638 1256 1664T:ccalik/aesnigcc -march=native -mtune=native -O3 -fwrapv -fPIC -fPIE -gdwarf-4 -Wall2026100620261004
43046957 0 030678 1256 1664T:ccalik/aesnigcc -march=native -mtune=native -O2 -fwrapv -fPIC -fPIE -gdwarf-4 -Wall2026100620261004
2113412286 0 035229 1280 1568T:ccalik/bitslicedclang -march=native -Os -fwrapv -Qunused-arguments -fPIC -fPIE -gdwarf-4 -Wall2026100620261004
2117514939 0 044907 1288 1568T:ccalik/bitslicedclang -march=native -O3 -fwrapv -Qunused-arguments -fPIC -fPIE -gdwarf-4 -Wall2026100620261004
2122814939 0 043499 1288 1568T:ccalik/bitslicedclang -march=native -O2 -fwrapv -Qunused-arguments -fPIC -fPIE -gdwarf-4 -Wall2026100620261004
2457916056 0 039638 1256 1600T:ccalik/bitslicedgcc -march=native -mtune=native -O -fwrapv -fPIC -fPIE -gdwarf-4 -Wall2026100620261004
2554416973 0 040662 1256 1664T:ccalik/bitslicedgcc -march=native -mtune=native -O2 -fwrapv -fPIC -fPIE -gdwarf-4 -Wall2026100620261004
2564423007 0 045059 1288 1504T:ccalik/vpermclang -march=native -O -fwrapv -Qunused-arguments -fPIC -fPIE -gdwarf-4 -Wall2026100620261004
2583418493 0 045814 1256 1664T:ccalik/bitslicedgcc -march=native -mtune=native -O3 -fwrapv -fPIC -fPIE -gdwarf-4 -Wall2026100620261004
2633815727 0 037827 1288 1504T:ccalik/bitslicedclang -march=native -O -fwrapv -Qunused-arguments -fPIC -fPIE -gdwarf-4 -Wall2026100620261004
2804515448 0 037449 1232 1568T:ccalik/bitslicedgcc -march=native -mtune=native -Os -fwrapv -fPIC -fPIE -gdwarf-4 -Wall2026100620261004
2862918587 0 041629 1280 1568T:ccalik/vpermclang -march=native -Os -fwrapv -Qunused-arguments -fPIC -fPIE -gdwarf-4 -Wall2026100620261004
2876524075 0 052595 1288 1568T:ccalik/vpermclang -march=native -O2 -fwrapv -Qunused-arguments -fPIC -fPIE -gdwarf-4 -Wall2026100620261004
3043824605 0 051894 1256 1664T:ccalik/vpermgcc -march=native -mtune=native -O3 -fwrapv -fPIC -fPIE -gdwarf-4 -Wall2026100620261004
3051720973 0 044630 1256 1664T:ccalik/vpermgcc -march=native -mtune=native -O2 -fwrapv -fPIC -fPIE -gdwarf-4 -Wall2026100620261004
3075025099 0 055091 1288 1568T:ccalik/vpermclang -march=native -O3 -fwrapv -Qunused-arguments -fPIC -fPIE -gdwarf-4 -Wall2026100620261004
3175619948 0 042001 1232 1568T:ccalik/vpermgcc -march=native -mtune=native -Os -fwrapv -fPIC -fPIE -gdwarf-4 -Wall2026100620261004
3208021094 0 044694 1256 1600T:ccalik/vpermgcc -march=native -mtune=native -O -fwrapv -fPIC -fPIE -gdwarf-4 -Wall2026100620261004
3534217706 0 1640637 1280 1600T:generic/opt32clang -march=native -Os -fwrapv -Qunused-arguments -fPIC -fPIE -gdwarf-4 -Wall2026100620261004
3642620582 0 143645 1280 1568T:generic/opt64clang -march=native -Os -fwrapv -Qunused-arguments -fPIC -fPIE -gdwarf-4 -Wall2026100620261004
3647620097 0 1648811 1288 1600T:generic/opt32clang -march=native -O2 -fwrapv -Qunused-arguments -fPIC -fPIE -gdwarf-4 -Wall2026100620261004
3673320130 0 1650291 1288 1600T:generic/opt32clang -march=native -O3 -fwrapv -Qunused-arguments -fPIC -fPIE -gdwarf-4 -Wall2026100620261004
3706428587 0 050939 1288 1504T:sphlibclang -march=native -O -fwrapv -Qunused-arguments -fPIC -fPIE -gdwarf-4 -Wall2026100620261004
3790713530 0 040966 1256 1664T:sphlib-smallgcc -march=native -mtune=native -O3 -fwrapv -fPIC -fPIE -gdwarf-4 -Wall2026100620261004
3799132658 0 060102 1256 1664T:sphlibgcc -march=native -mtune=native -O3 -fwrapv -fPIC -fPIE -gdwarf-4 -Wall2026100620261004
3814229943 0 053710 1256 1664T:sphlibgcc -march=native -mtune=native -O2 -fwrapv -fPIC -fPIE -gdwarf-4 -Wall2026100620261004
3889910911 0 039675 1288 1568T:sphlib-smallclang -march=native -O2 -fwrapv -Qunused-arguments -fPIC -fPIE -gdwarf-4 -Wall2026100620261004
3894011399 0 041595 1288 1568T:sphlib-smallclang -march=native -O3 -fwrapv -Qunused-arguments -fPIC -fPIE -gdwarf-4 -Wall2026100620261004
3976820566 0 1648053 1264 1696T:generic/opt32gcc -march=native -mtune=native -O3 -fwrapv -fPIC -fPIE -gdwarf-4 -Wall2026100620261004
4033224218 0 151590 1256 1696T:generic/opt64gcc -march=native -mtune=native -O3 -fwrapv -fPIC -fPIE -gdwarf-4 -Wall2026100620261004
4038922866 0 146558 1256 1696T:generic/opt64gcc -march=native -mtune=native -O2 -fwrapv -fPIC -fPIE -gdwarf-4 -Wall2026100620261004
4075130144 0 053277 1280 1568T:sphlibclang -march=native -Os -fwrapv -Qunused-arguments -fPIC -fPIE -gdwarf-4 -Wall2026100620261004
4082120270 0 1644093 1264 1696T:generic/opt32gcc -march=native -mtune=native -O2 -fwrapv -fPIC -fPIE -gdwarf-4 -Wall2026100620261004
4201110207 0 033958 1256 1664T:sphlib-smallgcc -march=native -mtune=native -O2 -fwrapv -fPIC -fPIE -gdwarf-4 -Wall2026100620261004
4283923620 0 153699 1288 1568T:generic/opt64clang -march=native -O3 -fwrapv -Qunused-arguments -fPIC -fPIE -gdwarf-4 -Wall2026100620261004
4305810673 0 033035 1288 1504T:sphlib-smallclang -march=native -O -fwrapv -Qunused-arguments -fPIC -fPIE -gdwarf-4 -Wall2026100620261004
4335423710 0 152395 1288 1568T:generic/opt64clang -march=native -O2 -fwrapv -Qunused-arguments -fPIC -fPIE -gdwarf-4 -Wall2026100620261004
4346133714 0 062443 1288 1568T:sphlibclang -march=native -O2 -fwrapv -Qunused-arguments -fPIC -fPIE -gdwarf-4 -Wall2026100620261004
4355134013 0 064171 1288 1568T:sphlibclang -march=native -O3 -fwrapv -Qunused-arguments -fPIC -fPIE -gdwarf-4 -Wall2026100620261004
4595324246 0 1654451 1288 1600T:powerpc/pp32cv2clang -march=native -O3 -fwrapv -Qunused-arguments -fPIC -fPIE -gdwarf-4 -Wall2026100620261004
4616724213 0 1652971 1288 1600T:powerpc/pp32cv2clang -march=native -O2 -fwrapv -Qunused-arguments -fPIC -fPIE -gdwarf-4 -Wall2026100620261004
475789155 0 032309 1280 1568T:sphlib-smallclang -march=native -Os -fwrapv -Qunused-arguments -fPIC -fPIE -gdwarf-4 -Wall2026100620261004
4869722573 0 1645501 1280 1600T:powerpc/pp32cv2clang -march=native -Os -fwrapv -Qunused-arguments -fPIC -fPIE -gdwarf-4 -Wall2026100620261004
4885610745 0 034430 1256 1600T:sphlib-smallgcc -march=native -mtune=native -O -fwrapv -fPIC -fPIE -gdwarf-4 -Wall2026100620261004
5022219409 0 1641603 1288 1536T:generic/opt32clang -march=native -O -fwrapv -Qunused-arguments -fPIC -fPIE -gdwarf-4 -Wall2026100620261004
506329619 0 031769 1232 1568T:sphlib-smallgcc -march=native -mtune=native -Os -fwrapv -fPIC -fPIE -gdwarf-4 -Wall2026100620261004
5471421554 0 1645269 1264 1632T:generic/opt32gcc -march=native -mtune=native -O -fwrapv -fPIC -fPIE -gdwarf-4 -Wall2026100620261004
5907724161 0 1646339 1288 1536T:powerpc/pp32cv2clang -march=native -O -fwrapv -Qunused-arguments -fPIC -fPIE -gdwarf-4 -Wall2026100620261004
6074423886 0 147542 1256 1632T:generic/opt64gcc -march=native -mtune=native -O -fwrapv -fPIC -fPIE -gdwarf-4 -Wall2026100620261004
6131324224 0 146411 1288 1504T:generic/opt64clang -march=native -O -fwrapv -Qunused-arguments -fPIC -fPIE -gdwarf-4 -Wall2026100620261004
6257635009 0 058726 1256 1600T:sphlibgcc -march=native -mtune=native -O -fwrapv -fPIC -fPIE -gdwarf-4 -Wall2026100620261004
6356731453 0 053513 1232 1568T:sphlibgcc -march=native -mtune=native -Os -fwrapv -fPIC -fPIE -gdwarf-4 -Wall2026100620261004
6505419621 0 1641800 1240 1600T:generic/opt32gcc -march=native -mtune=native -Os -fwrapv -fPIC -fPIE -gdwarf-4 -Wall2026100620261004
6811521714 0 143793 1232 1600T:generic/opt64gcc -march=native -mtune=native -Os -fwrapv -fPIC -fPIE -gdwarf-4 -Wall2026100620261004
7349732886 0 1660405 1264 1696T:powerpc/pp32cv2gcc -march=native -mtune=native -O3 -fwrapv -fPIC -fPIE -gdwarf-4 -Wall2026100620261004
7376331950 0 1655741 1264 1696T:powerpc/pp32cv2gcc -march=native -mtune=native -O2 -fwrapv -fPIC -fPIE -gdwarf-4 -Wall2026100620261004
7815428421 0 1650568 1240 1600T:powerpc/pp32cv2gcc -march=native -mtune=native -Os -fwrapv -fPIC -fPIE -gdwarf-4 -Wall2026100620261004
7936821118 0 1651307 1288 1600T:powerpc/pp32cv1clang -march=native -O3 -fwrapv -Qunused-arguments -fPIC -fPIE -gdwarf-4 -Wall2026100620261004
8035121085 0 1649827 1288 1600T:powerpc/pp32cv1clang -march=native -O2 -fwrapv -Qunused-arguments -fPIC -fPIE -gdwarf-4 -Wall2026100620261004
8087820256 0 1643125 1280 1600T:powerpc/pp32cv1clang -march=native -Os -fwrapv -Qunused-arguments -fPIC -fPIE -gdwarf-4 -Wall2026100620261004
8323930578 0 1654293 1264 1632T:powerpc/pp32cv2gcc -march=native -mtune=native -O -fwrapv -fPIC -fPIE -gdwarf-4 -Wall2026100620261004
8446618049 0 1640259 1288 1536T:powerpc/pp32cv1clang -march=native -O -fwrapv -Qunused-arguments -fPIC -fPIE -gdwarf-4 -Wall2026100620261004
9338718678 0 1646197 1264 1696T:powerpc/pp32cv1gcc -march=native -mtune=native -O3 -fwrapv -fPIC -fPIE -gdwarf-4 -Wall2026100620261004
9349118382 0 1642173 1264 1696T:powerpc/pp32cv1gcc -march=native -mtune=native -O2 -fwrapv -fPIC -fPIE -gdwarf-4 -Wall2026100620261004
9766017970 0 1641685 1264 1632T:powerpc/pp32cv1gcc -march=native -mtune=native -O -fwrapv -fPIC -fPIE -gdwarf-4 -Wall2026100620261004
10875416955 0 1639112 1240 1600T:powerpc/pp32cv1gcc -march=native -mtune=native -Os -fwrapv -fPIC -fPIE -gdwarf-4 -Wall2026100620261004

Compiler output


echo64.S: echo64.S:1040:2: error: '.att_syntax noprefix' is not supported: registers must have a '%' prefix in .att_syntax
echo64.S:  .att_syntax noprefix
echo64.S:  ^
echo64.S: echo64.S:1053:10: error: unknown token in expression
echo64.S:  movabsq $-9187201950435737472, %rax
echo64.S:          ^
echo64.S: echo64.S:1054:10: error: unknown token in expression
echo64.S:  movabsq $-9187201950435737472, %r11
echo64.S:          ^
echo64.S: echo64.S:1055:10: error: unknown token in expression
echo64.S:  movabsq $7599940337074203, %r10
echo64.S:          ^
echo64.S: echo64.S:1056:7: error: unknown token in expression
echo64.S:  movq %rax, MEM_CST+16(%rip)
echo64.S:       ^
echo64.S: echo64.S:1057:10: error: unknown token in expression
echo64.S:  movabsq $7599940337074203, %r9
echo64.S:          ^
echo64.S: echo64.S:1058:10: error: unknown token in expression
echo64.S:  movabsq $-72340172838076674, %rax
echo64.S:          ^
echo64.S: echo64.S:1059:10: error: unknown token in expression
echo64.S:  movabsq $72340172838076673, %r8
echo64.S:          ^
echo64.S: echo64.S:1060:10: error: unknown token in expression
echo64.S: ...

Number of similar (implementation,compiler) pairs: 4, namely:
ImplementationCompiler
T:aes/aes64clang -march=native -O2 -fwrapv -Qunused-arguments -fPIC -fPIE -gdwarf-4 -Wall (Ubuntu_Clang_21.1.8_(6ubuntu1))
T:aes/aes64clang -march=native -O3 -fwrapv -Qunused-arguments -fPIC -fPIE -gdwarf-4 -Wall (Ubuntu_Clang_21.1.8_(6ubuntu1))
T:aes/aes64clang -march=native -O -fwrapv -Qunused-arguments -fPIC -fPIE -gdwarf-4 -Wall (Ubuntu_Clang_21.1.8_(6ubuntu1))
T:aes/aes64clang -march=native -Os -fwrapv -Qunused-arguments -fPIC -fPIE -gdwarf-4 -Wall (Ubuntu_Clang_21.1.8_(6ubuntu1))

Compiler output


try.c: /usr/bin/x86_64-linux-gnu-ld.bfd: libcrypto_hash_echo256.a(echo64.o): relocation R_X86_64_32S against symbol `OLDCV' can not be used when making a PIE object; recompile with -fPIE
try.c: /usr/bin/x86_64-linux-gnu-ld.bfd: failed to set dynamic section sizes: bad value
try.c: collect2: error: ld returned 1 exit status

Number of similar (implementation,compiler) pairs: 4, namely:
ImplementationCompiler
T:aes/aes64gcc -march=native -mtune=native -O2 -fwrapv -fPIC -fPIE -gdwarf-4 -Wall (15.2.0)
T:aes/aes64gcc -march=native -mtune=native -O3 -fwrapv -fPIC -fPIE -gdwarf-4 -Wall (15.2.0)
T:aes/aes64gcc -march=native -mtune=native -O -fwrapv -fPIC -fPIE -gdwarf-4 -Wall (15.2.0)
T:aes/aes64gcc -march=native -mtune=native -Os -fwrapv -fPIC -fPIE -gdwarf-4 -Wall (15.2.0)

Compiler output


echo64.S: echo64.S:224:2: error: invalid instruction mnemonic 'movzbl'
echo64.S:  movzbl ebp, ah
echo64.S:  ^~~~~~
echo64.S: echo64.S:227:2: error: invalid instruction mnemonic 'movzbl'
echo64.S:  movzbl esi, al
echo64.S:  ^~~~~~
echo64.S: echo64.S:239:2: error: invalid instruction mnemonic 'movzbl'
echo64.S:  movzbl ebp, bl
echo64.S:  ^~~~~~
echo64.S: echo64.S:242:2: error: invalid instruction mnemonic 'movzbl'
echo64.S:  movzbl esi, bh
echo64.S:  ^~~~~~
echo64.S: echo64.S:254:2: error: invalid instruction mnemonic 'movzbl'
echo64.S:  movzbl ebp, al
echo64.S:  ^~~~~~
echo64.S: echo64.S:257:2: error: invalid instruction mnemonic 'movzbl'
echo64.S:  movzbl esi, ah
echo64.S:  ^~~~~~
echo64.S: echo64.S:269:2: error: invalid instruction mnemonic 'movzbl'
echo64.S:  movzbl ebp, bh
echo64.S:  ^~~~~~
echo64.S: echo64.S:272:2: error: invalid instruction mnemonic 'movzbl'
echo64.S:  movzbl esi, bl
echo64.S:  ^~~~~~
echo64.S: echo64.S:284:2: error: invalid instruction mnemonic 'movzbl'
echo64.S: ...

Number of similar (implementation,compiler) pairs: 4, namely:
ImplementationCompiler
T:athlon/athlon64clang -march=native -O2 -fwrapv -Qunused-arguments -fPIC -fPIE -gdwarf-4 -Wall (Ubuntu_Clang_21.1.8_(6ubuntu1))
T:athlon/athlon64clang -march=native -O3 -fwrapv -Qunused-arguments -fPIC -fPIE -gdwarf-4 -Wall (Ubuntu_Clang_21.1.8_(6ubuntu1))
T:athlon/athlon64clang -march=native -O -fwrapv -Qunused-arguments -fPIC -fPIE -gdwarf-4 -Wall (Ubuntu_Clang_21.1.8_(6ubuntu1))
T:athlon/athlon64clang -march=native -Os -fwrapv -Qunused-arguments -fPIC -fPIE -gdwarf-4 -Wall (Ubuntu_Clang_21.1.8_(6ubuntu1))

Compiler output


echo64.S: /tmp/cc74Bo2p.s: Assembler messages:
echo64.S: echo64.c:519: Error: no such instruction: `movzbl ebp,ah'
echo64.S: echo64.c:519: Error: no such instruction: `movzbl esi,al'
echo64.S: echo64.c:519: Error: no such instruction: `movzbl ebp,bl'
echo64.S: echo64.c:519: Error: no such instruction: `movzbl esi,bh'
echo64.S: echo64.c:519: Error: no such instruction: `movzbl ebp,al'
echo64.S: echo64.c:519: Error: no such instruction: `movzbl esi,ah'
echo64.S: echo64.c:519: Error: no such instruction: `movzbl ebp,bh'
echo64.S: echo64.c:519: Error: no such instruction: `movzbl esi,bl'
echo64.S: echo64.c:519: Error: no such instruction: `movzbl ebp,ah'
echo64.S: echo64.c:519: Error: no such instruction: `movzbl esi,al'
echo64.S: echo64.c:519: Error: no such instruction: `movzbl ebp,bl'
echo64.S: echo64.c:519: Error: no such instruction: `movzbl esi,bh'
echo64.S: echo64.c:519: Error: no such instruction: `movzbl ebp,al'
echo64.S: echo64.c:519: Error: no such instruction: `movzbl esi,ah'
echo64.S: echo64.c:519: Error: no such instruction: `movzbl ebp,bl'
echo64.S: echo64.c:519: Error: no such instruction: `movzbl esi,bh'
echo64.S: echo64.c:519: Error: no such instruction: `movzbl ebp,dl'
echo64.S: echo64.c:519: Error: no such instruction: `movzbl esi,dh'
echo64.S: echo64.c:519: Error: no such instruction: `movzbl ebp,ch'
echo64.S: echo64.c:519: Error: no such instruction: `movzbl esi,cl'
echo64.S: echo64.c:519: Error: no such instruction: `movzbl ebp,cl'
echo64.S: echo64.c:519: Error: no such instruction: `movzbl esi,ch'
echo64.S: echo64.c:519: Error: no such instruction: `movzbl ebp,dh'
echo64.S: echo64.c:519: Error: no such instruction: `movzbl esi,dl'
echo64.S: ...

Number of similar (implementation,compiler) pairs: 1, namely:
ImplementationCompiler
T:athlon/athlon64gcc -march=native -mtune=native -O2 -fwrapv -fPIC -fPIE -gdwarf-4 -Wall (15.2.0)

Compiler output


echo64.S: /tmp/ccCfpkOT.s: Assembler messages:
echo64.S: echo64.c:519: Error: no such instruction: `movzbl ebp,ah'
echo64.S: echo64.c:519: Error: no such instruction: `movzbl esi,al'
echo64.S: echo64.c:519: Error: no such instruction: `movzbl ebp,bl'
echo64.S: echo64.c:519: Error: no such instruction: `movzbl esi,bh'
echo64.S: echo64.c:519: Error: no such instruction: `movzbl ebp,al'
echo64.S: echo64.c:519: Error: no such instruction: `movzbl esi,ah'
echo64.S: echo64.c:519: Error: no such instruction: `movzbl ebp,bh'
echo64.S: echo64.c:519: Error: no such instruction: `movzbl esi,bl'
echo64.S: echo64.c:519: Error: no such instruction: `movzbl ebp,ah'
echo64.S: echo64.c:519: Error: no such instruction: `movzbl esi,al'
echo64.S: echo64.c:519: Error: no such instruction: `movzbl ebp,bl'
echo64.S: echo64.c:519: Error: no such instruction: `movzbl esi,bh'
echo64.S: echo64.c:519: Error: no such instruction: `movzbl ebp,al'
echo64.S: echo64.c:519: Error: no such instruction: `movzbl esi,ah'
echo64.S: echo64.c:519: Error: no such instruction: `movzbl ebp,bl'
echo64.S: echo64.c:519: Error: no such instruction: `movzbl esi,bh'
echo64.S: echo64.c:519: Error: no such instruction: `movzbl ebp,dl'
echo64.S: echo64.c:519: Error: no such instruction: `movzbl esi,dh'
echo64.S: echo64.c:519: Error: no such instruction: `movzbl ebp,ch'
echo64.S: echo64.c:519: Error: no such instruction: `movzbl esi,cl'
echo64.S: echo64.c:519: Error: no such instruction: `movzbl ebp,cl'
echo64.S: echo64.c:519: Error: no such instruction: `movzbl esi,ch'
echo64.S: echo64.c:519: Error: no such instruction: `movzbl ebp,dh'
echo64.S: echo64.c:519: Error: no such instruction: `movzbl esi,dl'
echo64.S: ...

Number of similar (implementation,compiler) pairs: 1, namely:
ImplementationCompiler
T:athlon/athlon64gcc -march=native -mtune=native -O3 -fwrapv -fPIC -fPIE -gdwarf-4 -Wall (15.2.0)

Compiler output


echo64.S: /tmp/ccdJoAlv.s: Assembler messages:
echo64.S: echo64.c:519: Error: no such instruction: `movzbl ebp,ah'
echo64.S: echo64.c:519: Error: no such instruction: `movzbl esi,al'
echo64.S: echo64.c:519: Error: no such instruction: `movzbl ebp,bl'
echo64.S: echo64.c:519: Error: no such instruction: `movzbl esi,bh'
echo64.S: echo64.c:519: Error: no such instruction: `movzbl ebp,al'
echo64.S: echo64.c:519: Error: no such instruction: `movzbl esi,ah'
echo64.S: echo64.c:519: Error: no such instruction: `movzbl ebp,bh'
echo64.S: echo64.c:519: Error: no such instruction: `movzbl esi,bl'
echo64.S: echo64.c:519: Error: no such instruction: `movzbl ebp,ah'
echo64.S: echo64.c:519: Error: no such instruction: `movzbl esi,al'
echo64.S: echo64.c:519: Error: no such instruction: `movzbl ebp,bl'
echo64.S: echo64.c:519: Error: no such instruction: `movzbl esi,bh'
echo64.S: echo64.c:519: Error: no such instruction: `movzbl ebp,al'
echo64.S: echo64.c:519: Error: no such instruction: `movzbl esi,ah'
echo64.S: echo64.c:519: Error: no such instruction: `movzbl ebp,bl'
echo64.S: echo64.c:519: Error: no such instruction: `movzbl esi,bh'
echo64.S: echo64.c:519: Error: no such instruction: `movzbl ebp,dl'
echo64.S: echo64.c:519: Error: no such instruction: `movzbl esi,dh'
echo64.S: echo64.c:519: Error: no such instruction: `movzbl ebp,ch'
echo64.S: echo64.c:519: Error: no such instruction: `movzbl esi,cl'
echo64.S: echo64.c:519: Error: no such instruction: `movzbl ebp,cl'
echo64.S: echo64.c:519: Error: no such instruction: `movzbl esi,ch'
echo64.S: echo64.c:519: Error: no such instruction: `movzbl ebp,dh'
echo64.S: echo64.c:519: Error: no such instruction: `movzbl esi,dl'
echo64.S: ...

Number of similar (implementation,compiler) pairs: 1, namely:
ImplementationCompiler
T:athlon/athlon64gcc -march=native -mtune=native -O -fwrapv -fPIC -fPIE -gdwarf-4 -Wall (15.2.0)

Compiler output


echo64.S: /tmp/cckYEWnY.s: Assembler messages:
echo64.S: echo64.c:519: Error: no such instruction: `movzbl ebp,ah'
echo64.S: echo64.c:519: Error: no such instruction: `movzbl esi,al'
echo64.S: echo64.c:519: Error: no such instruction: `movzbl ebp,bl'
echo64.S: echo64.c:519: Error: no such instruction: `movzbl esi,bh'
echo64.S: echo64.c:519: Error: no such instruction: `movzbl ebp,al'
echo64.S: echo64.c:519: Error: no such instruction: `movzbl esi,ah'
echo64.S: echo64.c:519: Error: no such instruction: `movzbl ebp,bh'
echo64.S: echo64.c:519: Error: no such instruction: `movzbl esi,bl'
echo64.S: echo64.c:519: Error: no such instruction: `movzbl ebp,ah'
echo64.S: echo64.c:519: Error: no such instruction: `movzbl esi,al'
echo64.S: echo64.c:519: Error: no such instruction: `movzbl ebp,bl'
echo64.S: echo64.c:519: Error: no such instruction: `movzbl esi,bh'
echo64.S: echo64.c:519: Error: no such instruction: `movzbl ebp,al'
echo64.S: echo64.c:519: Error: no such instruction: `movzbl esi,ah'
echo64.S: echo64.c:519: Error: no such instruction: `movzbl ebp,bl'
echo64.S: echo64.c:519: Error: no such instruction: `movzbl esi,bh'
echo64.S: echo64.c:519: Error: no such instruction: `movzbl ebp,dl'
echo64.S: echo64.c:519: Error: no such instruction: `movzbl esi,dh'
echo64.S: echo64.c:519: Error: no such instruction: `movzbl ebp,ch'
echo64.S: echo64.c:519: Error: no such instruction: `movzbl esi,cl'
echo64.S: echo64.c:519: Error: no such instruction: `movzbl ebp,cl'
echo64.S: echo64.c:519: Error: no such instruction: `movzbl esi,ch'
echo64.S: echo64.c:519: Error: no such instruction: `movzbl ebp,dh'
echo64.S: echo64.c:519: Error: no such instruction: `movzbl esi,dl'
echo64.S: ...

Number of similar (implementation,compiler) pairs: 1, namely:
ImplementationCompiler
T:athlon/athlon64gcc -march=native -mtune=native -Os -fwrapv -fPIC -fPIE -gdwarf-4 -Wall (15.2.0)

Compiler output


hash.c: hash.c:250:18: warning: unused variable 't3' [-Wunused-variable]
hash.c:   250 |         __m128i t1, t2, t3, t4, s1, s2, s3, k1, ktemp;
hash.c:       |                         ^~
hash.c: hash.c:250:22: warning: unused variable 't4' [-Wunused-variable]
hash.c:   250 |         __m128i t1, t2, t3, t4, s1, s2, s3, k1, ktemp;
hash.c:       |                             ^~
hash.c: hash.c:250:26: warning: unused variable 's1' [-Wunused-variable]
hash.c:   250 |         __m128i t1, t2, t3, t4, s1, s2, s3, k1, ktemp;
hash.c:       |                                 ^~
hash.c: hash.c:250:34: warning: unused variable 's3' [-Wunused-variable]
hash.c:   250 |         __m128i t1, t2, t3, t4, s1, s2, s3, k1, ktemp;
hash.c:       |                                         ^~
hash.c: hash.c:250:42: warning: unused variable 'ktemp' [-Wunused-variable]
hash.c:   250 |         __m128i t1, t2, t3, t4, s1, s2, s3, k1, ktemp;
hash.c:       |                                                 ^~~~~
hash.c: 5 warnings generated.

Number of similar (implementation,compiler) pairs: 4, namely:
ImplementationCompiler
T:ccalik/aesniclang -march=native -O2 -fwrapv -Qunused-arguments -fPIC -fPIE -gdwarf-4 -Wall (Ubuntu_Clang_21.1.8_(6ubuntu1))
T:ccalik/aesniclang -march=native -O3 -fwrapv -Qunused-arguments -fPIC -fPIE -gdwarf-4 -Wall (Ubuntu_Clang_21.1.8_(6ubuntu1))
T:ccalik/aesniclang -march=native -O -fwrapv -Qunused-arguments -fPIC -fPIE -gdwarf-4 -Wall (Ubuntu_Clang_21.1.8_(6ubuntu1))
T:ccalik/aesniclang -march=native -Os -fwrapv -Qunused-arguments -fPIC -fPIE -gdwarf-4 -Wall (Ubuntu_Clang_21.1.8_(6ubuntu1))

Compiler output


hash.c: In file included from hash.c:20:
hash.c: vperm.h:57:9: warning: multi-line comment [-Wcomment]
hash.c:    57 |         //t2 = _mm_shuffle_epi8(table[0], x);\
hash.c:       |         ^
hash.c: hash.c: In function 'Compress':
hash.c: hash.c:250:49: warning: unused variable 'ktemp' [-Wunused-variable]
hash.c:   250 |         __m128i t1, t2, t3, t4, s1, s2, s3, k1, ktemp;
hash.c:       |                                                 ^~~~~
hash.c: hash.c:250:41: warning: unused variable 's3' [-Wunused-variable]
hash.c:   250 |         __m128i t1, t2, t3, t4, s1, s2, s3, k1, ktemp;
hash.c:       |                                         ^~
hash.c: hash.c:250:33: warning: unused variable 's1' [-Wunused-variable]
hash.c:   250 |         __m128i t1, t2, t3, t4, s1, s2, s3, k1, ktemp;
hash.c:       |                                 ^~
hash.c: hash.c:250:29: warning: unused variable 't4' [-Wunused-variable]
hash.c:   250 |         __m128i t1, t2, t3, t4, s1, s2, s3, k1, ktemp;
hash.c:       |                             ^~
hash.c: hash.c:250:25: warning: unused variable 't3' [-Wunused-variable]
hash.c:   250 |         __m128i t1, t2, t3, t4, s1, s2, s3, k1, ktemp;
hash.c:       |                         ^~

Number of similar (implementation,compiler) pairs: 4, namely:
ImplementationCompiler
T:ccalik/aesnigcc -march=native -mtune=native -O2 -fwrapv -fPIC -fPIE -gdwarf-4 -Wall (15.2.0)
T:ccalik/aesnigcc -march=native -mtune=native -O3 -fwrapv -fPIC -fPIE -gdwarf-4 -Wall (15.2.0)
T:ccalik/aesnigcc -march=native -mtune=native -O -fwrapv -fPIC -fPIE -gdwarf-4 -Wall (15.2.0)
T:ccalik/aesnigcc -march=native -mtune=native -Os -fwrapv -fPIC -fPIE -gdwarf-4 -Wall (15.2.0)

Compiler output


hash.c: In file included from hash.c:20:
hash.c: vperm.h:57:9: warning: multi-line comment [-Wcomment]
hash.c:    57 |         //t2 = _mm_shuffle_epi8(table[0], x);\
hash.c:       |         ^

Number of similar (implementation,compiler) pairs: 4, namely:
ImplementationCompiler
T:ccalik/vpermgcc -march=native -mtune=native -O2 -fwrapv -fPIC -fPIE -gdwarf-4 -Wall (15.2.0)
T:ccalik/vpermgcc -march=native -mtune=native -O3 -fwrapv -fPIC -fPIE -gdwarf-4 -Wall (15.2.0)
T:ccalik/vpermgcc -march=native -mtune=native -O -fwrapv -fPIC -fPIE -gdwarf-4 -Wall (15.2.0)
T:ccalik/vpermgcc -march=native -mtune=native -Os -fwrapv -fPIC -fPIE -gdwarf-4 -Wall (15.2.0)

Compiler output


echo64.S: echo64.S:212:2: error: invalid instruction mnemonic 'movzbl'
echo64.S:  movzbl ebp, ah
echo64.S:  ^~~~~~
echo64.S: echo64.S:218:2: error: invalid instruction mnemonic 'movzbl'
echo64.S:  movzbl esi, al
echo64.S:  ^~~~~~
echo64.S: echo64.S:227:2: error: invalid instruction mnemonic 'movzbl'
echo64.S:  movzbl ebp, bl
echo64.S:  ^~~~~~
echo64.S: echo64.S:233:2: error: invalid instruction mnemonic 'movzbl'
echo64.S:  movzbl esi, bh
echo64.S:  ^~~~~~
echo64.S: echo64.S:242:2: error: invalid instruction mnemonic 'movzbl'
echo64.S:  movzbl ebp, al
echo64.S:  ^~~~~~
echo64.S: echo64.S:248:2: error: invalid instruction mnemonic 'movzbl'
echo64.S:  movzbl esi, ah
echo64.S:  ^~~~~~
echo64.S: echo64.S:257:2: error: invalid instruction mnemonic 'movzbl'
echo64.S:  movzbl ebp, bh
echo64.S:  ^~~~~~
echo64.S: echo64.S:263:2: error: invalid instruction mnemonic 'movzbl'
echo64.S:  movzbl esi, bl
echo64.S:  ^~~~~~
echo64.S: echo64.S:272:2: error: invalid instruction mnemonic 'movzbl'
echo64.S: ...

Number of similar (implementation,compiler) pairs: 4, namely:
ImplementationCompiler
T:core2/core2v64clang -march=native -O2 -fwrapv -Qunused-arguments -fPIC -fPIE -gdwarf-4 -Wall (Ubuntu_Clang_21.1.8_(6ubuntu1))
T:core2/core2v64clang -march=native -O3 -fwrapv -Qunused-arguments -fPIC -fPIE -gdwarf-4 -Wall (Ubuntu_Clang_21.1.8_(6ubuntu1))
T:core2/core2v64clang -march=native -O -fwrapv -Qunused-arguments -fPIC -fPIE -gdwarf-4 -Wall (Ubuntu_Clang_21.1.8_(6ubuntu1))
T:core2/core2v64clang -march=native -Os -fwrapv -Qunused-arguments -fPIC -fPIE -gdwarf-4 -Wall (Ubuntu_Clang_21.1.8_(6ubuntu1))

Compiler output


echo64.S: /tmp/ccDiRCdx.s: Assembler messages:
echo64.S: echo64.c:473: Error: no such instruction: `movzbl ebp,ah'
echo64.S: echo64.c:473: Error: no such instruction: `movzbl esi,al'
echo64.S: echo64.c:473: Error: no such instruction: `movzbl ebp,bl'
echo64.S: echo64.c:473: Error: no such instruction: `movzbl esi,bh'
echo64.S: echo64.c:473: Error: no such instruction: `movzbl ebp,al'
echo64.S: echo64.c:473: Error: no such instruction: `movzbl esi,ah'
echo64.S: echo64.c:473: Error: no such instruction: `movzbl ebp,bh'
echo64.S: echo64.c:473: Error: no such instruction: `movzbl esi,bl'
echo64.S: echo64.c:473: Error: no such instruction: `movzbl ebp,ah'
echo64.S: echo64.c:473: Error: no such instruction: `movzbl esi,al'
echo64.S: echo64.c:473: Error: no such instruction: `movzbl ebp,bl'
echo64.S: echo64.c:473: Error: no such instruction: `movzbl esi,bh'
echo64.S: echo64.c:473: Error: no such instruction: `movzbl ebp,al'
echo64.S: echo64.c:473: Error: no such instruction: `movzbl esi,ah'
echo64.S: echo64.c:473: Error: no such instruction: `movzbl ebp,bl'
echo64.S: echo64.c:473: Error: no such instruction: `movzbl esi,bh'
echo64.S: echo64.c:473: Error: no such instruction: `movzbl ebp,dl'
echo64.S: echo64.c:473: Error: no such instruction: `movzbl esi,dh'
echo64.S: echo64.c:473: Error: no such instruction: `movzbl ebp,ch'
echo64.S: echo64.c:473: Error: no such instruction: `movzbl esi,cl'
echo64.S: echo64.c:473: Error: no such instruction: `movzbl ebp,cl'
echo64.S: echo64.c:473: Error: no such instruction: `movzbl esi,ch'
echo64.S: echo64.c:473: Error: no such instruction: `movzbl ebp,dh'
echo64.S: echo64.c:473: Error: no such instruction: `movzbl esi,dl'
echo64.S: ...

Number of similar (implementation,compiler) pairs: 1, namely:
ImplementationCompiler
T:core2/core2v64gcc -march=native -mtune=native -O2 -fwrapv -fPIC -fPIE -gdwarf-4 -Wall (15.2.0)

Compiler output


echo64.S: /tmp/ccPo0Wp8.s: Assembler messages:
echo64.S: echo64.c:473: Error: no such instruction: `movzbl ebp,ah'
echo64.S: echo64.c:473: Error: no such instruction: `movzbl esi,al'
echo64.S: echo64.c:473: Error: no such instruction: `movzbl ebp,bl'
echo64.S: echo64.c:473: Error: no such instruction: `movzbl esi,bh'
echo64.S: echo64.c:473: Error: no such instruction: `movzbl ebp,al'
echo64.S: echo64.c:473: Error: no such instruction: `movzbl esi,ah'
echo64.S: echo64.c:473: Error: no such instruction: `movzbl ebp,bh'
echo64.S: echo64.c:473: Error: no such instruction: `movzbl esi,bl'
echo64.S: echo64.c:473: Error: no such instruction: `movzbl ebp,ah'
echo64.S: echo64.c:473: Error: no such instruction: `movzbl esi,al'
echo64.S: echo64.c:473: Error: no such instruction: `movzbl ebp,bl'
echo64.S: echo64.c:473: Error: no such instruction: `movzbl esi,bh'
echo64.S: echo64.c:473: Error: no such instruction: `movzbl ebp,al'
echo64.S: echo64.c:473: Error: no such instruction: `movzbl esi,ah'
echo64.S: echo64.c:473: Error: no such instruction: `movzbl ebp,bl'
echo64.S: echo64.c:473: Error: no such instruction: `movzbl esi,bh'
echo64.S: echo64.c:473: Error: no such instruction: `movzbl ebp,dl'
echo64.S: echo64.c:473: Error: no such instruction: `movzbl esi,dh'
echo64.S: echo64.c:473: Error: no such instruction: `movzbl ebp,ch'
echo64.S: echo64.c:473: Error: no such instruction: `movzbl esi,cl'
echo64.S: echo64.c:473: Error: no such instruction: `movzbl ebp,cl'
echo64.S: echo64.c:473: Error: no such instruction: `movzbl esi,ch'
echo64.S: echo64.c:473: Error: no such instruction: `movzbl ebp,dh'
echo64.S: echo64.c:473: Error: no such instruction: `movzbl esi,dl'
echo64.S: ...

Number of similar (implementation,compiler) pairs: 1, namely:
ImplementationCompiler
T:core2/core2v64gcc -march=native -mtune=native -O3 -fwrapv -fPIC -fPIE -gdwarf-4 -Wall (15.2.0)

Compiler output


echo64.S: /tmp/ccUpmNee.s: Assembler messages:
echo64.S: echo64.c:473: Error: no such instruction: `movzbl ebp,ah'
echo64.S: echo64.c:473: Error: no such instruction: `movzbl esi,al'
echo64.S: echo64.c:473: Error: no such instruction: `movzbl ebp,bl'
echo64.S: echo64.c:473: Error: no such instruction: `movzbl esi,bh'
echo64.S: echo64.c:473: Error: no such instruction: `movzbl ebp,al'
echo64.S: echo64.c:473: Error: no such instruction: `movzbl esi,ah'
echo64.S: echo64.c:473: Error: no such instruction: `movzbl ebp,bh'
echo64.S: echo64.c:473: Error: no such instruction: `movzbl esi,bl'
echo64.S: echo64.c:473: Error: no such instruction: `movzbl ebp,ah'
echo64.S: echo64.c:473: Error: no such instruction: `movzbl esi,al'
echo64.S: echo64.c:473: Error: no such instruction: `movzbl ebp,bl'
echo64.S: echo64.c:473: Error: no such instruction: `movzbl esi,bh'
echo64.S: echo64.c:473: Error: no such instruction: `movzbl ebp,al'
echo64.S: echo64.c:473: Error: no such instruction: `movzbl esi,ah'
echo64.S: echo64.c:473: Error: no such instruction: `movzbl ebp,bl'
echo64.S: echo64.c:473: Error: no such instruction: `movzbl esi,bh'
echo64.S: echo64.c:473: Error: no such instruction: `movzbl ebp,dl'
echo64.S: echo64.c:473: Error: no such instruction: `movzbl esi,dh'
echo64.S: echo64.c:473: Error: no such instruction: `movzbl ebp,ch'
echo64.S: echo64.c:473: Error: no such instruction: `movzbl esi,cl'
echo64.S: echo64.c:473: Error: no such instruction: `movzbl ebp,cl'
echo64.S: echo64.c:473: Error: no such instruction: `movzbl esi,ch'
echo64.S: echo64.c:473: Error: no such instruction: `movzbl ebp,dh'
echo64.S: echo64.c:473: Error: no such instruction: `movzbl esi,dl'
echo64.S: ...

Number of similar (implementation,compiler) pairs: 1, namely:
ImplementationCompiler
T:core2/core2v64gcc -march=native -mtune=native -O -fwrapv -fPIC -fPIE -gdwarf-4 -Wall (15.2.0)

Compiler output


echo64.S: /tmp/cciOr9k6.s: Assembler messages:
echo64.S: echo64.c:473: Error: no such instruction: `movzbl ebp,ah'
echo64.S: echo64.c:473: Error: no such instruction: `movzbl esi,al'
echo64.S: echo64.c:473: Error: no such instruction: `movzbl ebp,bl'
echo64.S: echo64.c:473: Error: no such instruction: `movzbl esi,bh'
echo64.S: echo64.c:473: Error: no such instruction: `movzbl ebp,al'
echo64.S: echo64.c:473: Error: no such instruction: `movzbl esi,ah'
echo64.S: echo64.c:473: Error: no such instruction: `movzbl ebp,bh'
echo64.S: echo64.c:473: Error: no such instruction: `movzbl esi,bl'
echo64.S: echo64.c:473: Error: no such instruction: `movzbl ebp,ah'
echo64.S: echo64.c:473: Error: no such instruction: `movzbl esi,al'
echo64.S: echo64.c:473: Error: no such instruction: `movzbl ebp,bl'
echo64.S: echo64.c:473: Error: no such instruction: `movzbl esi,bh'
echo64.S: echo64.c:473: Error: no such instruction: `movzbl ebp,al'
echo64.S: echo64.c:473: Error: no such instruction: `movzbl esi,ah'
echo64.S: echo64.c:473: Error: no such instruction: `movzbl ebp,bl'
echo64.S: echo64.c:473: Error: no such instruction: `movzbl esi,bh'
echo64.S: echo64.c:473: Error: no such instruction: `movzbl ebp,dl'
echo64.S: echo64.c:473: Error: no such instruction: `movzbl esi,dh'
echo64.S: echo64.c:473: Error: no such instruction: `movzbl ebp,ch'
echo64.S: echo64.c:473: Error: no such instruction: `movzbl esi,cl'
echo64.S: echo64.c:473: Error: no such instruction: `movzbl ebp,cl'
echo64.S: echo64.c:473: Error: no such instruction: `movzbl esi,ch'
echo64.S: echo64.c:473: Error: no such instruction: `movzbl ebp,dh'
echo64.S: echo64.c:473: Error: no such instruction: `movzbl esi,dl'
echo64.S: ...

Number of similar (implementation,compiler) pairs: 1, namely:
ImplementationCompiler
T:core2/core2v64gcc -march=native -mtune=native -Os -fwrapv -fPIC -fPIE -gdwarf-4 -Wall (15.2.0)

Compiler output


echo32.c: echo32.c:105:18: warning: unused variable 'j' [-Wunused-variable]
echo32.c:   105 |         unsigned int i, j;
echo32.c:       |                         ^
echo32.c: echo32.c:106:16: warning: unused variable 'endianess' [-Wunused-variable]
echo32.c:   106 |         unsigned char endianess;
echo32.c:       |                       ^~~~~~~~~
echo32.c: echo32.c:342:15: warning: unused variable 'i' [-Wunused-variable]
echo32.c:   342 |         unsigned int i;
echo32.c:       |                      ^
echo32.c: echo32.c:343:21: warning: unused variable 'c0' [-Wunused-variable]
echo32.c:   343 |         unsigned long long c0, c1;
echo32.c:       |                            ^~
echo32.c: echo32.c:343:25: warning: unused variable 'c1' [-Wunused-variable]
echo32.c:   343 |         unsigned long long c0, c1;
echo32.c:       |                                ^~
echo32.c: echo32.c:441:21: warning: unused variable 'hashlen' [-Wunused-variable]
echo32.c:   441 |         unsigned short int hashlen = 0;
echo32.c:       |                            ^~~~~~~
echo32.c: echo32.c:442:21: warning: unused variable 'messlen_l' [-Wunused-variable]
echo32.c:   442 |         unsigned long long messlen_l = 0;
echo32.c:       |                            ^~~~~~~~~
echo32.c: echo32.c:443:21: warning: unused variable 'messlen_h' [-Wunused-variable]
echo32.c:   443 |         unsigned long long messlen_h = 0;
echo32.c:       |                            ^~~~~~~~~
echo32.c: 8 warnings generated.

Number of similar (implementation,compiler) pairs: 4, namely:
ImplementationCompiler
T:generic/opt32clang -march=native -O2 -fwrapv -Qunused-arguments -fPIC -fPIE -gdwarf-4 -Wall (Ubuntu_Clang_21.1.8_(6ubuntu1))
T:generic/opt32clang -march=native -O3 -fwrapv -Qunused-arguments -fPIC -fPIE -gdwarf-4 -Wall (Ubuntu_Clang_21.1.8_(6ubuntu1))
T:generic/opt32clang -march=native -O -fwrapv -Qunused-arguments -fPIC -fPIE -gdwarf-4 -Wall (Ubuntu_Clang_21.1.8_(6ubuntu1))
T:generic/opt32clang -march=native -Os -fwrapv -Qunused-arguments -fPIC -fPIE -gdwarf-4 -Wall (Ubuntu_Clang_21.1.8_(6ubuntu1))

Compiler output


echo32.c: echo32.c: In function 'Init':
echo32.c: echo32.c:106:23: warning: unused variable 'endianess' [-Wunused-variable]
echo32.c:   106 |         unsigned char endianess;
echo32.c:       |                       ^~~~~~~~~
echo32.c: echo32.c:105:25: warning: unused variable 'j' [-Wunused-variable]
echo32.c:   105 |         unsigned int i, j;
echo32.c:       |                         ^
echo32.c: echo32.c: In function 'Compress':
echo32.c: echo32.c:343:32: warning: unused variable 'c1' [-Wunused-variable]
echo32.c:   343 |         unsigned long long c0, c1;
echo32.c:       |                                ^~
echo32.c: echo32.c:343:28: warning: unused variable 'c0' [-Wunused-variable]
echo32.c:   343 |         unsigned long long c0, c1;
echo32.c:       |                            ^~
echo32.c: echo32.c:342:22: warning: unused variable 'i' [-Wunused-variable]
echo32.c:   342 |         unsigned int i;
echo32.c:       |                      ^
echo32.c: echo32.c: In function 'Final':
echo32.c: echo32.c:443:28: warning: unused variable 'messlen_h' [-Wunused-variable]
echo32.c:   443 |         unsigned long long messlen_h = 0;
echo32.c:       |                            ^~~~~~~~~
echo32.c: echo32.c:442:28: warning: unused variable 'messlen_l' [-Wunused-variable]
echo32.c:   442 |         unsigned long long messlen_l = 0;
echo32.c:       |                            ^~~~~~~~~
echo32.c: echo32.c:441:28: warning: unused variable 'hashlen' [-Wunused-variable]
echo32.c: ...

Number of similar (implementation,compiler) pairs: 4, namely:
ImplementationCompiler
T:generic/opt32gcc -march=native -mtune=native -O2 -fwrapv -fPIC -fPIE -gdwarf-4 -Wall (15.2.0)
T:generic/opt32gcc -march=native -mtune=native -O3 -fwrapv -fPIC -fPIE -gdwarf-4 -Wall (15.2.0)
T:generic/opt32gcc -march=native -mtune=native -O -fwrapv -fPIC -fPIE -gdwarf-4 -Wall (15.2.0)
T:generic/opt32gcc -march=native -mtune=native -Os -fwrapv -fPIC -fPIE -gdwarf-4 -Wall (15.2.0)

Compiler output


echo64.c: echo64.c:290:30: warning: unused variable 'WT5' [-Wunused-variable]
echo64.c:   290 |     WT0, WT1, WT2, WT3, WT4, WT5;
echo64.c:       |                              ^~~
echo64.c: echo64.c:432:16: warning: unused variable 'i' [-Wunused-variable]
echo64.c:   432 |   unsigned int i;
echo64.c:       |                ^
echo64.c: echo64.c:501:29: warning: passing 'const unsigned char *' to parameter of type 'BitSequence *' (aka 'unsigned char *') discards qualifiers [-Wincompatible-pointer-types-discards-qualifiers]
echo64.c:   501 |   if (Hash(CRYPTO_BYTES * 8,in,inlen * 8,out) == SUCCESS) return 0;
echo64.c:       |                             ^~
echo64.c: echo64.c:488:46: note: passing argument to parameter 'data' here
echo64.c:   488 | HashReturn Hash(int hashbitlen, BitSequence *data, DataLength databitlen, BitSequence *hashval)
echo64.c:       |                                              ^
echo64.c: 3 warnings generated.

Number of similar (implementation,compiler) pairs: 4, namely:
ImplementationCompiler
T:generic/opt64clang -march=native -O2 -fwrapv -Qunused-arguments -fPIC -fPIE -gdwarf-4 -Wall (Ubuntu_Clang_21.1.8_(6ubuntu1))
T:generic/opt64clang -march=native -O3 -fwrapv -Qunused-arguments -fPIC -fPIE -gdwarf-4 -Wall (Ubuntu_Clang_21.1.8_(6ubuntu1))
T:generic/opt64clang -march=native -O -fwrapv -Qunused-arguments -fPIC -fPIE -gdwarf-4 -Wall (Ubuntu_Clang_21.1.8_(6ubuntu1))
T:generic/opt64clang -march=native -Os -fwrapv -Qunused-arguments -fPIC -fPIE -gdwarf-4 -Wall (Ubuntu_Clang_21.1.8_(6ubuntu1))

Compiler output


echo64.c: echo64.c: In function 'Compress':
echo64.c: echo64.c:290:30: warning: unused variable 'WT5' [-Wunused-variable]
echo64.c:   290 |     WT0, WT1, WT2, WT3, WT4, WT5;
echo64.c:       |                              ^~~
echo64.c: echo64.c: In function 'Final':
echo64.c: echo64.c:432:16: warning: unused variable 'i' [-Wunused-variable]
echo64.c:   432 |   unsigned int i;
echo64.c:       |                ^
echo64.c: echo64.c: In function 'crypto_hash_echo256_generic_opt64_timingleaks':
echo64.c: echo64.c:501:29: warning: passing argument 2 of 'Hash' discards 'const' qualifier from pointer target type [-Wdiscarded-qualifiers]
echo64.c:   501 |   if (Hash(CRYPTO_BYTES * 8,in,inlen * 8,out) == SUCCESS) return 0;
echo64.c:       |                             ^~
echo64.c: echo64.c:488:46: note: expected 'BitSequence *' {aka 'unsigned char *'} but argument is of type 'const unsigned char *'
echo64.c:   488 | HashReturn Hash(int hashbitlen, BitSequence *data, DataLength databitlen, BitSequence *hashval)
echo64.c:       |                                 ~~~~~~~~~~~~~^~~~

Number of similar (implementation,compiler) pairs: 4, namely:
ImplementationCompiler
T:generic/opt64gcc -march=native -mtune=native -O2 -fwrapv -fPIC -fPIE -gdwarf-4 -Wall (15.2.0)
T:generic/opt64gcc -march=native -mtune=native -O3 -fwrapv -fPIC -fPIE -gdwarf-4 -Wall (15.2.0)
T:generic/opt64gcc -march=native -mtune=native -O -fwrapv -fPIC -fPIE -gdwarf-4 -Wall (15.2.0)
T:generic/opt64gcc -march=native -mtune=native -Os -fwrapv -fPIC -fPIE -gdwarf-4 -Wall (15.2.0)

Compiler output


echo32.S: echo32.S:311:2: error: invalid instruction mnemonic 'addd'
echo32.S:  addd [SHA3_CNT], 1
echo32.S:  ^~~~
echo32.S: echo32.S:575:2: error: invalid instruction mnemonic 'addd'
echo32.S:  addd [SHA3_CNT], 1
echo32.S:  ^~~~
echo32.S: echo32.S:839:2: error: invalid instruction mnemonic 'addd'
echo32.S:  addd [SHA3_CNT], 1
echo32.S:  ^~~~
echo32.S: echo32.S:1103:2: error: invalid instruction mnemonic 'addd'
echo32.S:  addd [SHA3_CNT], 1
echo32.S:  ^~~~
echo32.S: echo32.S:1367:2: error: invalid instruction mnemonic 'addd'
echo32.S:  addd [SHA3_CNT], 1
echo32.S:  ^~~~
echo32.S: echo32.S:1631:2: error: invalid instruction mnemonic 'addd'
echo32.S:  addd [SHA3_CNT], 1
echo32.S:  ^~~~
echo32.S: echo32.S:1895:2: error: invalid instruction mnemonic 'addd'
echo32.S:  addd [SHA3_CNT], 1
echo32.S:  ^~~~
echo32.S: echo32.S:2159:2: error: invalid instruction mnemonic 'addd'
echo32.S:  addd [SHA3_CNT], 1
echo32.S:  ^~~~
echo32.S: echo32.S:2423:2: error: invalid instruction mnemonic 'addd'
echo32.S: ...

Number of similar (implementation,compiler) pairs: 4, namely:
ImplementationCompiler
T:pentium/pentium4v64v1clang -march=native -O2 -fwrapv -Qunused-arguments -fPIC -fPIE -gdwarf-4 -Wall (Ubuntu_Clang_21.1.8_(6ubuntu1))
T:pentium/pentium4v64v1clang -march=native -O3 -fwrapv -Qunused-arguments -fPIC -fPIE -gdwarf-4 -Wall (Ubuntu_Clang_21.1.8_(6ubuntu1))
T:pentium/pentium4v64v1clang -march=native -O -fwrapv -Qunused-arguments -fPIC -fPIE -gdwarf-4 -Wall (Ubuntu_Clang_21.1.8_(6ubuntu1))
T:pentium/pentium4v64v1clang -march=native -Os -fwrapv -Qunused-arguments -fPIC -fPIE -gdwarf-4 -Wall (Ubuntu_Clang_21.1.8_(6ubuntu1))

Compiler output


echo32.S: /tmp/ccTXFi3G.s: Assembler messages:
echo32.S: echo32.c:545: Warning: mnemonic suffix used with `add'
echo32.S: echo32.c:545: Warning: NOTE: Such forms are deprecated and will be rejected by a future version of the assembler
echo32.S: echo32.c:545: Warning: mnemonic suffix used with `add'
echo32.S: echo32.c:545: Warning: mnemonic suffix used with `add'
echo32.S: echo32.c:545: Warning: mnemonic suffix used with `add'
echo32.S: echo32.c:546: Warning: mnemonic suffix used with `add'
echo32.S: echo32.c:546: Warning: mnemonic suffix used with `add'
echo32.S: echo32.c:546: Warning: mnemonic suffix used with `add'
echo32.S: echo32.c:546: Warning: mnemonic suffix used with `add'
echo32.S: echo32.c:547: Warning: mnemonic suffix used with `add'
echo32.S: echo32.c:547: Warning: mnemonic suffix used with `add'
echo32.S: echo32.c:547: Warning: mnemonic suffix used with `add'
echo32.S: echo32.c:547: Warning: mnemonic suffix used with `add'
echo32.S: echo32.c:548: Warning: mnemonic suffix used with `add'
echo32.S: echo32.c:548: Warning: mnemonic suffix used with `add'
echo32.S: echo32.c:548: Warning: mnemonic suffix used with `add'
echo32.S: echo32.c:548: Warning: mnemonic suffix used with `add'
echo32.S: echo32.c:550: Warning: mnemonic suffix used with `sub'
echo32.S: echo32.c:577: Warning: mnemonic suffix used with `add'
echo32.S: echo32.c:577: Warning: mnemonic suffix used with `add'
echo32.S: echo32.c:577: Warning: mnemonic suffix used with `add'
echo32.S: echo32.c:577: Warning: mnemonic suffix used with `add'
echo32.S: echo32.c:577: Warning: mnemonic suffix used with `add'
echo32.S: echo32.c:577: Warning: mnemonic suffix used with `add'
echo32.S: ...
try.c: /usr/bin/x86_64-linux-gnu-ld.bfd: libcrypto_hash_echo256.a(echo32.o): relocation R_X86_64_32S against symbol `SHA3_R' can not be used when making a PIE object; recompile with -fPIE
try.c: /usr/bin/x86_64-linux-gnu-ld.bfd: failed to set dynamic section sizes: bad value
try.c: collect2: error: ld returned 1 exit status

Number of similar (implementation,compiler) pairs: 1, namely:
ImplementationCompiler
T:pentium/pentium4v64v1gcc -march=native -mtune=native -O2 -fwrapv -fPIC -fPIE -gdwarf-4 -Wall (15.2.0)

Compiler output


echo32.S: /tmp/ccMWSd71.s: Assembler messages:
echo32.S: echo32.c:545: Warning: mnemonic suffix used with `add'
echo32.S: echo32.c:545: Warning: NOTE: Such forms are deprecated and will be rejected by a future version of the assembler
echo32.S: echo32.c:545: Warning: mnemonic suffix used with `add'
echo32.S: echo32.c:545: Warning: mnemonic suffix used with `add'
echo32.S: echo32.c:545: Warning: mnemonic suffix used with `add'
echo32.S: echo32.c:546: Warning: mnemonic suffix used with `add'
echo32.S: echo32.c:546: Warning: mnemonic suffix used with `add'
echo32.S: echo32.c:546: Warning: mnemonic suffix used with `add'
echo32.S: echo32.c:546: Warning: mnemonic suffix used with `add'
echo32.S: echo32.c:547: Warning: mnemonic suffix used with `add'
echo32.S: echo32.c:547: Warning: mnemonic suffix used with `add'
echo32.S: echo32.c:547: Warning: mnemonic suffix used with `add'
echo32.S: echo32.c:547: Warning: mnemonic suffix used with `add'
echo32.S: echo32.c:548: Warning: mnemonic suffix used with `add'
echo32.S: echo32.c:548: Warning: mnemonic suffix used with `add'
echo32.S: echo32.c:548: Warning: mnemonic suffix used with `add'
echo32.S: echo32.c:548: Warning: mnemonic suffix used with `add'
echo32.S: echo32.c:550: Warning: mnemonic suffix used with `sub'
echo32.S: echo32.c:577: Warning: mnemonic suffix used with `add'
echo32.S: echo32.c:577: Warning: mnemonic suffix used with `add'
echo32.S: echo32.c:577: Warning: mnemonic suffix used with `add'
echo32.S: echo32.c:577: Warning: mnemonic suffix used with `add'
echo32.S: echo32.c:577: Warning: mnemonic suffix used with `add'
echo32.S: echo32.c:577: Warning: mnemonic suffix used with `add'
echo32.S: ...
try.c: /usr/bin/x86_64-linux-gnu-ld.bfd: libcrypto_hash_echo256.a(echo32.o): relocation R_X86_64_32S against symbol `SHA3_R' can not be used when making a PIE object; recompile with -fPIE
try.c: /usr/bin/x86_64-linux-gnu-ld.bfd: failed to set dynamic section sizes: bad value
try.c: collect2: error: ld returned 1 exit status

Number of similar (implementation,compiler) pairs: 1, namely:
ImplementationCompiler
T:pentium/pentium4v64v1gcc -march=native -mtune=native -O3 -fwrapv -fPIC -fPIE -gdwarf-4 -Wall (15.2.0)

Compiler output


echo32.S: /tmp/ccBYVoR1.s: Assembler messages:
echo32.S: echo32.c:545: Warning: mnemonic suffix used with `add'
echo32.S: echo32.c:545: Warning: NOTE: Such forms are deprecated and will be rejected by a future version of the assembler
echo32.S: echo32.c:545: Warning: mnemonic suffix used with `add'
echo32.S: echo32.c:545: Warning: mnemonic suffix used with `add'
echo32.S: echo32.c:545: Warning: mnemonic suffix used with `add'
echo32.S: echo32.c:546: Warning: mnemonic suffix used with `add'
echo32.S: echo32.c:546: Warning: mnemonic suffix used with `add'
echo32.S: echo32.c:546: Warning: mnemonic suffix used with `add'
echo32.S: echo32.c:546: Warning: mnemonic suffix used with `add'
echo32.S: echo32.c:547: Warning: mnemonic suffix used with `add'
echo32.S: echo32.c:547: Warning: mnemonic suffix used with `add'
echo32.S: echo32.c:547: Warning: mnemonic suffix used with `add'
echo32.S: echo32.c:547: Warning: mnemonic suffix used with `add'
echo32.S: echo32.c:548: Warning: mnemonic suffix used with `add'
echo32.S: echo32.c:548: Warning: mnemonic suffix used with `add'
echo32.S: echo32.c:548: Warning: mnemonic suffix used with `add'
echo32.S: echo32.c:548: Warning: mnemonic suffix used with `add'
echo32.S: echo32.c:550: Warning: mnemonic suffix used with `sub'
echo32.S: echo32.c:577: Warning: mnemonic suffix used with `add'
echo32.S: echo32.c:577: Warning: mnemonic suffix used with `add'
echo32.S: echo32.c:577: Warning: mnemonic suffix used with `add'
echo32.S: echo32.c:577: Warning: mnemonic suffix used with `add'
echo32.S: echo32.c:577: Warning: mnemonic suffix used with `add'
echo32.S: echo32.c:577: Warning: mnemonic suffix used with `add'
echo32.S: ...
try.c: /usr/bin/x86_64-linux-gnu-ld.bfd: libcrypto_hash_echo256.a(echo32.o): relocation R_X86_64_32S against symbol `SHA3_R' can not be used when making a PIE object; recompile with -fPIE
try.c: /usr/bin/x86_64-linux-gnu-ld.bfd: failed to set dynamic section sizes: bad value
try.c: collect2: error: ld returned 1 exit status

Number of similar (implementation,compiler) pairs: 1, namely:
ImplementationCompiler
T:pentium/pentium4v64v1gcc -march=native -mtune=native -O -fwrapv -fPIC -fPIE -gdwarf-4 -Wall (15.2.0)

Compiler output


echo32.S: /tmp/cc7WImot.s: Assembler messages:
echo32.S: echo32.c:545: Warning: mnemonic suffix used with `add'
echo32.S: echo32.c:545: Warning: NOTE: Such forms are deprecated and will be rejected by a future version of the assembler
echo32.S: echo32.c:545: Warning: mnemonic suffix used with `add'
echo32.S: echo32.c:545: Warning: mnemonic suffix used with `add'
echo32.S: echo32.c:545: Warning: mnemonic suffix used with `add'
echo32.S: echo32.c:546: Warning: mnemonic suffix used with `add'
echo32.S: echo32.c:546: Warning: mnemonic suffix used with `add'
echo32.S: echo32.c:546: Warning: mnemonic suffix used with `add'
echo32.S: echo32.c:546: Warning: mnemonic suffix used with `add'
echo32.S: echo32.c:547: Warning: mnemonic suffix used with `add'
echo32.S: echo32.c:547: Warning: mnemonic suffix used with `add'
echo32.S: echo32.c:547: Warning: mnemonic suffix used with `add'
echo32.S: echo32.c:547: Warning: mnemonic suffix used with `add'
echo32.S: echo32.c:548: Warning: mnemonic suffix used with `add'
echo32.S: echo32.c:548: Warning: mnemonic suffix used with `add'
echo32.S: echo32.c:548: Warning: mnemonic suffix used with `add'
echo32.S: echo32.c:548: Warning: mnemonic suffix used with `add'
echo32.S: echo32.c:550: Warning: mnemonic suffix used with `sub'
echo32.S: echo32.c:577: Warning: mnemonic suffix used with `add'
echo32.S: echo32.c:577: Warning: mnemonic suffix used with `add'
echo32.S: echo32.c:577: Warning: mnemonic suffix used with `add'
echo32.S: echo32.c:577: Warning: mnemonic suffix used with `add'
echo32.S: echo32.c:577: Warning: mnemonic suffix used with `add'
echo32.S: echo32.c:577: Warning: mnemonic suffix used with `add'
echo32.S: ...
try.c: /usr/bin/x86_64-linux-gnu-ld.bfd: libcrypto_hash_echo256.a(echo32.o): relocation R_X86_64_32S against symbol `SHA3_R' can not be used when making a PIE object; recompile with -fPIE
try.c: /usr/bin/x86_64-linux-gnu-ld.bfd: failed to set dynamic section sizes: bad value
try.c: collect2: error: ld returned 1 exit status

Number of similar (implementation,compiler) pairs: 1, namely:
ImplementationCompiler
T:pentium/pentium4v64v1gcc -march=native -mtune=native -Os -fwrapv -fPIC -fPIE -gdwarf-4 -Wall (15.2.0)

Compiler output


echo64.S: echo64.S:371:2: error: invalid instruction mnemonic 'addd'
echo64.S:  addd [SHA3_CNT], 1
echo64.S:  ^~~~
echo64.S: echo64.S:635:2: error: invalid instruction mnemonic 'addd'
echo64.S:  addd [SHA3_CNT], 1
echo64.S:  ^~~~
echo64.S: echo64.S:899:2: error: invalid instruction mnemonic 'addd'
echo64.S:  addd [SHA3_CNT], 1
echo64.S:  ^~~~
echo64.S: echo64.S:1163:2: error: invalid instruction mnemonic 'addd'
echo64.S:  addd [SHA3_CNT], 1
echo64.S:  ^~~~
echo64.S: echo64.S:1427:2: error: invalid instruction mnemonic 'addd'
echo64.S:  addd [SHA3_CNT], 1
echo64.S:  ^~~~
echo64.S: echo64.S:1691:2: error: invalid instruction mnemonic 'addd'
echo64.S:  addd [SHA3_CNT], 1
echo64.S:  ^~~~
echo64.S: echo64.S:1955:2: error: invalid instruction mnemonic 'addd'
echo64.S:  addd [SHA3_CNT], 1
echo64.S:  ^~~~
echo64.S: echo64.S:2219:2: error: invalid instruction mnemonic 'addd'
echo64.S:  addd [SHA3_CNT], 1
echo64.S:  ^~~~
echo64.S: echo64.S:2483:2: error: invalid instruction mnemonic 'addd'
echo64.S: ...

Number of similar (implementation,compiler) pairs: 4, namely:
ImplementationCompiler
T:pentium/pentium4v64v2clang -march=native -O2 -fwrapv -Qunused-arguments -fPIC -fPIE -gdwarf-4 -Wall (Ubuntu_Clang_21.1.8_(6ubuntu1))
T:pentium/pentium4v64v2clang -march=native -O3 -fwrapv -Qunused-arguments -fPIC -fPIE -gdwarf-4 -Wall (Ubuntu_Clang_21.1.8_(6ubuntu1))
T:pentium/pentium4v64v2clang -march=native -O -fwrapv -Qunused-arguments -fPIC -fPIE -gdwarf-4 -Wall (Ubuntu_Clang_21.1.8_(6ubuntu1))
T:pentium/pentium4v64v2clang -march=native -Os -fwrapv -Qunused-arguments -fPIC -fPIE -gdwarf-4 -Wall (Ubuntu_Clang_21.1.8_(6ubuntu1))

Compiler output


echo64.S: /tmp/ccDzjipa.s: Assembler messages:
echo64.S: echo64.c:571: Warning: mnemonic suffix used with `add'
echo64.S: echo64.c:571: Warning: NOTE: Such forms are deprecated and will be rejected by a future version of the assembler
echo64.S: echo64.c:571: Warning: mnemonic suffix used with `add'
echo64.S: echo64.c:571: Warning: mnemonic suffix used with `add'
echo64.S: echo64.c:571: Warning: mnemonic suffix used with `add'
echo64.S: echo64.c:572: Warning: mnemonic suffix used with `add'
echo64.S: echo64.c:572: Warning: mnemonic suffix used with `add'
echo64.S: echo64.c:572: Warning: mnemonic suffix used with `add'
echo64.S: echo64.c:572: Warning: mnemonic suffix used with `add'
echo64.S: echo64.c:573: Warning: mnemonic suffix used with `add'
echo64.S: echo64.c:573: Warning: mnemonic suffix used with `add'
echo64.S: echo64.c:573: Warning: mnemonic suffix used with `add'
echo64.S: echo64.c:573: Warning: mnemonic suffix used with `add'
echo64.S: echo64.c:574: Warning: mnemonic suffix used with `add'
echo64.S: echo64.c:574: Warning: mnemonic suffix used with `add'
echo64.S: echo64.c:574: Warning: mnemonic suffix used with `add'
echo64.S: echo64.c:574: Warning: mnemonic suffix used with `add'
echo64.S: echo64.c:576: Warning: mnemonic suffix used with `sub'
echo64.S: echo64.c:604: Warning: mnemonic suffix used with `add'
echo64.S: echo64.c:604: Warning: mnemonic suffix used with `add'
echo64.S: echo64.c:604: Warning: mnemonic suffix used with `add'
echo64.S: echo64.c:604: Warning: mnemonic suffix used with `add'
echo64.S: echo64.c:604: Warning: mnemonic suffix used with `add'
echo64.S: echo64.c:604: Warning: mnemonic suffix used with `add'
echo64.S: ...
try.c: /usr/bin/x86_64-linux-gnu-ld.bfd: libcrypto_hash_echo256.a(echo64.o): relocation R_X86_64_32S against symbol `SHA3_R' can not be used when making a PIE object; recompile with -fPIE
try.c: /usr/bin/x86_64-linux-gnu-ld.bfd: failed to set dynamic section sizes: bad value
try.c: collect2: error: ld returned 1 exit status

Number of similar (implementation,compiler) pairs: 1, namely:
ImplementationCompiler
T:pentium/pentium4v64v2gcc -march=native -mtune=native -O2 -fwrapv -fPIC -fPIE -gdwarf-4 -Wall (15.2.0)

Compiler output


echo64.S: /tmp/ccdjzaof.s: Assembler messages:
echo64.S: echo64.c:571: Warning: mnemonic suffix used with `add'
echo64.S: echo64.c:571: Warning: NOTE: Such forms are deprecated and will be rejected by a future version of the assembler
echo64.S: echo64.c:571: Warning: mnemonic suffix used with `add'
echo64.S: echo64.c:571: Warning: mnemonic suffix used with `add'
echo64.S: echo64.c:571: Warning: mnemonic suffix used with `add'
echo64.S: echo64.c:572: Warning: mnemonic suffix used with `add'
echo64.S: echo64.c:572: Warning: mnemonic suffix used with `add'
echo64.S: echo64.c:572: Warning: mnemonic suffix used with `add'
echo64.S: echo64.c:572: Warning: mnemonic suffix used with `add'
echo64.S: echo64.c:573: Warning: mnemonic suffix used with `add'
echo64.S: echo64.c:573: Warning: mnemonic suffix used with `add'
echo64.S: echo64.c:573: Warning: mnemonic suffix used with `add'
echo64.S: echo64.c:573: Warning: mnemonic suffix used with `add'
echo64.S: echo64.c:574: Warning: mnemonic suffix used with `add'
echo64.S: echo64.c:574: Warning: mnemonic suffix used with `add'
echo64.S: echo64.c:574: Warning: mnemonic suffix used with `add'
echo64.S: echo64.c:574: Warning: mnemonic suffix used with `add'
echo64.S: echo64.c:576: Warning: mnemonic suffix used with `sub'
echo64.S: echo64.c:604: Warning: mnemonic suffix used with `add'
echo64.S: echo64.c:604: Warning: mnemonic suffix used with `add'
echo64.S: echo64.c:604: Warning: mnemonic suffix used with `add'
echo64.S: echo64.c:604: Warning: mnemonic suffix used with `add'
echo64.S: echo64.c:604: Warning: mnemonic suffix used with `add'
echo64.S: echo64.c:604: Warning: mnemonic suffix used with `add'
echo64.S: ...
try.c: /usr/bin/x86_64-linux-gnu-ld.bfd: libcrypto_hash_echo256.a(echo64.o): relocation R_X86_64_32S against symbol `SHA3_R' can not be used when making a PIE object; recompile with -fPIE
try.c: /usr/bin/x86_64-linux-gnu-ld.bfd: failed to set dynamic section sizes: bad value
try.c: collect2: error: ld returned 1 exit status

Number of similar (implementation,compiler) pairs: 1, namely:
ImplementationCompiler
T:pentium/pentium4v64v2gcc -march=native -mtune=native -O3 -fwrapv -fPIC -fPIE -gdwarf-4 -Wall (15.2.0)

Compiler output


echo64.S: /tmp/ccMHy53h.s: Assembler messages:
echo64.S: echo64.c:571: Warning: mnemonic suffix used with `add'
echo64.S: echo64.c:571: Warning: NOTE: Such forms are deprecated and will be rejected by a future version of the assembler
echo64.S: echo64.c:571: Warning: mnemonic suffix used with `add'
echo64.S: echo64.c:571: Warning: mnemonic suffix used with `add'
echo64.S: echo64.c:571: Warning: mnemonic suffix used with `add'
echo64.S: echo64.c:572: Warning: mnemonic suffix used with `add'
echo64.S: echo64.c:572: Warning: mnemonic suffix used with `add'
echo64.S: echo64.c:572: Warning: mnemonic suffix used with `add'
echo64.S: echo64.c:572: Warning: mnemonic suffix used with `add'
echo64.S: echo64.c:573: Warning: mnemonic suffix used with `add'
echo64.S: echo64.c:573: Warning: mnemonic suffix used with `add'
echo64.S: echo64.c:573: Warning: mnemonic suffix used with `add'
echo64.S: echo64.c:573: Warning: mnemonic suffix used with `add'
echo64.S: echo64.c:574: Warning: mnemonic suffix used with `add'
echo64.S: echo64.c:574: Warning: mnemonic suffix used with `add'
echo64.S: echo64.c:574: Warning: mnemonic suffix used with `add'
echo64.S: echo64.c:574: Warning: mnemonic suffix used with `add'
echo64.S: echo64.c:576: Warning: mnemonic suffix used with `sub'
echo64.S: echo64.c:604: Warning: mnemonic suffix used with `add'
echo64.S: echo64.c:604: Warning: mnemonic suffix used with `add'
echo64.S: echo64.c:604: Warning: mnemonic suffix used with `add'
echo64.S: echo64.c:604: Warning: mnemonic suffix used with `add'
echo64.S: echo64.c:604: Warning: mnemonic suffix used with `add'
echo64.S: echo64.c:604: Warning: mnemonic suffix used with `add'
echo64.S: ...
try.c: /usr/bin/x86_64-linux-gnu-ld.bfd: libcrypto_hash_echo256.a(echo64.o): relocation R_X86_64_32S against symbol `SHA3_R' can not be used when making a PIE object; recompile with -fPIE
try.c: /usr/bin/x86_64-linux-gnu-ld.bfd: failed to set dynamic section sizes: bad value
try.c: collect2: error: ld returned 1 exit status

Number of similar (implementation,compiler) pairs: 1, namely:
ImplementationCompiler
T:pentium/pentium4v64v2gcc -march=native -mtune=native -O -fwrapv -fPIC -fPIE -gdwarf-4 -Wall (15.2.0)

Compiler output


echo64.S: /tmp/ccc3YkvE.s: Assembler messages:
echo64.S: echo64.c:571: Warning: mnemonic suffix used with `add'
echo64.S: echo64.c:571: Warning: NOTE: Such forms are deprecated and will be rejected by a future version of the assembler
echo64.S: echo64.c:571: Warning: mnemonic suffix used with `add'
echo64.S: echo64.c:571: Warning: mnemonic suffix used with `add'
echo64.S: echo64.c:571: Warning: mnemonic suffix used with `add'
echo64.S: echo64.c:572: Warning: mnemonic suffix used with `add'
echo64.S: echo64.c:572: Warning: mnemonic suffix used with `add'
echo64.S: echo64.c:572: Warning: mnemonic suffix used with `add'
echo64.S: echo64.c:572: Warning: mnemonic suffix used with `add'
echo64.S: echo64.c:573: Warning: mnemonic suffix used with `add'
echo64.S: echo64.c:573: Warning: mnemonic suffix used with `add'
echo64.S: echo64.c:573: Warning: mnemonic suffix used with `add'
echo64.S: echo64.c:573: Warning: mnemonic suffix used with `add'
echo64.S: echo64.c:574: Warning: mnemonic suffix used with `add'
echo64.S: echo64.c:574: Warning: mnemonic suffix used with `add'
echo64.S: echo64.c:574: Warning: mnemonic suffix used with `add'
echo64.S: echo64.c:574: Warning: mnemonic suffix used with `add'
echo64.S: echo64.c:576: Warning: mnemonic suffix used with `sub'
echo64.S: echo64.c:604: Warning: mnemonic suffix used with `add'
echo64.S: echo64.c:604: Warning: mnemonic suffix used with `add'
echo64.S: echo64.c:604: Warning: mnemonic suffix used with `add'
echo64.S: echo64.c:604: Warning: mnemonic suffix used with `add'
echo64.S: echo64.c:604: Warning: mnemonic suffix used with `add'
echo64.S: echo64.c:604: Warning: mnemonic suffix used with `add'
echo64.S: ...
try.c: /usr/bin/x86_64-linux-gnu-ld.bfd: libcrypto_hash_echo256.a(echo64.o): relocation R_X86_64_32S against symbol `SHA3_R' can not be used when making a PIE object; recompile with -fPIE
try.c: /usr/bin/x86_64-linux-gnu-ld.bfd: failed to set dynamic section sizes: bad value
try.c: collect2: error: ld returned 1 exit status

Number of similar (implementation,compiler) pairs: 1, namely:
ImplementationCompiler
T:pentium/pentium4v64v2gcc -march=native -mtune=native -Os -fwrapv -fPIC -fPIE -gdwarf-4 -Wall (15.2.0)

Compiler output


echo32.c: echo32.c:106:18: warning: unused variable 'j' [-Wunused-variable]
echo32.c:   106 |         unsigned int i, j;
echo32.c:       |                         ^
echo32.c: echo32.c:107:16: warning: unused variable 'endianess' [-Wunused-variable]
echo32.c:   107 |         unsigned char endianess;
echo32.c:       |                       ^~~~~~~~~
echo32.c: echo32.c:472:21: warning: unused variable 'c0' [-Wunused-variable]
echo32.c:   472 |         unsigned long long c0, c1;
echo32.c:       |                            ^~
echo32.c: echo32.c:472:25: warning: unused variable 'c1' [-Wunused-variable]
echo32.c:   472 |         unsigned long long c0, c1;
echo32.c:       |                                ^~
echo32.c: echo32.c:599:21: warning: unused variable 'hashlen' [-Wunused-variable]
echo32.c:   599 |         unsigned short int hashlen = 0;
echo32.c:       |                            ^~~~~~~
echo32.c: echo32.c:600:21: warning: unused variable 'messlen_l' [-Wunused-variable]
echo32.c:   600 |         unsigned long long messlen_l = 0;
echo32.c:       |                            ^~~~~~~~~
echo32.c: echo32.c:601:21: warning: unused variable 'messlen_h' [-Wunused-variable]
echo32.c:   601 |         unsigned long long messlen_h = 0;
echo32.c:       |                            ^~~~~~~~~
echo32.c: 7 warnings generated.

Number of similar (implementation,compiler) pairs: 4, namely:
ImplementationCompiler
T:powerpc/pp32cv1clang -march=native -O2 -fwrapv -Qunused-arguments -fPIC -fPIE -gdwarf-4 -Wall (Ubuntu_Clang_21.1.8_(6ubuntu1))
T:powerpc/pp32cv1clang -march=native -O3 -fwrapv -Qunused-arguments -fPIC -fPIE -gdwarf-4 -Wall (Ubuntu_Clang_21.1.8_(6ubuntu1))
T:powerpc/pp32cv1clang -march=native -O -fwrapv -Qunused-arguments -fPIC -fPIE -gdwarf-4 -Wall (Ubuntu_Clang_21.1.8_(6ubuntu1))
T:powerpc/pp32cv1clang -march=native -Os -fwrapv -Qunused-arguments -fPIC -fPIE -gdwarf-4 -Wall (Ubuntu_Clang_21.1.8_(6ubuntu1))

Compiler output


echo32.c: echo32.c: In function 'Init':
echo32.c: echo32.c:107:23: warning: unused variable 'endianess' [-Wunused-variable]
echo32.c:   107 |         unsigned char endianess;
echo32.c:       |                       ^~~~~~~~~
echo32.c: echo32.c:106:25: warning: unused variable 'j' [-Wunused-variable]
echo32.c:   106 |         unsigned int i, j;
echo32.c:       |                         ^
echo32.c: echo32.c: In function 'Compress':
echo32.c: echo32.c:472:32: warning: unused variable 'c1' [-Wunused-variable]
echo32.c:   472 |         unsigned long long c0, c1;
echo32.c:       |                                ^~
echo32.c: echo32.c:472:28: warning: unused variable 'c0' [-Wunused-variable]
echo32.c:   472 |         unsigned long long c0, c1;
echo32.c:       |                            ^~
echo32.c: echo32.c: In function 'Final':
echo32.c: echo32.c:601:28: warning: unused variable 'messlen_h' [-Wunused-variable]
echo32.c:   601 |         unsigned long long messlen_h = 0;
echo32.c:       |                            ^~~~~~~~~
echo32.c: echo32.c:600:28: warning: unused variable 'messlen_l' [-Wunused-variable]
echo32.c:   600 |         unsigned long long messlen_l = 0;
echo32.c:       |                            ^~~~~~~~~
echo32.c: echo32.c:599:28: warning: unused variable 'hashlen' [-Wunused-variable]
echo32.c:   599 |         unsigned short int hashlen = 0;
echo32.c:       |                            ^~~~~~~

Number of similar (implementation,compiler) pairs: 4, namely:
ImplementationCompiler
T:powerpc/pp32cv1gcc -march=native -mtune=native -O2 -fwrapv -fPIC -fPIE -gdwarf-4 -Wall (15.2.0)
T:powerpc/pp32cv1gcc -march=native -mtune=native -O3 -fwrapv -fPIC -fPIE -gdwarf-4 -Wall (15.2.0)
T:powerpc/pp32cv1gcc -march=native -mtune=native -O -fwrapv -fPIC -fPIE -gdwarf-4 -Wall (15.2.0)
T:powerpc/pp32cv1gcc -march=native -mtune=native -Os -fwrapv -fPIC -fPIE -gdwarf-4 -Wall (15.2.0)

Compiler output


echo32.c: echo32.c:106:18: warning: unused variable 'j' [-Wunused-variable]
echo32.c:   106 |         unsigned int i, j;
echo32.c:       |                         ^
echo32.c: echo32.c:107:16: warning: unused variable 'endianess' [-Wunused-variable]
echo32.c:   107 |         unsigned char endianess;
echo32.c:       |                       ^~~~~~~~~
echo32.c: echo32.c:440:21: warning: unused variable 'c0' [-Wunused-variable]
echo32.c:   440 |         unsigned long long c0, c1;
echo32.c:       |                            ^~
echo32.c: echo32.c:440:25: warning: unused variable 'c1' [-Wunused-variable]
echo32.c:   440 |         unsigned long long c0, c1;
echo32.c:       |                                ^~
echo32.c: echo32.c:567:21: warning: unused variable 'hashlen' [-Wunused-variable]
echo32.c:   567 |         unsigned short int hashlen = 0;
echo32.c:       |                            ^~~~~~~
echo32.c: echo32.c:568:21: warning: unused variable 'messlen_l' [-Wunused-variable]
echo32.c:   568 |         unsigned long long messlen_l = 0;
echo32.c:       |                            ^~~~~~~~~
echo32.c: echo32.c:569:21: warning: unused variable 'messlen_h' [-Wunused-variable]
echo32.c:   569 |         unsigned long long messlen_h = 0;
echo32.c:       |                            ^~~~~~~~~
echo32.c: 7 warnings generated.

Number of similar (implementation,compiler) pairs: 4, namely:
ImplementationCompiler
T:powerpc/pp32cv2clang -march=native -O2 -fwrapv -Qunused-arguments -fPIC -fPIE -gdwarf-4 -Wall (Ubuntu_Clang_21.1.8_(6ubuntu1))
T:powerpc/pp32cv2clang -march=native -O3 -fwrapv -Qunused-arguments -fPIC -fPIE -gdwarf-4 -Wall (Ubuntu_Clang_21.1.8_(6ubuntu1))
T:powerpc/pp32cv2clang -march=native -O -fwrapv -Qunused-arguments -fPIC -fPIE -gdwarf-4 -Wall (Ubuntu_Clang_21.1.8_(6ubuntu1))
T:powerpc/pp32cv2clang -march=native -Os -fwrapv -Qunused-arguments -fPIC -fPIE -gdwarf-4 -Wall (Ubuntu_Clang_21.1.8_(6ubuntu1))

Compiler output


echo32.c: echo32.c: In function 'Init':
echo32.c: echo32.c:107:23: warning: unused variable 'endianess' [-Wunused-variable]
echo32.c:   107 |         unsigned char endianess;
echo32.c:       |                       ^~~~~~~~~
echo32.c: echo32.c:106:25: warning: unused variable 'j' [-Wunused-variable]
echo32.c:   106 |         unsigned int i, j;
echo32.c:       |                         ^
echo32.c: echo32.c: In function 'Compress':
echo32.c: echo32.c:440:32: warning: unused variable 'c1' [-Wunused-variable]
echo32.c:   440 |         unsigned long long c0, c1;
echo32.c:       |                                ^~
echo32.c: echo32.c:440:28: warning: unused variable 'c0' [-Wunused-variable]
echo32.c:   440 |         unsigned long long c0, c1;
echo32.c:       |                            ^~
echo32.c: echo32.c: In function 'Final':
echo32.c: echo32.c:569:28: warning: unused variable 'messlen_h' [-Wunused-variable]
echo32.c:   569 |         unsigned long long messlen_h = 0;
echo32.c:       |                            ^~~~~~~~~
echo32.c: echo32.c:568:28: warning: unused variable 'messlen_l' [-Wunused-variable]
echo32.c:   568 |         unsigned long long messlen_l = 0;
echo32.c:       |                            ^~~~~~~~~
echo32.c: echo32.c:567:28: warning: unused variable 'hashlen' [-Wunused-variable]
echo32.c:   567 |         unsigned short int hashlen = 0;
echo32.c:       |                            ^~~~~~~

Number of similar (implementation,compiler) pairs: 4, namely:
ImplementationCompiler
T:powerpc/pp32cv2gcc -march=native -mtune=native -O2 -fwrapv -fPIC -fPIE -gdwarf-4 -Wall (15.2.0)
T:powerpc/pp32cv2gcc -march=native -mtune=native -O3 -fwrapv -fPIC -fPIE -gdwarf-4 -Wall (15.2.0)
T:powerpc/pp32cv2gcc -march=native -mtune=native -O -fwrapv -fPIC -fPIE -gdwarf-4 -Wall (15.2.0)
T:powerpc/pp32cv2gcc -march=native -mtune=native -Os -fwrapv -fPIC -fPIE -gdwarf-4 -Wall (15.2.0)

Namespace violations


hash.o Compress T
hash.o Final T
hash.o Hash T
hash.o Init T
hash.o Update T
hash.o _k_aesmix1 R
hash.o _k_aesmix2 R
hash.o _k_aesmix3 R
hash.o _k_aesmix4 R
hash.o _k_h0e R
hash.o _k_h15 R
hash.o _k_h4e R
hash.o _k_h5b R
hash.o _k_h63 R
hash.o _k_hc6 R
hash.o _k_inv R
hash.o _k_ipt R
hash.o _k_opt R
hash.o _k_s0F R
hash.o _k_sb1 R
hash.o _k_sb2 R
hash.o _k_sb3 R
hash.o _k_sb4 R
hash.o _k_sb5 R
hash.o _k_sb7 R
hash.o _k_sbo R
hash.o const1 R
hash.o invshiftrows R
hash.o lsbmask R
hash.o mul2ipt R
hash.o mul2mask R
hash.o zero R

Number of similar (implementation,compiler) pairs: 16, namely:
ImplementationCompiler
T:ccalik/aesniclang -march=native -O2 -fwrapv -Qunused-arguments -fPIC -fPIE -gdwarf-4 -Wall (Ubuntu_Clang_21.1.8_(6ubuntu1))
T:ccalik/aesniclang -march=native -O3 -fwrapv -Qunused-arguments -fPIC -fPIE -gdwarf-4 -Wall (Ubuntu_Clang_21.1.8_(6ubuntu1))
T:ccalik/aesniclang -march=native -O -fwrapv -Qunused-arguments -fPIC -fPIE -gdwarf-4 -Wall (Ubuntu_Clang_21.1.8_(6ubuntu1))
T:ccalik/aesniclang -march=native -Os -fwrapv -Qunused-arguments -fPIC -fPIE -gdwarf-4 -Wall (Ubuntu_Clang_21.1.8_(6ubuntu1))
T:ccalik/aesnigcc -march=native -mtune=native -O2 -fwrapv -fPIC -fPIE -gdwarf-4 -Wall (15.2.0)
T:ccalik/aesnigcc -march=native -mtune=native -O3 -fwrapv -fPIC -fPIE -gdwarf-4 -Wall (15.2.0)
T:ccalik/aesnigcc -march=native -mtune=native -O -fwrapv -fPIC -fPIE -gdwarf-4 -Wall (15.2.0)
T:ccalik/aesnigcc -march=native -mtune=native -Os -fwrapv -fPIC -fPIE -gdwarf-4 -Wall (15.2.0)
T:ccalik/vpermclang -march=native -O2 -fwrapv -Qunused-arguments -fPIC -fPIE -gdwarf-4 -Wall (Ubuntu_Clang_21.1.8_(6ubuntu1))
T:ccalik/vpermclang -march=native -O3 -fwrapv -Qunused-arguments -fPIC -fPIE -gdwarf-4 -Wall (Ubuntu_Clang_21.1.8_(6ubuntu1))
T:ccalik/vpermclang -march=native -O -fwrapv -Qunused-arguments -fPIC -fPIE -gdwarf-4 -Wall (Ubuntu_Clang_21.1.8_(6ubuntu1))
T:ccalik/vpermclang -march=native -Os -fwrapv -Qunused-arguments -fPIC -fPIE -gdwarf-4 -Wall (Ubuntu_Clang_21.1.8_(6ubuntu1))
T:ccalik/vpermgcc -march=native -mtune=native -O2 -fwrapv -fPIC -fPIE -gdwarf-4 -Wall (15.2.0)
T:ccalik/vpermgcc -march=native -mtune=native -O3 -fwrapv -fPIC -fPIE -gdwarf-4 -Wall (15.2.0)
T:ccalik/vpermgcc -march=native -mtune=native -O -fwrapv -fPIC -fPIE -gdwarf-4 -Wall (15.2.0)
T:ccalik/vpermgcc -march=native -mtune=native -Os -fwrapv -fPIC -fPIE -gdwarf-4 -Wall (15.2.0)

Namespace violations


hash.o Compress T
hash.o Final T
hash.o Hash T
hash.o Init T
hash.o Update T
hash.o _BS0 R
hash.o _BS1 R
hash.o _BS2 R
hash.o _ONE R
hash.o bigshiftrows1 R
hash.o bigshiftrows2 R
hash.o bigshiftrows3 R
hash.o const1 R
hash.o lownibblemask R
hash.o mixcol1 R
hash.o mixcol2 R
hash.o mixcol3 R
hash.o shiftrowsslice R

Number of similar (implementation,compiler) pairs: 8, namely:
ImplementationCompiler
T:ccalik/bitslicedclang -march=native -O2 -fwrapv -Qunused-arguments -fPIC -fPIE -gdwarf-4 -Wall (Ubuntu_Clang_21.1.8_(6ubuntu1))
T:ccalik/bitslicedclang -march=native -O3 -fwrapv -Qunused-arguments -fPIC -fPIE -gdwarf-4 -Wall (Ubuntu_Clang_21.1.8_(6ubuntu1))
T:ccalik/bitslicedclang -march=native -O -fwrapv -Qunused-arguments -fPIC -fPIE -gdwarf-4 -Wall (Ubuntu_Clang_21.1.8_(6ubuntu1))
T:ccalik/bitslicedclang -march=native -Os -fwrapv -Qunused-arguments -fPIC -fPIE -gdwarf-4 -Wall (Ubuntu_Clang_21.1.8_(6ubuntu1))
T:ccalik/bitslicedgcc -march=native -mtune=native -O2 -fwrapv -fPIC -fPIE -gdwarf-4 -Wall (15.2.0)
T:ccalik/bitslicedgcc -march=native -mtune=native -O3 -fwrapv -fPIC -fPIE -gdwarf-4 -Wall (15.2.0)
T:ccalik/bitslicedgcc -march=native -mtune=native -O -fwrapv -fPIC -fPIE -gdwarf-4 -Wall (15.2.0)
T:ccalik/bitslicedgcc -march=native -mtune=native -Os -fwrapv -fPIC -fPIE -gdwarf-4 -Wall (15.2.0)

Namespace violations


echo32.o CNT_r B
echo32.o Compress T
echo32.o Endianess T
echo32.o Final T
echo32.o Hash T
echo32.o Init T
echo32.o PushString T
echo32.o Update T
echo32.o endian B
echo32.o flip_bits T
echo32.o r B

Number of similar (implementation,compiler) pairs: 24, namely:
ImplementationCompiler
T:generic/opt32clang -march=native -O2 -fwrapv -Qunused-arguments -fPIC -fPIE -gdwarf-4 -Wall (Ubuntu_Clang_21.1.8_(6ubuntu1))
T:generic/opt32clang -march=native -O3 -fwrapv -Qunused-arguments -fPIC -fPIE -gdwarf-4 -Wall (Ubuntu_Clang_21.1.8_(6ubuntu1))
T:generic/opt32clang -march=native -O -fwrapv -Qunused-arguments -fPIC -fPIE -gdwarf-4 -Wall (Ubuntu_Clang_21.1.8_(6ubuntu1))
T:generic/opt32clang -march=native -Os -fwrapv -Qunused-arguments -fPIC -fPIE -gdwarf-4 -Wall (Ubuntu_Clang_21.1.8_(6ubuntu1))
T:generic/opt32gcc -march=native -mtune=native -O2 -fwrapv -fPIC -fPIE -gdwarf-4 -Wall (15.2.0)
T:generic/opt32gcc -march=native -mtune=native -O3 -fwrapv -fPIC -fPIE -gdwarf-4 -Wall (15.2.0)
T:generic/opt32gcc -march=native -mtune=native -O -fwrapv -fPIC -fPIE -gdwarf-4 -Wall (15.2.0)
T:generic/opt32gcc -march=native -mtune=native -Os -fwrapv -fPIC -fPIE -gdwarf-4 -Wall (15.2.0)
T:powerpc/pp32cv1clang -march=native -O2 -fwrapv -Qunused-arguments -fPIC -fPIE -gdwarf-4 -Wall (Ubuntu_Clang_21.1.8_(6ubuntu1))
T:powerpc/pp32cv1clang -march=native -O3 -fwrapv -Qunused-arguments -fPIC -fPIE -gdwarf-4 -Wall (Ubuntu_Clang_21.1.8_(6ubuntu1))
T:powerpc/pp32cv1clang -march=native -O -fwrapv -Qunused-arguments -fPIC -fPIE -gdwarf-4 -Wall (Ubuntu_Clang_21.1.8_(6ubuntu1))
T:powerpc/pp32cv1clang -march=native -Os -fwrapv -Qunused-arguments -fPIC -fPIE -gdwarf-4 -Wall (Ubuntu_Clang_21.1.8_(6ubuntu1))
T:powerpc/pp32cv1gcc -march=native -mtune=native -O2 -fwrapv -fPIC -fPIE -gdwarf-4 -Wall (15.2.0)
T:powerpc/pp32cv1gcc -march=native -mtune=native -O3 -fwrapv -fPIC -fPIE -gdwarf-4 -Wall (15.2.0)
T:powerpc/pp32cv1gcc -march=native -mtune=native -O -fwrapv -fPIC -fPIE -gdwarf-4 -Wall (15.2.0)
T:powerpc/pp32cv1gcc -march=native -mtune=native -Os -fwrapv -fPIC -fPIE -gdwarf-4 -Wall (15.2.0)
T:powerpc/pp32cv2clang -march=native -O2 -fwrapv -Qunused-arguments -fPIC -fPIE -gdwarf-4 -Wall (Ubuntu_Clang_21.1.8_(6ubuntu1))
T:powerpc/pp32cv2clang -march=native -O3 -fwrapv -Qunused-arguments -fPIC -fPIE -gdwarf-4 -Wall (Ubuntu_Clang_21.1.8_(6ubuntu1))
T:powerpc/pp32cv2clang -march=native -O -fwrapv -Qunused-arguments -fPIC -fPIE -gdwarf-4 -Wall (Ubuntu_Clang_21.1.8_(6ubuntu1))
T:powerpc/pp32cv2clang -march=native -Os -fwrapv -Qunused-arguments -fPIC -fPIE -gdwarf-4 -Wall (Ubuntu_Clang_21.1.8_(6ubuntu1))
T:powerpc/pp32cv2gcc -march=native -mtune=native -O2 -fwrapv -fPIC -fPIE -gdwarf-4 -Wall (15.2.0)
T:powerpc/pp32cv2gcc -march=native -mtune=native -O3 -fwrapv -fPIC -fPIE -gdwarf-4 -Wall (15.2.0)
T:powerpc/pp32cv2gcc -march=native -mtune=native -O -fwrapv -fPIC -fPIE -gdwarf-4 -Wall (15.2.0)
T:powerpc/pp32cv2gcc -march=native -mtune=native -Os -fwrapv -fPIC -fPIE -gdwarf-4 -Wall (15.2.0)

Namespace violations


echo64.o Compress T
echo64.o Endianess T
echo64.o Final T
echo64.o Hash T
echo64.o Init T
echo64.o PushString T
echo64.o Update T
echo64.o endian B

Number of similar (implementation,compiler) pairs: 8, namely:
ImplementationCompiler
T:generic/opt64clang -march=native -O2 -fwrapv -Qunused-arguments -fPIC -fPIE -gdwarf-4 -Wall (Ubuntu_Clang_21.1.8_(6ubuntu1))
T:generic/opt64clang -march=native -O3 -fwrapv -Qunused-arguments -fPIC -fPIE -gdwarf-4 -Wall (Ubuntu_Clang_21.1.8_(6ubuntu1))
T:generic/opt64clang -march=native -O -fwrapv -Qunused-arguments -fPIC -fPIE -gdwarf-4 -Wall (Ubuntu_Clang_21.1.8_(6ubuntu1))
T:generic/opt64clang -march=native -Os -fwrapv -Qunused-arguments -fPIC -fPIE -gdwarf-4 -Wall (Ubuntu_Clang_21.1.8_(6ubuntu1))
T:generic/opt64gcc -march=native -mtune=native -O2 -fwrapv -fPIC -fPIE -gdwarf-4 -Wall (15.2.0)
T:generic/opt64gcc -march=native -mtune=native -O3 -fwrapv -fPIC -fPIE -gdwarf-4 -Wall (15.2.0)
T:generic/opt64gcc -march=native -mtune=native -O -fwrapv -fPIC -fPIE -gdwarf-4 -Wall (15.2.0)
T:generic/opt64gcc -march=native -mtune=native -Os -fwrapv -fPIC -fPIE -gdwarf-4 -Wall (15.2.0)

Namespace violations


echo.o sph_echo224 T
echo.o sph_echo224_addbits_and_close T
echo.o sph_echo224_close T
echo.o sph_echo224_init T
echo.o sph_echo256 T
echo.o sph_echo256_addbits_and_close T
echo.o sph_echo256_close T
echo.o sph_echo256_init T
echo.o sph_echo384 T
echo.o sph_echo384_addbits_and_close T
echo.o sph_echo384_close T
echo.o sph_echo384_init T
echo.o sph_echo512 T
echo.o sph_echo512_addbits_and_close T
echo.o sph_echo512_close T
echo.o sph_echo512_init T

Number of similar (implementation,compiler) pairs: 16, namely:
ImplementationCompiler
T:sphlibclang -march=native -O2 -fwrapv -Qunused-arguments -fPIC -fPIE -gdwarf-4 -Wall (Ubuntu_Clang_21.1.8_(6ubuntu1))
T:sphlibclang -march=native -O3 -fwrapv -Qunused-arguments -fPIC -fPIE -gdwarf-4 -Wall (Ubuntu_Clang_21.1.8_(6ubuntu1))
T:sphlibclang -march=native -O -fwrapv -Qunused-arguments -fPIC -fPIE -gdwarf-4 -Wall (Ubuntu_Clang_21.1.8_(6ubuntu1))
T:sphlibclang -march=native -Os -fwrapv -Qunused-arguments -fPIC -fPIE -gdwarf-4 -Wall (Ubuntu_Clang_21.1.8_(6ubuntu1))
T:sphlibgcc -march=native -mtune=native -O2 -fwrapv -fPIC -fPIE -gdwarf-4 -Wall (15.2.0)
T:sphlibgcc -march=native -mtune=native -O3 -fwrapv -fPIC -fPIE -gdwarf-4 -Wall (15.2.0)
T:sphlibgcc -march=native -mtune=native -O -fwrapv -fPIC -fPIE -gdwarf-4 -Wall (15.2.0)
T:sphlibgcc -march=native -mtune=native -Os -fwrapv -fPIC -fPIE -gdwarf-4 -Wall (15.2.0)
T:sphlib-smallclang -march=native -O2 -fwrapv -Qunused-arguments -fPIC -fPIE -gdwarf-4 -Wall (Ubuntu_Clang_21.1.8_(6ubuntu1))
T:sphlib-smallclang -march=native -O3 -fwrapv -Qunused-arguments -fPIC -fPIE -gdwarf-4 -Wall (Ubuntu_Clang_21.1.8_(6ubuntu1))
T:sphlib-smallclang -march=native -O -fwrapv -Qunused-arguments -fPIC -fPIE -gdwarf-4 -Wall (Ubuntu_Clang_21.1.8_(6ubuntu1))
T:sphlib-smallclang -march=native -Os -fwrapv -Qunused-arguments -fPIC -fPIE -gdwarf-4 -Wall (Ubuntu_Clang_21.1.8_(6ubuntu1))
T:sphlib-smallgcc -march=native -mtune=native -O2 -fwrapv -fPIC -fPIE -gdwarf-4 -Wall (15.2.0)
T:sphlib-smallgcc -march=native -mtune=native -O3 -fwrapv -fPIC -fPIE -gdwarf-4 -Wall (15.2.0)
T:sphlib-smallgcc -march=native -mtune=native -O -fwrapv -fPIC -fPIE -gdwarf-4 -Wall (15.2.0)
T:sphlib-smallgcc -march=native -mtune=native -Os -fwrapv -fPIC -fPIE -gdwarf-4 -Wall (15.2.0)