Implementation notes: amd64, hertz, crypto_hash/cheetah512

Computer: hertz
Microarchitecture: amd64; Zen 4 (a60f12)
Architecture: amd64
CPU ID: AuthenticAMD-00a60f12-178bfbff
SUPERCOP version: 20240107
Operation: crypto_hash
Primitive: cheetah512

Compiler output

Implementation: T:asm
Security model: timingleaks
Compiler: clang-17 -march=native -O2 -fomit-frame-pointer -fwrapv -Qunused-arguments -fPIC -fPIE
Cheetah.c: Cheetah.c:220:4: error: call to undeclared function 'Cheetah25664'; ISO C99 and later do not support implicit function declarations [-Wimplicit-function-declaration]
Cheetah.c: 220 | Cheetah25664(&Te0,&T640,&state->core, data, totLength);
Cheetah.c: | ^
Cheetah.c: Cheetah.c:232:4: error: call to undeclared function 'Cheetah51264'; ISO C99 and later do not support implicit function declarations [-Wimplicit-function-declaration]
Cheetah.c: 232 | Cheetah51264(&Te0,&T640,&state->core64, data, totLength);
Cheetah.c: | ^
Cheetah.c: 2 errors generated.

Number of similar (compiler,implementation) pairs: 6, namely:
CompilerImplementations
clang-17 -march=native -O2 -fomit-frame-pointer -fwrapv -Qunused-arguments -fPIC -fPIE T:asm
clang-17 -march=native -O3 -fomit-frame-pointer -fwrapv -Qunused-arguments -fPIC -fPIE T:asm
clang-17 -march=native -Os -fomit-frame-pointer -fwrapv -Qunused-arguments -fPIC -fPIE T:asm
clang-17 -march=native -O2 -fomit-frame-pointer -fwrapv -Qunused-arguments -fPIC -fPIE T:asm64
clang-17 -march=native -O3 -fomit-frame-pointer -fwrapv -Qunused-arguments -fPIC -fPIE T:asm64
clang-17 -march=native -Os -fomit-frame-pointer -fwrapv -Qunused-arguments -fPIC -fPIE T:asm64

Compiler output

Implementation: T:asm
Security model: timingleaks
Compiler: gcc -march=native -mtune=native -O2 -fomit-frame-pointer -fwrapv -fPIC -fPIE
Cheetah.c: Cheetah.c: In function 'Update':
Cheetah.c: Cheetah.c:220:25: warning: implicit declaration of function 'Cheetah25664' [-Wimplicit-function-declaration]
Cheetah.c: 220 | Cheetah25664(&Te0,&T640,&state->core, data, totLength);
Cheetah.c: | ^~~~~~~~~~~~
Cheetah.c: Cheetah.c:232:25: warning: implicit declaration of function 'Cheetah51264' [-Wimplicit-function-declaration]
Cheetah.c: 232 | Cheetah51264(&Te0,&T640,&state->core64, data, totLength);
Cheetah.c: | ^~~~~~~~~~~~
hash.c: In file included from hash.c:2:
hash.c: Cheetah.c: In function 'Update':
hash.c: Cheetah.c:220:25: warning: implicit declaration of function 'Cheetah25664' [-Wimplicit-function-declaration]
hash.c: 220 | Cheetah25664(&Te0,&T640,&state->core, data, totLength);
hash.c: | ^~~~~~~~~~~~
hash.c: Cheetah.c:232:25: warning: implicit declaration of function 'Cheetah51264' [-Wimplicit-function-declaration]
hash.c: 232 | Cheetah51264(&Te0,&T640,&state->core64, data, totLength);
hash.c: | ^~~~~~~~~~~~
Cheetah512-64.s: Cheetah512-64.s: Assembler messages:
Cheetah512-64.s: Cheetah512-64.s:4992: Warning: zero assumed for missing expression
try.c: /usr/bin/ld: libcrypto_hash_cheetah512.a(Cheetah256-64.o): relocation R_X86_64_32S against `.data' can not be used when making a PIE object; recompile with -fPIE
try.c: /usr/bin/ld: failed to set dynamic section sizes: bad value
try.c: collect2: error: ld returned 1 exit status

Number of similar (compiler,implementation) pairs: 6, namely:
CompilerImplementations
gcc -march=native -mtune=native -O2 -fomit-frame-pointer -fwrapv -fPIC -fPIE T:asm
gcc -march=native -mtune=native -O3 -fomit-frame-pointer -fwrapv -fPIC -fPIE T:asm
gcc -march=native -mtune=native -Os -fomit-frame-pointer -fwrapv -fPIC -fPIE T:asm
gcc -march=native -mtune=native -O2 -fomit-frame-pointer -fwrapv -fPIC -fPIE T:asm64
gcc -march=native -mtune=native -O3 -fomit-frame-pointer -fwrapv -fPIC -fPIE T:asm64
gcc -march=native -mtune=native -Os -fomit-frame-pointer -fwrapv -fPIC -fPIE T:asm64