Test results for amd64, hertz, crypto_hash/asconhashv12

[Page version: 20261007 20:07:58]

Measurements for amd64, hertz, crypto_hash Test results for amd64, hertz, crypto_hash Test results for crypto_hash/asconhashv12
Computer: hertz
Microarchitecture: amd64; Zen 4 (a60f12)
Architecture: amd64
CPU ID: AuthenticAMD-00a60f12-178bfbff
SUPERCOP version: 20261004
Operation: crypto_hash
Primitive: asconhashv12
TimeObject sizeTest sizeImplementationCompilerBenchmark dateSUPERCOP version
239886202 0 036259 1288 1568opt64clang -march=native -O3 -fwrapv -Qunused-arguments -fPIC -fPIE -gdwarf-4 -Wall2026100620261004
239896202 0 034787 1288 1568opt64clang -march=native -O2 -fwrapv -Qunused-arguments -fPIC -fPIE -gdwarf-4 -Wall2026100620261004
241806198 0 029133 1280 1568opt64clang -march=native -Os -fwrapv -Qunused-arguments -fPIC -fPIE -gdwarf-4 -Wall2026100620261004
262676119 0 028211 1288 1504opt64clang -march=native -O -fwrapv -Qunused-arguments -fPIC -fPIE -gdwarf-4 -Wall2026100620261004
268816356 0 033614 1256 1664opt64gcc -march=native -mtune=native -O3 -fwrapv -fPIC -fPIE -gdwarf-4 -Wall2026100620261004
268856356 0 029934 1256 1664opt64gcc -march=native -mtune=native -O2 -fwrapv -fPIC -fPIE -gdwarf-4 -Wall2026100620261004
269036832 0 034118 1256 1664refgcc -march=native -mtune=native -O3 -fwrapv -fPIC -fPIE -gdwarf-4 -Wall2026100620261004
293296929 0 030566 1256 1664refgcc -march=native -mtune=native -O2 -fwrapv -fPIC -fPIE -gdwarf-4 -Wall2026100620261004
297896724 0 030181 1248 1600refgcc -march=native -mtune=native -O -fwrapv -fPIC -fPIE -gdwarf-4 -Wall2026100620261004
303683058 0 031675 1288 1568refclang -march=native -O2 -fwrapv -Qunused-arguments -fPIC -fPIE -gdwarf-4 -Wall2026100620261004
303713058 0 033147 1288 1568refclang -march=native -O3 -fwrapv -Qunused-arguments -fPIC -fPIE -gdwarf-4 -Wall2026100620261004
304542894 0 025829 1280 1568refclang -march=native -Os -fwrapv -Qunused-arguments -fPIC -fPIE -gdwarf-4 -Wall2026100620261004
30507666 0 022787 1288 1504opt64_lowsizeclang -march=native -O -fwrapv -Qunused-arguments -fPIC -fPIE -gdwarf-4 -Wall2026100620261004
311011119 0 031115 1288 1568opt64_lowsizeclang -march=native -O3 -fwrapv -Qunused-arguments -fPIC -fPIE -gdwarf-4 -Wall2026100620261004
311021119 0 029707 1288 1568opt64_lowsizeclang -march=native -O2 -fwrapv -Qunused-arguments -fPIC -fPIE -gdwarf-4 -Wall2026100620261004
311632471 0 024587 1288 1504refclang -march=native -O -fwrapv -Qunused-arguments -fPIC -fPIE -gdwarf-4 -Wall2026100620261004
31998921 0 028118 1256 1664opt64_lowsizegcc -march=native -mtune=native -O3 -fwrapv -fPIC -fPIE -gdwarf-4 -Wall2026100620261004
32195921 0 024438 1256 1664opt64_lowsizegcc -march=native -mtune=native -O2 -fwrapv -fPIC -fPIE -gdwarf-4 -Wall2026100620261004
322151444 0 024797 1248 1600opt64_lowsizegcc -march=native -mtune=native -O -fwrapv -fPIC -fPIE -gdwarf-4 -Wall2026100620261004
324876951 0 030317 1248 1600opt64gcc -march=native -mtune=native -O -fwrapv -fPIC -fPIE -gdwarf-4 -Wall2026100620261004
32857669 0 023589 1280 1568opt64_lowsizeclang -march=native -Os -fwrapv -Qunused-arguments -fPIC -fPIE -gdwarf-4 -Wall2026100620261004
33419845 0 022753 1232 1568opt64_lowsizegcc -march=native -mtune=native -Os -fwrapv -fPIC -fPIE -gdwarf-4 -Wall2026100620261004
355118484 0 035726 1256 1664opt32gcc -march=native -mtune=native -O3 -fwrapv -fPIC -fPIE -gdwarf-4 -Wall2026100620261004
355158484 0 032046 1256 1664opt32gcc -march=native -mtune=native -O2 -fwrapv -fPIC -fPIE -gdwarf-4 -Wall2026100620261004
36128979 0 024510 1256 1664opt32_lowsizegcc -march=native -mtune=native -O2 -fwrapv -fPIC -fPIE -gdwarf-4 -Wall2026100620261004
36131979 0 028190 1256 1664opt32_lowsizegcc -march=native -mtune=native -O3 -fwrapv -fPIC -fPIE -gdwarf-4 -Wall2026100620261004
365197622 0 029747 1288 1504opt32clang -march=native -O -fwrapv -Qunused-arguments -fPIC -fPIE -gdwarf-4 -Wall2026100620261004
375529024 0 032365 1248 1600opt32gcc -march=native -mtune=native -O -fwrapv -fPIC -fPIE -gdwarf-4 -Wall2026100620261004
378229263 0 031137 1232 1568opt64gcc -march=native -mtune=native -Os -fwrapv -fPIC -fPIE -gdwarf-4 -Wall2026100620261004
37984705 0 022851 1288 1504opt32_lowsizeclang -march=native -O -fwrapv -Qunused-arguments -fPIC -fPIE -gdwarf-4 -Wall2026100620261004
3882911348 0 033185 1232 1568opt32gcc -march=native -mtune=native -Os -fwrapv -fPIC -fPIE -gdwarf-4 -Wall2026100620261004
40085897 0 022849 1232 1568refgcc -march=native -mtune=native -Os -fwrapv -fPIC -fPIE -gdwarf-4 -Wall2026100620261004
404511502 0 024861 1248 1600opt32_lowsizegcc -march=native -mtune=native -O -fwrapv -fPIC -fPIE -gdwarf-4 -Wall2026100620261004
41818973 0 022865 1232 1568opt32_lowsizegcc -march=native -mtune=native -Os -fwrapv -fPIC -fPIE -gdwarf-4 -Wall2026100620261004
525049030 0 037643 1288 1568opt32clang -march=native -O2 -fwrapv -Qunused-arguments -fPIC -fPIE -gdwarf-4 -Wall2026100620261004
525399030 0 039051 1288 1568opt32clang -march=native -O3 -fwrapv -Qunused-arguments -fPIC -fPIE -gdwarf-4 -Wall2026100620261004
530859057 0 032061 1280 1568opt32clang -march=native -Os -fwrapv -Qunused-arguments -fPIC -fPIE -gdwarf-4 -Wall2026100620261004
612891271 0 031299 1288 1568opt32_lowsizeclang -march=native -O3 -fwrapv -Qunused-arguments -fPIC -fPIE -gdwarf-4 -Wall2026100620261004
614791271 0 029827 1288 1568opt32_lowsizeclang -march=native -O2 -fwrapv -Qunused-arguments -fPIC -fPIE -gdwarf-4 -Wall2026100620261004
61714806 0 023717 1280 1568opt32_lowsizeclang -march=native -Os -fwrapv -Qunused-arguments -fPIC -fPIE -gdwarf-4 -Wall2026100620261004
639725445 0 027185 1232 1568bi32gcc -march=native -mtune=native -Os -fwrapv -fPIC -fPIE -gdwarf-4 -Wall2026100620261004
656325468 0 027587 1288 1504bi32clang -march=native -O -fwrapv -Qunused-arguments -fPIC -fPIE -gdwarf-4 -Wall2026100620261004
656855452 0 034035 1288 1568bi32clang -march=native -O2 -fwrapv -Qunused-arguments -fPIC -fPIE -gdwarf-4 -Wall2026100620261004
656885443 0 028317 1280 1568bi32clang -march=native -Os -fwrapv -Qunused-arguments -fPIC -fPIE -gdwarf-4 -Wall2026100620261004
657075893 0 035891 1288 1568bi32clang -march=native -O3 -fwrapv -Qunused-arguments -fPIC -fPIE -gdwarf-4 -Wall2026100620261004
670826403 0 029741 1248 1600bi32gcc -march=native -mtune=native -O -fwrapv -fPIC -fPIE -gdwarf-4 -Wall2026100620261004
673245902 0 033070 1256 1664bi32gcc -march=native -mtune=native -O3 -fwrapv -fPIC -fPIE -gdwarf-4 -Wall2026100620261004
673255907 0 029390 1256 1664bi32gcc -march=native -mtune=native -O2 -fwrapv -fPIC -fPIE -gdwarf-4 -Wall2026100620261004
724273010 0 025171 1288 1504bi32_lowregclang -march=native -O -fwrapv -Qunused-arguments -fPIC -fPIE -gdwarf-4 -Wall2026100620261004
728263842 0 027229 1248 1600bi32_lowreggcc -march=native -mtune=native -O -fwrapv -fPIC -fPIE -gdwarf-4 -Wall2026100620261004
728352892 0 025837 1280 1568bi32_lowregclang -march=native -Os -fwrapv -Qunused-arguments -fPIC -fPIE -gdwarf-4 -Wall2026100620261004
747723508 0 027038 1256 1664bi32_lowreggcc -march=native -mtune=native -O2 -fwrapv -fPIC -fPIE -gdwarf-4 -Wall2026100620261004
747723508 0 030718 1256 1664bi32_lowreggcc -march=native -mtune=native -O3 -fwrapv -fPIC -fPIE -gdwarf-4 -Wall2026100620261004
755041597 0 023393 1232 1568bi32_lowsizegcc -march=native -mtune=native -Os -fwrapv -fPIC -fPIE -gdwarf-4 -Wall2026100620261004
760471428 0 024357 1280 1568bi32_lowsizeclang -march=native -Os -fwrapv -Qunused-arguments -fPIC -fPIE -gdwarf-4 -Wall2026100620261004
760641503 0 030019 1288 1568bi32_lowsizeclang -march=native -O2 -fwrapv -Qunused-arguments -fPIC -fPIE -gdwarf-4 -Wall2026100620261004
760641503 0 031555 1288 1568bi32_lowsizeclang -march=native -O3 -fwrapv -Qunused-arguments -fPIC -fPIE -gdwarf-4 -Wall2026100620261004
768821461 0 023635 1288 1504bi32_lowsizeclang -march=native -O -fwrapv -Qunused-arguments -fPIC -fPIE -gdwarf-4 -Wall2026100620261004
770282962 0 031491 1288 1568bi32_lowregclang -march=native -O2 -fwrapv -Qunused-arguments -fPIC -fPIE -gdwarf-4 -Wall2026100620261004
778142962 0 032963 1288 1568bi32_lowregclang -march=native -O3 -fwrapv -Qunused-arguments -fPIC -fPIE -gdwarf-4 -Wall2026100620261004
786901752 0 025214 1256 1664bi32_lowsizegcc -march=native -mtune=native -O2 -fwrapv -fPIC -fPIE -gdwarf-4 -Wall2026100620261004
786901752 0 028894 1256 1664bi32_lowsizegcc -march=native -mtune=native -O3 -fwrapv -fPIC -fPIE -gdwarf-4 -Wall2026100620261004
803512813 0 024649 1232 1568bi32_lowreggcc -march=native -mtune=native -Os -fwrapv -fPIC -fPIE -gdwarf-4 -Wall2026100620261004
807741956 0 025237 1248 1600bi32_lowsizegcc -march=native -mtune=native -O -fwrapv -fPIC -fPIE -gdwarf-4 -Wall2026100620261004
1596133606 0 030334 1256 1664bi8gcc -march=native -mtune=native -O3 -fwrapv -fPIC -fPIE -gdwarf-4 -Wall2026100620261004
1600153611 0 026718 1256 1664bi8gcc -march=native -mtune=native -O2 -fwrapv -fPIC -fPIE -gdwarf-4 -Wall2026100620261004
2623542341 0 030947 1288 1568opt8_lowsizeclang -march=native -O2 -fwrapv -Qunused-arguments -fPIC -fPIE -gdwarf-4 -Wall2026100620261004
2625923393 0 031963 1288 1568opt8clang -march=native -O2 -fwrapv -Qunused-arguments -fPIC -fPIE -gdwarf-4 -Wall2026100620261004
2752472357 0 025293 1280 1568opt8_lowsizeclang -march=native -Os -fwrapv -Qunused-arguments -fPIC -fPIE -gdwarf-4 -Wall2026100620261004
2761112376 0 025301 1280 1568opt8clang -march=native -Os -fwrapv -Qunused-arguments -fPIC -fPIE -gdwarf-4 -Wall2026100620261004
2958503824 0 031987 1288 1568bi8clang -march=native -O2 -fwrapv -Qunused-arguments -fPIC -fPIE -gdwarf-4 -Wall2026100620261004
2958503824 0 033459 1288 1568bi8clang -march=native -O3 -fwrapv -Qunused-arguments -fPIC -fPIE -gdwarf-4 -Wall2026100620261004
2960393369 0 025949 1280 1568bi8clang -march=native -Os -fwrapv -Qunused-arguments -fPIC -fPIE -gdwarf-4 -Wall2026100620261004
2970643397 0 030630 1256 1664opt8gcc -march=native -mtune=native -O3 -fwrapv -fPIC -fPIE -gdwarf-4 -Wall2026100620261004
3011452889 0 030062 1256 1664opt8_lowsizegcc -march=native -mtune=native -O3 -fwrapv -fPIC -fPIE -gdwarf-4 -Wall2026100620261004
3017342607 0 026246 1256 1664opt8gcc -march=native -mtune=native -O2 -fwrapv -fPIC -fPIE -gdwarf-4 -Wall2026100620261004
3017362442 0 025998 1256 1664opt8_lowsizegcc -march=native -mtune=native -O2 -fwrapv -fPIC -fPIE -gdwarf-4 -Wall2026100620261004
3033003419 0 025155 1288 1504bi8clang -march=native -O -fwrapv -Qunused-arguments -fPIC -fPIE -gdwarf-4 -Wall2026100620261004
3846664996 0 034923 1288 1568opt8clang -march=native -O3 -fwrapv -Qunused-arguments -fPIC -fPIE -gdwarf-4 -Wall2026100620261004
3849634548 0 034595 1288 1568opt8_lowsizeclang -march=native -O3 -fwrapv -Qunused-arguments -fPIC -fPIE -gdwarf-4 -Wall2026100620261004
4077472431 0 024563 1288 1504opt8_lowsizeclang -march=native -O -fwrapv -Qunused-arguments -fPIC -fPIE -gdwarf-4 -Wall2026100620261004
4106362718 0 024851 1288 1504opt8clang -march=native -O -fwrapv -Qunused-arguments -fPIC -fPIE -gdwarf-4 -Wall2026100620261004
4618504087 0 025665 1232 1568bi8gcc -march=native -mtune=native -Os -fwrapv -fPIC -fPIE -gdwarf-4 -Wall2026100620261004
4718165058 0 027965 1248 1600bi8gcc -march=native -mtune=native -O -fwrapv -fPIC -fPIE -gdwarf-4 -Wall2026100620261004
9571094964 0 028285 1248 1600opt8_lowsizegcc -march=native -mtune=native -O -fwrapv -fPIC -fPIE -gdwarf-4 -Wall2026100620261004
9679935000 0 028397 1248 1600opt8gcc -march=native -mtune=native -O -fwrapv -fPIC -fPIE -gdwarf-4 -Wall2026100620261004
12439844784 0 026649 1232 1568opt8_lowsizegcc -march=native -mtune=native -Os -fwrapv -fPIC -fPIE -gdwarf-4 -Wall2026100620261004
12486564805 0 026673 1232 1568opt8gcc -march=native -mtune=native -Os -fwrapv -fPIC -fPIE -gdwarf-4 -Wall2026100620261004

Compiler output


ascon.S: ascon.S:1:10: fatal error: 'xtensa/coreasm.h' file not found
ascon.S:     1 | #include <xtensa/coreasm.h>
ascon.S:       |          ^~~~~~~~~~~~~~~~~~
ascon.S: 1 error generated.

Number of similar (implementation,compiler) pairs: 4, namely:
ImplementationCompiler
T:asm_esp32clang -march=native -O2 -fwrapv -Qunused-arguments -fPIC -fPIE -gdwarf-4 -Wall (Ubuntu_Clang_21.1.8_(6ubuntu1))
T:asm_esp32clang -march=native -O3 -fwrapv -Qunused-arguments -fPIC -fPIE -gdwarf-4 -Wall (Ubuntu_Clang_21.1.8_(6ubuntu1))
T:asm_esp32clang -march=native -O -fwrapv -Qunused-arguments -fPIC -fPIE -gdwarf-4 -Wall (Ubuntu_Clang_21.1.8_(6ubuntu1))
T:asm_esp32clang -march=native -Os -fwrapv -Qunused-arguments -fPIC -fPIE -gdwarf-4 -Wall (Ubuntu_Clang_21.1.8_(6ubuntu1))

Compiler output


ascon.S: ascon.S:1:10: fatal error: xtensa/coreasm.h: No such file or directory
ascon.S:     1 | #include <xtensa/coreasm.h>
ascon.S:       |          ^~~~~~~~~~~~~~~~~~
ascon.S: compilation terminated.

Number of similar (implementation,compiler) pairs: 4, namely:
ImplementationCompiler
T:asm_esp32gcc -march=native -mtune=native -O2 -fwrapv -fPIC -fPIE -gdwarf-4 -Wall (15.2.0)
T:asm_esp32gcc -march=native -mtune=native -O3 -fwrapv -fPIC -fPIE -gdwarf-4 -Wall (15.2.0)
T:asm_esp32gcc -march=native -mtune=native -O -fwrapv -fPIC -fPIE -gdwarf-4 -Wall (15.2.0)
T:asm_esp32gcc -march=native -mtune=native -Os -fwrapv -fPIC -fPIE -gdwarf-4 -Wall (15.2.0)

Compiler output


try.c: /usr/bin/x86_64-linux-gnu-ld.bfd: /tmp/try-small-17754e.o: in function `doit':
try.c: .../supercop-data/hertz/amd64/try/c/clang_-march=native_-O2_-fwrapv_-Qunused-arguments_-fPIC_-fPIE_-gdwarf-4_-Wall/timingleaks/crypto_hash/asconhashv12/esp32/work/./try.c:76:(.text+0x...): undefined reference to `crypto_hash_asconhashv12_esp32_timingleaks'
try.c: /usr/bin/x86_64-linux-gnu-ld.bfd: /tmp/try-small-17754e.o: in function `test':
try.c: .../supercop-data/hertz/amd64/try/c/clang_-march=native_-O2_-fwrapv_-Qunused-arguments_-fPIC_-fPIE_-gdwarf-4_-Wall/timingleaks/crypto_hash/asconhashv12/esp32/work/./try.c:90:(.text+0x...): undefined reference to `crypto_hash_asconhashv12_esp32_timingleaks'
try.c: /usr/bin/x86_64-linux-gnu-ld.bfd: .../supercop-data/hertz/amd64/try/c/clang_-march=native_-O2_-fwrapv_-Qunused-arguments_-fPIC_-fPIE_-gdwarf-4_-Wall/timingleaks/crypto_hash/asconhashv12/esp32/work/./try.c:102:(.text+0x...): undefined reference to `crypto_hash_asconhashv12_esp32_timingleaks'
try.c: /usr/bin/x86_64-linux-gnu-ld.bfd: .../supercop-data/hertz/amd64/try/c/clang_-march=native_-O2_-fwrapv_-Qunused-arguments_-fPIC_-fPIE_-gdwarf-4_-Wall/timingleaks/crypto_hash/asconhashv12/esp32/work/./try.c:112:(.text+0x...): undefined reference to `crypto_hash_asconhashv12_esp32_timingleaks'
try.c: clang: error: linker command failed with exit code 1 (use -v to see invocation)

Number of similar (implementation,compiler) pairs: 1, namely:
ImplementationCompiler
T:esp32clang -march=native -O2 -fwrapv -Qunused-arguments -fPIC -fPIE -gdwarf-4 -Wall (Ubuntu_Clang_21.1.8_(6ubuntu1))

Compiler output


try.c: /usr/bin/x86_64-linux-gnu-ld.bfd: /tmp/try-small-d62c34.o: in function `doit':
try.c: .../supercop-data/hertz/amd64/try/c/clang_-march=native_-O3_-fwrapv_-Qunused-arguments_-fPIC_-fPIE_-gdwarf-4_-Wall/timingleaks/crypto_hash/asconhashv12/esp32/work/./try.c:76:(.text+0x...): undefined reference to `crypto_hash_asconhashv12_esp32_timingleaks'
try.c: /usr/bin/x86_64-linux-gnu-ld.bfd: /tmp/try-small-d62c34.o: in function `test':
try.c: .../supercop-data/hertz/amd64/try/c/clang_-march=native_-O3_-fwrapv_-Qunused-arguments_-fPIC_-fPIE_-gdwarf-4_-Wall/timingleaks/crypto_hash/asconhashv12/esp32/work/./try.c:90:(.text+0x...): undefined reference to `crypto_hash_asconhashv12_esp32_timingleaks'
try.c: /usr/bin/x86_64-linux-gnu-ld.bfd: .../supercop-data/hertz/amd64/try/c/clang_-march=native_-O3_-fwrapv_-Qunused-arguments_-fPIC_-fPIE_-gdwarf-4_-Wall/timingleaks/crypto_hash/asconhashv12/esp32/work/./try.c:102:(.text+0x...): undefined reference to `crypto_hash_asconhashv12_esp32_timingleaks'
try.c: /usr/bin/x86_64-linux-gnu-ld.bfd: .../supercop-data/hertz/amd64/try/c/clang_-march=native_-O3_-fwrapv_-Qunused-arguments_-fPIC_-fPIE_-gdwarf-4_-Wall/timingleaks/crypto_hash/asconhashv12/esp32/work/./try.c:112:(.text+0x...): undefined reference to `crypto_hash_asconhashv12_esp32_timingleaks'
try.c: clang: error: linker command failed with exit code 1 (use -v to see invocation)

Number of similar (implementation,compiler) pairs: 1, namely:
ImplementationCompiler
T:esp32clang -march=native -O3 -fwrapv -Qunused-arguments -fPIC -fPIE -gdwarf-4 -Wall (Ubuntu_Clang_21.1.8_(6ubuntu1))

Compiler output


try.c: /usr/bin/x86_64-linux-gnu-ld.bfd: /tmp/try-small-c6989d.o: in function `doit':
try.c: .../supercop-data/hertz/amd64/try/c/clang_-march=native_-O_-fwrapv_-Qunused-arguments_-fPIC_-fPIE_-gdwarf-4_-Wall/timingleaks/crypto_hash/asconhashv12/esp32/work/./try.c:76:(.text+0x...): undefined reference to `crypto_hash_asconhashv12_esp32_timingleaks'
try.c: /usr/bin/x86_64-linux-gnu-ld.bfd: /tmp/try-small-c6989d.o: in function `test':
try.c: .../supercop-data/hertz/amd64/try/c/clang_-march=native_-O_-fwrapv_-Qunused-arguments_-fPIC_-fPIE_-gdwarf-4_-Wall/timingleaks/crypto_hash/asconhashv12/esp32/work/./try.c:90:(.text+0x...): undefined reference to `crypto_hash_asconhashv12_esp32_timingleaks'
try.c: /usr/bin/x86_64-linux-gnu-ld.bfd: .../supercop-data/hertz/amd64/try/c/clang_-march=native_-O_-fwrapv_-Qunused-arguments_-fPIC_-fPIE_-gdwarf-4_-Wall/timingleaks/crypto_hash/asconhashv12/esp32/work/./try.c:102:(.text+0x...): undefined reference to `crypto_hash_asconhashv12_esp32_timingleaks'
try.c: /usr/bin/x86_64-linux-gnu-ld.bfd: .../supercop-data/hertz/amd64/try/c/clang_-march=native_-O_-fwrapv_-Qunused-arguments_-fPIC_-fPIE_-gdwarf-4_-Wall/timingleaks/crypto_hash/asconhashv12/esp32/work/./try.c:112:(.text+0x...): undefined reference to `crypto_hash_asconhashv12_esp32_timingleaks'
try.c: clang: error: linker command failed with exit code 1 (use -v to see invocation)

Number of similar (implementation,compiler) pairs: 1, namely:
ImplementationCompiler
T:esp32clang -march=native -O -fwrapv -Qunused-arguments -fPIC -fPIE -gdwarf-4 -Wall (Ubuntu_Clang_21.1.8_(6ubuntu1))

Compiler output


try.c: /usr/bin/x86_64-linux-gnu-ld.bfd: /tmp/try-small-2f1b71.o: in function `doit':
try.c: .../supercop-data/hertz/amd64/try/c/clang_-march=native_-Os_-fwrapv_-Qunused-arguments_-fPIC_-fPIE_-gdwarf-4_-Wall/timingleaks/crypto_hash/asconhashv12/esp32/work/./try.c:76:(.text+0x...): undefined reference to `crypto_hash_asconhashv12_esp32_timingleaks'
try.c: /usr/bin/x86_64-linux-gnu-ld.bfd: /tmp/try-small-2f1b71.o: in function `test':
try.c: .../supercop-data/hertz/amd64/try/c/clang_-march=native_-Os_-fwrapv_-Qunused-arguments_-fPIC_-fPIE_-gdwarf-4_-Wall/timingleaks/crypto_hash/asconhashv12/esp32/work/./try.c:90:(.text+0x...): undefined reference to `crypto_hash_asconhashv12_esp32_timingleaks'
try.c: /usr/bin/x86_64-linux-gnu-ld.bfd: .../supercop-data/hertz/amd64/try/c/clang_-march=native_-Os_-fwrapv_-Qunused-arguments_-fPIC_-fPIE_-gdwarf-4_-Wall/timingleaks/crypto_hash/asconhashv12/esp32/work/./try.c:102:(.text+0x...): undefined reference to `crypto_hash_asconhashv12_esp32_timingleaks'
try.c: /usr/bin/x86_64-linux-gnu-ld.bfd: .../supercop-data/hertz/amd64/try/c/clang_-march=native_-Os_-fwrapv_-Qunused-arguments_-fPIC_-fPIE_-gdwarf-4_-Wall/timingleaks/crypto_hash/asconhashv12/esp32/work/./try.c:112:(.text+0x...): undefined reference to `crypto_hash_asconhashv12_esp32_timingleaks'
try.c: clang: error: linker command failed with exit code 1 (use -v to see invocation)

Number of similar (implementation,compiler) pairs: 1, namely:
ImplementationCompiler
T:esp32clang -march=native -Os -fwrapv -Qunused-arguments -fPIC -fPIE -gdwarf-4 -Wall (Ubuntu_Clang_21.1.8_(6ubuntu1))

Compiler output


try.c: /usr/bin/x86_64-linux-gnu-ld.bfd: /tmp/ccf8OUDZ.o: in function `test':
try.c: .../supercop-data/hertz/amd64/try/c/gcc_-march=native_-mtune=native_-O2_-fwrapv_-fPIC_-fPIE_-gdwarf-4_-Wall/timingleaks/crypto_hash/asconhashv12/esp32/work/try.c:112:(.text+0x...): undefined reference to `crypto_hash_asconhashv12_esp32_timingleaks'
try.c: /usr/bin/x86_64-linux-gnu-ld.bfd: .../supercop-data/hertz/amd64/try/c/gcc_-march=native_-mtune=native_-O2_-fwrapv_-fPIC_-fPIE_-gdwarf-4_-Wall/timingleaks/crypto_hash/asconhashv12/esp32/work/try.c:90:(.text+0x...): undefined reference to `crypto_hash_asconhashv12_esp32_timingleaks'
try.c: /usr/bin/x86_64-linux-gnu-ld.bfd: .../supercop-data/hertz/amd64/try/c/gcc_-march=native_-mtune=native_-O2_-fwrapv_-fPIC_-fPIE_-gdwarf-4_-Wall/timingleaks/crypto_hash/asconhashv12/esp32/work/try.c:102:(.text+0x...): undefined reference to `crypto_hash_asconhashv12_esp32_timingleaks'
try.c: /usr/bin/x86_64-linux-gnu-ld.bfd: /tmp/ccf8OUDZ.o: in function `doit':
try.c: .../supercop-data/hertz/amd64/try/c/gcc_-march=native_-mtune=native_-O2_-fwrapv_-fPIC_-fPIE_-gdwarf-4_-Wall/timingleaks/crypto_hash/asconhashv12/esp32/work/try.c:76:(.text+0x...): undefined reference to `crypto_hash_asconhashv12_esp32_timingleaks'
try.c: collect2: error: ld returned 1 exit status

Number of similar (implementation,compiler) pairs: 1, namely:
ImplementationCompiler
T:esp32gcc -march=native -mtune=native -O2 -fwrapv -fPIC -fPIE -gdwarf-4 -Wall (15.2.0)

Compiler output


try.c: /usr/bin/x86_64-linux-gnu-ld.bfd: /tmp/ccoUuBSd.o: in function `test':
try.c: .../supercop-data/hertz/amd64/try/c/gcc_-march=native_-mtune=native_-O3_-fwrapv_-fPIC_-fPIE_-gdwarf-4_-Wall/timingleaks/crypto_hash/asconhashv12/esp32/work/try.c:90:(.text+0x...): undefined reference to `crypto_hash_asconhashv12_esp32_timingleaks'
try.c: /usr/bin/x86_64-linux-gnu-ld.bfd: .../supercop-data/hertz/amd64/try/c/gcc_-march=native_-mtune=native_-O3_-fwrapv_-fPIC_-fPIE_-gdwarf-4_-Wall/timingleaks/crypto_hash/asconhashv12/esp32/work/try.c:102:(.text+0x...): undefined reference to `crypto_hash_asconhashv12_esp32_timingleaks'
try.c: /usr/bin/x86_64-linux-gnu-ld.bfd: .../supercop-data/hertz/amd64/try/c/gcc_-march=native_-mtune=native_-O3_-fwrapv_-fPIC_-fPIE_-gdwarf-4_-Wall/timingleaks/crypto_hash/asconhashv12/esp32/work/try.c:112:(.text+0x...): undefined reference to `crypto_hash_asconhashv12_esp32_timingleaks'
try.c: /usr/bin/x86_64-linux-gnu-ld.bfd: /tmp/ccoUuBSd.o: in function `doit':
try.c: .../supercop-data/hertz/amd64/try/c/gcc_-march=native_-mtune=native_-O3_-fwrapv_-fPIC_-fPIE_-gdwarf-4_-Wall/timingleaks/crypto_hash/asconhashv12/esp32/work/try.c:76:(.text+0x...): undefined reference to `crypto_hash_asconhashv12_esp32_timingleaks'
try.c: collect2: error: ld returned 1 exit status

Number of similar (implementation,compiler) pairs: 1, namely:
ImplementationCompiler
T:esp32gcc -march=native -mtune=native -O3 -fwrapv -fPIC -fPIE -gdwarf-4 -Wall (15.2.0)

Compiler output


try.c: /usr/bin/x86_64-linux-gnu-ld.bfd: /tmp/ccaZV4dD.o: in function `doit':
try.c: .../supercop-data/hertz/amd64/try/c/gcc_-march=native_-mtune=native_-O_-fwrapv_-fPIC_-fPIE_-gdwarf-4_-Wall/timingleaks/crypto_hash/asconhashv12/esp32/work/try.c:76:(.text+0x...): undefined reference to `crypto_hash_asconhashv12_esp32_timingleaks'
try.c: /usr/bin/x86_64-linux-gnu-ld.bfd: /tmp/ccaZV4dD.o: in function `test':
try.c: .../supercop-data/hertz/amd64/try/c/gcc_-march=native_-mtune=native_-O_-fwrapv_-fPIC_-fPIE_-gdwarf-4_-Wall/timingleaks/crypto_hash/asconhashv12/esp32/work/try.c:90:(.text+0x...): undefined reference to `crypto_hash_asconhashv12_esp32_timingleaks'
try.c: /usr/bin/x86_64-linux-gnu-ld.bfd: .../supercop-data/hertz/amd64/try/c/gcc_-march=native_-mtune=native_-O_-fwrapv_-fPIC_-fPIE_-gdwarf-4_-Wall/timingleaks/crypto_hash/asconhashv12/esp32/work/try.c:102:(.text+0x...): undefined reference to `crypto_hash_asconhashv12_esp32_timingleaks'
try.c: /usr/bin/x86_64-linux-gnu-ld.bfd: .../supercop-data/hertz/amd64/try/c/gcc_-march=native_-mtune=native_-O_-fwrapv_-fPIC_-fPIE_-gdwarf-4_-Wall/timingleaks/crypto_hash/asconhashv12/esp32/work/try.c:112:(.text+0x...): undefined reference to `crypto_hash_asconhashv12_esp32_timingleaks'
try.c: collect2: error: ld returned 1 exit status

Number of similar (implementation,compiler) pairs: 1, namely:
ImplementationCompiler
T:esp32gcc -march=native -mtune=native -O -fwrapv -fPIC -fPIE -gdwarf-4 -Wall (15.2.0)

Compiler output


try.c: /usr/bin/x86_64-linux-gnu-ld.bfd: /tmp/ccE63IgB.o: in function `test':
try.c: .../supercop-data/hertz/amd64/try/c/gcc_-march=native_-mtune=native_-Os_-fwrapv_-fPIC_-fPIE_-gdwarf-4_-Wall/timingleaks/crypto_hash/asconhashv12/esp32/work/try.c:90:(.text+0x...): undefined reference to `crypto_hash_asconhashv12_esp32_timingleaks'
try.c: /usr/bin/x86_64-linux-gnu-ld.bfd: .../supercop-data/hertz/amd64/try/c/gcc_-march=native_-mtune=native_-Os_-fwrapv_-fPIC_-fPIE_-gdwarf-4_-Wall/timingleaks/crypto_hash/asconhashv12/esp32/work/try.c:102:(.text+0x...): undefined reference to `crypto_hash_asconhashv12_esp32_timingleaks'
try.c: /usr/bin/x86_64-linux-gnu-ld.bfd: .../supercop-data/hertz/amd64/try/c/gcc_-march=native_-mtune=native_-Os_-fwrapv_-fPIC_-fPIE_-gdwarf-4_-Wall/timingleaks/crypto_hash/asconhashv12/esp32/work/try.c:112:(.text+0x...): undefined reference to `crypto_hash_asconhashv12_esp32_timingleaks'
try.c: /usr/bin/x86_64-linux-gnu-ld.bfd: /tmp/ccE63IgB.o: in function `doit':
try.c: .../supercop-data/hertz/amd64/try/c/gcc_-march=native_-mtune=native_-Os_-fwrapv_-fPIC_-fPIE_-gdwarf-4_-Wall/timingleaks/crypto_hash/asconhashv12/esp32/work/try.c:76:(.text+0x...): undefined reference to `crypto_hash_asconhashv12_esp32_timingleaks'
try.c: collect2: error: ld returned 1 exit status

Number of similar (implementation,compiler) pairs: 1, namely:
ImplementationCompiler
T:esp32gcc -march=native -mtune=native -Os -fwrapv -fPIC -fPIE -gdwarf-4 -Wall (15.2.0)

Namespace violations


constants.o constants R
interleave.o B R
permutations.o P12 T

Number of similar (implementation,compiler) pairs: 8, namely:
ImplementationCompiler
bi32clang -march=native -O2 -fwrapv -Qunused-arguments -fPIC -fPIE -gdwarf-4 -Wall (Ubuntu_Clang_21.1.8_(6ubuntu1))
bi32clang -march=native -O3 -fwrapv -Qunused-arguments -fPIC -fPIE -gdwarf-4 -Wall (Ubuntu_Clang_21.1.8_(6ubuntu1))
bi32clang -march=native -O -fwrapv -Qunused-arguments -fPIC -fPIE -gdwarf-4 -Wall (Ubuntu_Clang_21.1.8_(6ubuntu1))
bi32clang -march=native -Os -fwrapv -Qunused-arguments -fPIC -fPIE -gdwarf-4 -Wall (Ubuntu_Clang_21.1.8_(6ubuntu1))
bi32gcc -march=native -mtune=native -O2 -fwrapv -fPIC -fPIE -gdwarf-4 -Wall (15.2.0)
bi32gcc -march=native -mtune=native -O3 -fwrapv -fPIC -fPIE -gdwarf-4 -Wall (15.2.0)
bi32gcc -march=native -mtune=native -O -fwrapv -fPIC -fPIE -gdwarf-4 -Wall (15.2.0)
bi32gcc -march=native -mtune=native -Os -fwrapv -fPIC -fPIE -gdwarf-4 -Wall (15.2.0)

Namespace violations


constants.o constants R
hash.o ascon_absorb T
hash.o ascon_inithash T
hash.o ascon_squeeze T
interleave.o B R

Number of similar (implementation,compiler) pairs: 8, namely:
ImplementationCompiler
bi32_lowregclang -march=native -O2 -fwrapv -Qunused-arguments -fPIC -fPIE -gdwarf-4 -Wall (Ubuntu_Clang_21.1.8_(6ubuntu1))
bi32_lowregclang -march=native -O3 -fwrapv -Qunused-arguments -fPIC -fPIE -gdwarf-4 -Wall (Ubuntu_Clang_21.1.8_(6ubuntu1))
bi32_lowregclang -march=native -O -fwrapv -Qunused-arguments -fPIC -fPIE -gdwarf-4 -Wall (Ubuntu_Clang_21.1.8_(6ubuntu1))
bi32_lowregclang -march=native -Os -fwrapv -Qunused-arguments -fPIC -fPIE -gdwarf-4 -Wall (Ubuntu_Clang_21.1.8_(6ubuntu1))
bi32_lowreggcc -march=native -mtune=native -O2 -fwrapv -fPIC -fPIE -gdwarf-4 -Wall (15.2.0)
bi32_lowreggcc -march=native -mtune=native -O3 -fwrapv -fPIC -fPIE -gdwarf-4 -Wall (15.2.0)
bi32_lowreggcc -march=native -mtune=native -O -fwrapv -fPIC -fPIE -gdwarf-4 -Wall (15.2.0)
bi32_lowreggcc -march=native -mtune=native -Os -fwrapv -fPIC -fPIE -gdwarf-4 -Wall (15.2.0)

Namespace violations


constants.o constants R
interleave.o B R
interleave.o FROMBI T
interleave.o TOBI T
permutations.o P T

Number of similar (implementation,compiler) pairs: 8, namely:
ImplementationCompiler
bi32_lowsizeclang -march=native -O2 -fwrapv -Qunused-arguments -fPIC -fPIE -gdwarf-4 -Wall (Ubuntu_Clang_21.1.8_(6ubuntu1))
bi32_lowsizeclang -march=native -O3 -fwrapv -Qunused-arguments -fPIC -fPIE -gdwarf-4 -Wall (Ubuntu_Clang_21.1.8_(6ubuntu1))
bi32_lowsizeclang -march=native -O -fwrapv -Qunused-arguments -fPIC -fPIE -gdwarf-4 -Wall (Ubuntu_Clang_21.1.8_(6ubuntu1))
bi32_lowsizeclang -march=native -Os -fwrapv -Qunused-arguments -fPIC -fPIE -gdwarf-4 -Wall (Ubuntu_Clang_21.1.8_(6ubuntu1))
bi32_lowsizegcc -march=native -mtune=native -O2 -fwrapv -fPIC -fPIE -gdwarf-4 -Wall (15.2.0)
bi32_lowsizegcc -march=native -mtune=native -O3 -fwrapv -fPIC -fPIE -gdwarf-4 -Wall (15.2.0)
bi32_lowsizegcc -march=native -mtune=native -O -fwrapv -fPIC -fPIE -gdwarf-4 -Wall (15.2.0)
bi32_lowsizegcc -march=native -mtune=native -Os -fwrapv -fPIC -fPIE -gdwarf-4 -Wall (15.2.0)

Namespace violations


constants.o constants R
interleave.o FROMBI T
interleave.o TOBI T
permutations.o P T

Number of similar (implementation,compiler) pairs: 8, namely:
ImplementationCompiler
bi8clang -march=native -O2 -fwrapv -Qunused-arguments -fPIC -fPIE -gdwarf-4 -Wall (Ubuntu_Clang_21.1.8_(6ubuntu1))
bi8clang -march=native -O3 -fwrapv -Qunused-arguments -fPIC -fPIE -gdwarf-4 -Wall (Ubuntu_Clang_21.1.8_(6ubuntu1))
bi8clang -march=native -O -fwrapv -Qunused-arguments -fPIC -fPIE -gdwarf-4 -Wall (Ubuntu_Clang_21.1.8_(6ubuntu1))
bi8clang -march=native -Os -fwrapv -Qunused-arguments -fPIC -fPIE -gdwarf-4 -Wall (Ubuntu_Clang_21.1.8_(6ubuntu1))
bi8gcc -march=native -mtune=native -O2 -fwrapv -fPIC -fPIE -gdwarf-4 -Wall (15.2.0)
bi8gcc -march=native -mtune=native -O3 -fwrapv -fPIC -fPIE -gdwarf-4 -Wall (15.2.0)
bi8gcc -march=native -mtune=native -O -fwrapv -fPIC -fPIE -gdwarf-4 -Wall (15.2.0)
bi8gcc -march=native -mtune=native -Os -fwrapv -fPIC -fPIE -gdwarf-4 -Wall (15.2.0)

Namespace violations


permutations.o P T

Number of similar (implementation,compiler) pairs: 16, namely:
ImplementationCompiler
opt32_lowsizeclang -march=native -O2 -fwrapv -Qunused-arguments -fPIC -fPIE -gdwarf-4 -Wall (Ubuntu_Clang_21.1.8_(6ubuntu1))
opt32_lowsizeclang -march=native -O3 -fwrapv -Qunused-arguments -fPIC -fPIE -gdwarf-4 -Wall (Ubuntu_Clang_21.1.8_(6ubuntu1))
opt32_lowsizeclang -march=native -O -fwrapv -Qunused-arguments -fPIC -fPIE -gdwarf-4 -Wall (Ubuntu_Clang_21.1.8_(6ubuntu1))
opt32_lowsizeclang -march=native -Os -fwrapv -Qunused-arguments -fPIC -fPIE -gdwarf-4 -Wall (Ubuntu_Clang_21.1.8_(6ubuntu1))
opt32_lowsizegcc -march=native -mtune=native -O2 -fwrapv -fPIC -fPIE -gdwarf-4 -Wall (15.2.0)
opt32_lowsizegcc -march=native -mtune=native -O3 -fwrapv -fPIC -fPIE -gdwarf-4 -Wall (15.2.0)
opt32_lowsizegcc -march=native -mtune=native -O -fwrapv -fPIC -fPIE -gdwarf-4 -Wall (15.2.0)
opt32_lowsizegcc -march=native -mtune=native -Os -fwrapv -fPIC -fPIE -gdwarf-4 -Wall (15.2.0)
opt64_lowsizeclang -march=native -O2 -fwrapv -Qunused-arguments -fPIC -fPIE -gdwarf-4 -Wall (Ubuntu_Clang_21.1.8_(6ubuntu1))
opt64_lowsizeclang -march=native -O3 -fwrapv -Qunused-arguments -fPIC -fPIE -gdwarf-4 -Wall (Ubuntu_Clang_21.1.8_(6ubuntu1))
opt64_lowsizeclang -march=native -O -fwrapv -Qunused-arguments -fPIC -fPIE -gdwarf-4 -Wall (Ubuntu_Clang_21.1.8_(6ubuntu1))
opt64_lowsizeclang -march=native -Os -fwrapv -Qunused-arguments -fPIC -fPIE -gdwarf-4 -Wall (Ubuntu_Clang_21.1.8_(6ubuntu1))
opt64_lowsizegcc -march=native -mtune=native -O2 -fwrapv -fPIC -fPIE -gdwarf-4 -Wall (15.2.0)
opt64_lowsizegcc -march=native -mtune=native -O3 -fwrapv -fPIC -fPIE -gdwarf-4 -Wall (15.2.0)
opt64_lowsizegcc -march=native -mtune=native -O -fwrapv -fPIC -fPIE -gdwarf-4 -Wall (15.2.0)
opt64_lowsizegcc -march=native -mtune=native -Os -fwrapv -fPIC -fPIE -gdwarf-4 -Wall (15.2.0)

Namespace violations


hash.o ascon_absorb T
hash.o ascon_inithash T
hash.o ascon_squeeze T
permutations.o P T

Number of similar (implementation,compiler) pairs: 8, namely:
ImplementationCompiler
opt8clang -march=native -O2 -fwrapv -Qunused-arguments -fPIC -fPIE -gdwarf-4 -Wall (Ubuntu_Clang_21.1.8_(6ubuntu1))
opt8clang -march=native -O3 -fwrapv -Qunused-arguments -fPIC -fPIE -gdwarf-4 -Wall (Ubuntu_Clang_21.1.8_(6ubuntu1))
opt8clang -march=native -O -fwrapv -Qunused-arguments -fPIC -fPIE -gdwarf-4 -Wall (Ubuntu_Clang_21.1.8_(6ubuntu1))
opt8clang -march=native -Os -fwrapv -Qunused-arguments -fPIC -fPIE -gdwarf-4 -Wall (Ubuntu_Clang_21.1.8_(6ubuntu1))
opt8gcc -march=native -mtune=native -O2 -fwrapv -fPIC -fPIE -gdwarf-4 -Wall (15.2.0)
opt8gcc -march=native -mtune=native -O3 -fwrapv -fPIC -fPIE -gdwarf-4 -Wall (15.2.0)
opt8gcc -march=native -mtune=native -O -fwrapv -fPIC -fPIE -gdwarf-4 -Wall (15.2.0)
opt8gcc -march=native -mtune=native -Os -fwrapv -fPIC -fPIE -gdwarf-4 -Wall (15.2.0)

Namespace violations


permutations.o P T
update.o ascon_update T

Number of similar (implementation,compiler) pairs: 8, namely:
ImplementationCompiler
opt8_lowsizeclang -march=native -O2 -fwrapv -Qunused-arguments -fPIC -fPIE -gdwarf-4 -Wall (Ubuntu_Clang_21.1.8_(6ubuntu1))
opt8_lowsizeclang -march=native -O3 -fwrapv -Qunused-arguments -fPIC -fPIE -gdwarf-4 -Wall (Ubuntu_Clang_21.1.8_(6ubuntu1))
opt8_lowsizeclang -march=native -O -fwrapv -Qunused-arguments -fPIC -fPIE -gdwarf-4 -Wall (Ubuntu_Clang_21.1.8_(6ubuntu1))
opt8_lowsizeclang -march=native -Os -fwrapv -Qunused-arguments -fPIC -fPIE -gdwarf-4 -Wall (Ubuntu_Clang_21.1.8_(6ubuntu1))
opt8_lowsizegcc -march=native -mtune=native -O2 -fwrapv -fPIC -fPIE -gdwarf-4 -Wall (15.2.0)
opt8_lowsizegcc -march=native -mtune=native -O3 -fwrapv -fPIC -fPIE -gdwarf-4 -Wall (15.2.0)
opt8_lowsizegcc -march=native -mtune=native -O -fwrapv -fPIC -fPIE -gdwarf-4 -Wall (15.2.0)
opt8_lowsizegcc -march=native -mtune=native -Os -fwrapv -fPIC -fPIE -gdwarf-4 -Wall (15.2.0)

TIMECOP error (can be valgrind bug)


error 132

Process terminating with default action of signal 4 (SIGILL)
 Illegal opcode at address 0x4006298
   at 0x...: memset (string_fortified.h:59)
   by 0x...: cpucycles_works (wrapper.c:59)
   by 0x...: supercop_cpucycles_ticks_amd64_tsc_setup (amd64-tsc.c:28)
   by 0x...: cpucycles_init (wrapper.c:314)
   by 0x...: main (try-anything.c:330)
Illegal instruction (core dumped)

Number of similar (implementation,compiler) pairs: 1, namely:
ImplementationCompiler
bi32clang -march=native -O2 -fwrapv -Qunused-arguments -fPIC -fPIE -gdwarf-4 -Wall (Ubuntu_Clang_21.1.8_(6ubuntu1))

TIMECOP error (can be valgrind bug)


error 132

Process terminating with default action of signal 4 (SIGILL)
 Illegal opcode at address 0x4006618
   at 0x...: memset (string_fortified.h:59)
   by 0x...: cpucycles_works (wrapper.c:59)
   by 0x...: supercop_cpucycles_ticks_amd64_tsc_setup (amd64-tsc.c:28)
   by 0x...: cpucycles_init (wrapper.c:314)
   by 0x...: main (try-anything.c:330)
Illegal instruction (core dumped)

Number of similar (implementation,compiler) pairs: 3, namely:
ImplementationCompiler
bi32clang -march=native -O3 -fwrapv -Qunused-arguments -fPIC -fPIE -gdwarf-4 -Wall (Ubuntu_Clang_21.1.8_(6ubuntu1))
opt32clang -march=native -Os -fwrapv -Qunused-arguments -fPIC -fPIE -gdwarf-4 -Wall (Ubuntu_Clang_21.1.8_(6ubuntu1))
opt64gcc -march=native -mtune=native -Os -fwrapv -fPIC -fPIE -gdwarf-4 -Wall (15.2.0)

TIMECOP error (can be valgrind bug)


error 132

Process terminating with default action of signal 4 (SIGILL)
 Illegal opcode at address 0x4005818
   at 0x...: memset (string_fortified.h:59)
   by 0x...: cpucycles_works (wrapper.c:59)
   by 0x...: supercop_cpucycles_ticks_amd64_tsc_setup (amd64-tsc.c:28)
   by 0x...: cpucycles_init (wrapper.c:314)
   by 0x...: main (try-anything.c:330)
Illegal instruction (core dumped)

Number of similar (implementation,compiler) pairs: 1, namely:
ImplementationCompiler
bi32clang -march=native -O -fwrapv -Qunused-arguments -fPIC -fPIE -gdwarf-4 -Wall (Ubuntu_Clang_21.1.8_(6ubuntu1))

TIMECOP error (can be valgrind bug)


error 132

Process terminating with default action of signal 4 (SIGILL)
 Illegal opcode at address 0x4005A58
   at 0x...: memset (string_fortified.h:59)
   by 0x...: cpucycles_works (wrapper.c:59)
   by 0x...: supercop_cpucycles_ticks_amd64_tsc_setup (amd64-tsc.c:28)
   by 0x...: cpucycles_init (wrapper.c:314)
   by 0x...: main (try-anything.c:330)
Illegal instruction (core dumped)

Number of similar (implementation,compiler) pairs: 2, namely:
ImplementationCompiler
bi32clang -march=native -Os -fwrapv -Qunused-arguments -fPIC -fPIE -gdwarf-4 -Wall (Ubuntu_Clang_21.1.8_(6ubuntu1))
bi32_lowregclang -march=native -O3 -fwrapv -Qunused-arguments -fPIC -fPIE -gdwarf-4 -Wall (Ubuntu_Clang_21.1.8_(6ubuntu1))

TIMECOP error (can be valgrind bug)


error 132

Process terminating with default action of signal 4 (SIGILL)
 Illegal opcode at address 0x4005F18
   at 0x...: memset (string_fortified.h:59)
   by 0x...: cpucycles_works (wrapper.c:59)
   by 0x...: supercop_cpucycles_ticks_amd64_tsc_setup (amd64-tsc.c:28)
   by 0x...: cpucycles_init (wrapper.c:314)
   by 0x...: main (try-anything.c:330)
Illegal instruction (core dumped)

Number of similar (implementation,compiler) pairs: 1, namely:
ImplementationCompiler
bi32gcc -march=native -mtune=native -O2 -fwrapv -fPIC -fPIE -gdwarf-4 -Wall (15.2.0)

TIMECOP error (can be valgrind bug)


error 132

Process terminating with default action of signal 4 (SIGILL)
 Illegal opcode at address 0x4006458
   at 0x...: memset (string_fortified.h:59)
   by 0x...: cpucycles_works (wrapper.c:59)
   by 0x...: supercop_cpucycles_ticks_amd64_tsc_setup (amd64-tsc.c:28)
   by 0x...: cpucycles_init (wrapper.c:314)
   by 0x...: main (try-anything.c:330)
Illegal instruction (core dumped)

Number of similar (implementation,compiler) pairs: 1, namely:
ImplementationCompiler
bi32gcc -march=native -mtune=native -O3 -fwrapv -fPIC -fPIE -gdwarf-4 -Wall (15.2.0)

TIMECOP error (can be valgrind bug)


error 132

Process terminating with default action of signal 4 (SIGILL)
 Illegal opcode at address 0x4005ED8
   at 0x...: memset (string_fortified.h:59)
   by 0x...: cpucycles_works (wrapper.c:59)
   by 0x...: supercop_cpucycles_ticks_amd64_tsc_setup (amd64-tsc.c:28)
   by 0x...: cpucycles_init (wrapper.c:314)
   by 0x...: main (try-anything.c:330)
Illegal instruction (core dumped)

Number of similar (implementation,compiler) pairs: 2, namely:
ImplementationCompiler
bi32gcc -march=native -mtune=native -O -fwrapv -fPIC -fPIE -gdwarf-4 -Wall (15.2.0)
opt8_lowsizeclang -march=native -O3 -fwrapv -Qunused-arguments -fPIC -fPIE -gdwarf-4 -Wall (Ubuntu_Clang_21.1.8_(6ubuntu1))

TIMECOP error (can be valgrind bug)


error 132

Process terminating with default action of signal 4 (SIGILL)
 Illegal opcode at address 0x4005758
   at 0x...: memset (string_fortified.h:59)
   by 0x...: cpucycles_works (wrapper.c:59)
   by 0x...: supercop_cpucycles_ticks_amd64_tsc_setup (amd64-tsc.c:28)
   by 0x...: cpucycles_init (wrapper.c:314)
   by 0x...: main (try-anything.c:330)
Illegal instruction (core dumped)

Number of similar (implementation,compiler) pairs: 1, namely:
ImplementationCompiler
bi32gcc -march=native -mtune=native -Os -fwrapv -fPIC -fPIE -gdwarf-4 -Wall (15.2.0)

TIMECOP error (can be valgrind bug)


error 132

Process terminating with default action of signal 4 (SIGILL)
 Illegal opcode at address 0x4005898
   at 0x...: memset (string_fortified.h:59)
   by 0x...: cpucycles_works (wrapper.c:59)
   by 0x...: supercop_cpucycles_ticks_amd64_tsc_setup (amd64-tsc.c:28)
   by 0x...: cpucycles_init (wrapper.c:314)
   by 0x...: main (try-anything.c:330)
Illegal instruction (core dumped)

Number of similar (implementation,compiler) pairs: 1, namely:
ImplementationCompiler
bi32_lowregclang -march=native -O2 -fwrapv -Qunused-arguments -fPIC -fPIE -gdwarf-4 -Wall (Ubuntu_Clang_21.1.8_(6ubuntu1))

TIMECOP error (can be valgrind bug)


error 132

Process terminating with default action of signal 4 (SIGILL)
 Illegal opcode at address 0x4004E18
   at 0x...: memset (string_fortified.h:59)
   by 0x...: cpucycles_works (wrapper.c:59)
   by 0x...: supercop_cpucycles_ticks_amd64_tsc_setup (amd64-tsc.c:28)
   by 0x...: cpucycles_init (wrapper.c:314)
   by 0x...: main (try-anything.c:330)
Illegal instruction (core dumped)

Number of similar (implementation,compiler) pairs: 2, namely:
ImplementationCompiler
bi32_lowregclang -march=native -O -fwrapv -Qunused-arguments -fPIC -fPIE -gdwarf-4 -Wall (Ubuntu_Clang_21.1.8_(6ubuntu1))
opt8clang -march=native -Os -fwrapv -Qunused-arguments -fPIC -fPIE -gdwarf-4 -Wall (Ubuntu_Clang_21.1.8_(6ubuntu1))

TIMECOP error (can be valgrind bug)


error 132

Process terminating with default action of signal 4 (SIGILL)
 Illegal opcode at address 0x4005018
   at 0x...: memset (string_fortified.h:59)
   by 0x...: cpucycles_works (wrapper.c:59)
   by 0x...: supercop_cpucycles_ticks_amd64_tsc_setup (amd64-tsc.c:28)
   by 0x...: cpucycles_init (wrapper.c:314)
   by 0x...: main (try-anything.c:330)
Illegal instruction (core dumped)

Number of similar (implementation,compiler) pairs: 1, namely:
ImplementationCompiler
bi32_lowregclang -march=native -Os -fwrapv -Qunused-arguments -fPIC -fPIE -gdwarf-4 -Wall (Ubuntu_Clang_21.1.8_(6ubuntu1))

TIMECOP error (can be valgrind bug)


error 132

Process terminating with default action of signal 4 (SIGILL)
 Illegal opcode at address 0x4005558
   at 0x...: memset (string_fortified.h:59)
   by 0x...: cpucycles_works (wrapper.c:59)
   by 0x...: supercop_cpucycles_ticks_amd64_tsc_setup (amd64-tsc.c:28)
   by 0x...: cpucycles_init (wrapper.c:314)
   by 0x...: main (try-anything.c:330)
Illegal instruction (core dumped)

Number of similar (implementation,compiler) pairs: 1, namely:
ImplementationCompiler
bi32_lowreggcc -march=native -mtune=native -O2 -fwrapv -fPIC -fPIE -gdwarf-4 -Wall (15.2.0)

TIMECOP error (can be valgrind bug)


error 132

Process terminating with default action of signal 4 (SIGILL)
 Illegal opcode at address 0x4005A98
   at 0x...: memset (string_fortified.h:59)
   by 0x...: cpucycles_works (wrapper.c:59)
   by 0x...: supercop_cpucycles_ticks_amd64_tsc_setup (amd64-tsc.c:28)
   by 0x...: cpucycles_init (wrapper.c:314)
   by 0x...: main (try-anything.c:330)
Illegal instruction (core dumped)

Number of similar (implementation,compiler) pairs: 2, namely:
ImplementationCompiler
bi32_lowreggcc -march=native -mtune=native -O3 -fwrapv -fPIC -fPIE -gdwarf-4 -Wall (15.2.0)
bi8clang -march=native -O2 -fwrapv -Qunused-arguments -fPIC -fPIE -gdwarf-4 -Wall (Ubuntu_Clang_21.1.8_(6ubuntu1))

TIMECOP error (can be valgrind bug)


error 132

Process terminating with default action of signal 4 (SIGILL)
 Illegal opcode at address 0x4005498
   at 0x...: memset (string_fortified.h:59)
   by 0x...: cpucycles_works (wrapper.c:59)
   by 0x...: supercop_cpucycles_ticks_amd64_tsc_setup (amd64-tsc.c:28)
   by 0x...: cpucycles_init (wrapper.c:314)
   by 0x...: main (try-anything.c:330)
Illegal instruction (core dumped)

Number of similar (implementation,compiler) pairs: 4, namely:
ImplementationCompiler
bi32_lowreggcc -march=native -mtune=native -O -fwrapv -fPIC -fPIE -gdwarf-4 -Wall (15.2.0)
bi32_lowsizeclang -march=native -O3 -fwrapv -Qunused-arguments -fPIC -fPIE -gdwarf-4 -Wall (Ubuntu_Clang_21.1.8_(6ubuntu1))
opt8gcc -march=native -mtune=native -Os -fwrapv -fPIC -fPIE -gdwarf-4 -Wall (15.2.0)
opt8_lowsizegcc -march=native -mtune=native -Os -fwrapv -fPIC -fPIE -gdwarf-4 -Wall (15.2.0)

TIMECOP error (can be valgrind bug)


error 132

Process terminating with default action of signal 4 (SIGILL)
 Illegal opcode at address 0x4004CD8
   at 0x...: memset (string_fortified.h:59)
   by 0x...: cpucycles_works (wrapper.c:59)
   by 0x...: supercop_cpucycles_ticks_amd64_tsc_setup (amd64-tsc.c:28)
   by 0x...: cpucycles_init (wrapper.c:314)
   by 0x...: main (try-anything.c:330)
Illegal instruction (core dumped)

Number of similar (implementation,compiler) pairs: 3, namely:
ImplementationCompiler
bi32_lowreggcc -march=native -mtune=native -Os -fwrapv -fPIC -fPIE -gdwarf-4 -Wall (15.2.0)
opt8clang -march=native -O -fwrapv -Qunused-arguments -fPIC -fPIE -gdwarf-4 -Wall (Ubuntu_Clang_21.1.8_(6ubuntu1))
refclang -march=native -O -fwrapv -Qunused-arguments -fPIC -fPIE -gdwarf-4 -Wall (Ubuntu_Clang_21.1.8_(6ubuntu1))

TIMECOP error (can be valgrind bug)


error 132

Process terminating with default action of signal 4 (SIGILL)
 Illegal opcode at address 0x40052D8
   at 0x...: memset (string_fortified.h:59)
   by 0x...: cpucycles_works (wrapper.c:59)
   by 0x...: supercop_cpucycles_ticks_amd64_tsc_setup (amd64-tsc.c:28)
   by 0x...: cpucycles_init (wrapper.c:314)
   by 0x...: main (try-anything.c:330)
Illegal instruction (core dumped)

Number of similar (implementation,compiler) pairs: 1, namely:
ImplementationCompiler
bi32_lowsizeclang -march=native -O2 -fwrapv -Qunused-arguments -fPIC -fPIE -gdwarf-4 -Wall (Ubuntu_Clang_21.1.8_(6ubuntu1))

TIMECOP error (can be valgrind bug)


error 132

Process terminating with default action of signal 4 (SIGILL)
 Illegal opcode at address 0x4004858
   at 0x...: memset (string_fortified.h:59)
   by 0x...: cpucycles_works (wrapper.c:59)
   by 0x...: supercop_cpucycles_ticks_amd64_tsc_setup (amd64-tsc.c:28)
   by 0x...: cpucycles_init (wrapper.c:314)
   by 0x...: main (try-anything.c:330)
Illegal instruction (core dumped)

Number of similar (implementation,compiler) pairs: 2, namely:
ImplementationCompiler
bi32_lowsizeclang -march=native -O -fwrapv -Qunused-arguments -fPIC -fPIE -gdwarf-4 -Wall (Ubuntu_Clang_21.1.8_(6ubuntu1))
opt32_lowsizeclang -march=native -Os -fwrapv -Qunused-arguments -fPIC -fPIE -gdwarf-4 -Wall (Ubuntu_Clang_21.1.8_(6ubuntu1))

TIMECOP error (can be valgrind bug)


error 132

Process terminating with default action of signal 4 (SIGILL)
 Illegal opcode at address 0x4004A98
   at 0x...: memset (string_fortified.h:59)
   by 0x...: cpucycles_works (wrapper.c:59)
   by 0x...: supercop_cpucycles_ticks_amd64_tsc_setup (amd64-tsc.c:28)
   by 0x...: cpucycles_init (wrapper.c:314)
   by 0x...: main (try-anything.c:330)
Illegal instruction (core dumped)

Number of similar (implementation,compiler) pairs: 1, namely:
ImplementationCompiler
bi32_lowsizeclang -march=native -Os -fwrapv -Qunused-arguments -fPIC -fPIE -gdwarf-4 -Wall (Ubuntu_Clang_21.1.8_(6ubuntu1))

TIMECOP error (can be valgrind bug)


error 132

Process terminating with default action of signal 4 (SIGILL)
 Illegal opcode at address 0x4004E98
   at 0x...: memset (string_fortified.h:59)
   by 0x...: cpucycles_works (wrapper.c:59)
   by 0x...: supercop_cpucycles_ticks_amd64_tsc_setup (amd64-tsc.c:28)
   by 0x...: cpucycles_init (wrapper.c:314)
   by 0x...: main (try-anything.c:330)
Illegal instruction (core dumped)

Number of similar (implementation,compiler) pairs: 1, namely:
ImplementationCompiler
bi32_lowsizegcc -march=native -mtune=native -O2 -fwrapv -fPIC -fPIE -gdwarf-4 -Wall (15.2.0)

TIMECOP error (can be valgrind bug)


error 132

Process terminating with default action of signal 4 (SIGILL)
 Illegal opcode at address 0x40053D8
   at 0x...: memset (string_fortified.h:59)
   by 0x...: cpucycles_works (wrapper.c:59)
   by 0x...: supercop_cpucycles_ticks_amd64_tsc_setup (amd64-tsc.c:28)
   by 0x...: cpucycles_init (wrapper.c:314)
   by 0x...: main (try-anything.c:330)
Illegal instruction (core dumped)

Number of similar (implementation,compiler) pairs: 2, namely:
ImplementationCompiler
bi32_lowsizegcc -march=native -mtune=native -O3 -fwrapv -fPIC -fPIE -gdwarf-4 -Wall (15.2.0)
opt32_lowsizeclang -march=native -O3 -fwrapv -Qunused-arguments -fPIC -fPIE -gdwarf-4 -Wall (Ubuntu_Clang_21.1.8_(6ubuntu1))

TIMECOP error (can be valgrind bug)


error 132

Process terminating with default action of signal 4 (SIGILL)
 Illegal opcode at address 0x4004D58
   at 0x...: memset (string_fortified.h:59)
   by 0x...: cpucycles_works (wrapper.c:59)
   by 0x...: supercop_cpucycles_ticks_amd64_tsc_setup (amd64-tsc.c:28)
   by 0x...: cpucycles_init (wrapper.c:314)
   by 0x...: main (try-anything.c:330)
Illegal instruction (core dumped)

Number of similar (implementation,compiler) pairs: 1, namely:
ImplementationCompiler
bi32_lowsizegcc -march=native -mtune=native -O -fwrapv -fPIC -fPIE -gdwarf-4 -Wall (15.2.0)

TIMECOP error (can be valgrind bug)


error 132

Process terminating with default action of signal 4 (SIGILL)
 Illegal opcode at address 0x4004818
   at 0x...: memset (string_fortified.h:59)
   by 0x...: cpucycles_works (wrapper.c:59)
   by 0x...: supercop_cpucycles_ticks_amd64_tsc_setup (amd64-tsc.c:28)
   by 0x...: cpucycles_init (wrapper.c:314)
   by 0x...: main (try-anything.c:330)
Illegal instruction (core dumped)

Number of similar (implementation,compiler) pairs: 2, namely:
ImplementationCompiler
bi32_lowsizegcc -march=native -mtune=native -Os -fwrapv -fPIC -fPIE -gdwarf-4 -Wall (15.2.0)
opt64_lowsizeclang -march=native -Os -fwrapv -Qunused-arguments -fPIC -fPIE -gdwarf-4 -Wall (Ubuntu_Clang_21.1.8_(6ubuntu1))

TIMECOP error (can be valgrind bug)


error 132

Process terminating with default action of signal 4 (SIGILL)
 Illegal opcode at address 0x4005C58
   at 0x...: memset (string_fortified.h:59)
   by 0x...: cpucycles_works (wrapper.c:59)
   by 0x...: supercop_cpucycles_ticks_amd64_tsc_setup (amd64-tsc.c:28)
   by 0x...: cpucycles_init (wrapper.c:314)
   by 0x...: main (try-anything.c:330)
Illegal instruction (core dumped)

Number of similar (implementation,compiler) pairs: 1, namely:
ImplementationCompiler
bi8clang -march=native -O3 -fwrapv -Qunused-arguments -fPIC -fPIE -gdwarf-4 -Wall (Ubuntu_Clang_21.1.8_(6ubuntu1))

TIMECOP error (can be valgrind bug)


error 132

Process terminating with default action of signal 4 (SIGILL)
 Illegal opcode at address 0x4004E58
   at 0x...: memset (string_fortified.h:59)
   by 0x...: cpucycles_works (wrapper.c:59)
   by 0x...: supercop_cpucycles_ticks_amd64_tsc_setup (amd64-tsc.c:28)
   by 0x...: cpucycles_init (wrapper.c:314)
   by 0x...: main (try-anything.c:330)
Illegal instruction (core dumped)

Number of similar (implementation,compiler) pairs: 2, namely:
ImplementationCompiler
bi8clang -march=native -O -fwrapv -Qunused-arguments -fPIC -fPIE -gdwarf-4 -Wall (Ubuntu_Clang_21.1.8_(6ubuntu1))
opt8_lowsizeclang -march=native -Os -fwrapv -Qunused-arguments -fPIC -fPIE -gdwarf-4 -Wall (Ubuntu_Clang_21.1.8_(6ubuntu1))

TIMECOP error (can be valgrind bug)


error 132

Process terminating with default action of signal 4 (SIGILL)
 Illegal opcode at address 0x4005098
   at 0x...: memset (string_fortified.h:59)
   by 0x...: cpucycles_works (wrapper.c:59)
   by 0x...: supercop_cpucycles_ticks_amd64_tsc_setup (amd64-tsc.c:28)
   by 0x...: cpucycles_init (wrapper.c:314)
   by 0x...: main (try-anything.c:330)
Illegal instruction (core dumped)

Number of similar (implementation,compiler) pairs: 1, namely:
ImplementationCompiler
bi8clang -march=native -Os -fwrapv -Qunused-arguments -fPIC -fPIE -gdwarf-4 -Wall (Ubuntu_Clang_21.1.8_(6ubuntu1))

TIMECOP error (can be valgrind bug)


error 132

Process terminating with default action of signal 4 (SIGILL)
 Illegal opcode at address 0x4005398
   at 0x...: memset (string_fortified.h:59)
   by 0x...: cpucycles_works (wrapper.c:59)
   by 0x...: supercop_cpucycles_ticks_amd64_tsc_setup (amd64-tsc.c:28)
   by 0x...: cpucycles_init (wrapper.c:314)
   by 0x...: main (try-anything.c:330)
Illegal instruction (core dumped)

Number of similar (implementation,compiler) pairs: 2, namely:
ImplementationCompiler
bi8gcc -march=native -mtune=native -O2 -fwrapv -fPIC -fPIE -gdwarf-4 -Wall (15.2.0)
opt64_lowsizeclang -march=native -O3 -fwrapv -Qunused-arguments -fPIC -fPIE -gdwarf-4 -Wall (Ubuntu_Clang_21.1.8_(6ubuntu1))

TIMECOP error (can be valgrind bug)


error 132

Process terminating with default action of signal 4 (SIGILL)
 Illegal opcode at address 0x40058D8
   at 0x...: memset (string_fortified.h:59)
   by 0x...: cpucycles_works (wrapper.c:59)
   by 0x...: supercop_cpucycles_ticks_amd64_tsc_setup (amd64-tsc.c:28)
   by 0x...: cpucycles_init (wrapper.c:314)
   by 0x...: main (try-anything.c:330)
Illegal instruction (core dumped)

Number of similar (implementation,compiler) pairs: 1, namely:
ImplementationCompiler
bi8gcc -march=native -mtune=native -O3 -fwrapv -fPIC -fPIE -gdwarf-4 -Wall (15.2.0)

TIMECOP error (can be valgrind bug)


error 132

Process terminating with default action of signal 4 (SIGILL)
 Illegal opcode at address 0x40057D8
   at 0x...: memset (string_fortified.h:59)
   by 0x...: cpucycles_works (wrapper.c:59)
   by 0x...: supercop_cpucycles_ticks_amd64_tsc_setup (amd64-tsc.c:28)
   by 0x...: cpucycles_init (wrapper.c:314)
   by 0x...: main (try-anything.c:330)
Illegal instruction (core dumped)

Number of similar (implementation,compiler) pairs: 1, namely:
ImplementationCompiler
bi8gcc -march=native -mtune=native -O -fwrapv -fPIC -fPIE -gdwarf-4 -Wall (15.2.0)

TIMECOP error (can be valgrind bug)


error 132

Process terminating with default action of signal 4 (SIGILL)
 Illegal opcode at address 0x40050D8
   at 0x...: memset (string_fortified.h:59)
   by 0x...: cpucycles_works (wrapper.c:59)
   by 0x...: supercop_cpucycles_ticks_amd64_tsc_setup (amd64-tsc.c:28)
   by 0x...: cpucycles_init (wrapper.c:314)
   by 0x...: main (try-anything.c:330)
Illegal instruction (core dumped)

Number of similar (implementation,compiler) pairs: 1, namely:
ImplementationCompiler
bi8gcc -march=native -mtune=native -Os -fwrapv -fPIC -fPIE -gdwarf-4 -Wall (15.2.0)

TIMECOP error (can be valgrind bug)


error 132

Process terminating with default action of signal 4 (SIGILL)
 Illegal opcode at address 0x4006E58
   at 0x...: memset (string_fortified.h:59)
   by 0x...: cpucycles_works (wrapper.c:59)
   by 0x...: supercop_cpucycles_ticks_amd64_tsc_setup (amd64-tsc.c:28)
   by 0x...: cpucycles_init (wrapper.c:314)
   by 0x...: main (try-anything.c:330)
Illegal instruction (core dumped)

Number of similar (implementation,compiler) pairs: 2, namely:
ImplementationCompiler
opt32clang -march=native -O2 -fwrapv -Qunused-arguments -fPIC -fPIE -gdwarf-4 -Wall (Ubuntu_Clang_21.1.8_(6ubuntu1))
opt32gcc -march=native -mtune=native -Os -fwrapv -fPIC -fPIE -gdwarf-4 -Wall (15.2.0)

TIMECOP error (can be valgrind bug)


error 132

Process terminating with default action of signal 4 (SIGILL)
 Illegal opcode at address 0x4007018
   at 0x...: memset (string_fortified.h:59)
   by 0x...: cpucycles_works (wrapper.c:59)
   by 0x...: supercop_cpucycles_ticks_amd64_tsc_setup (amd64-tsc.c:28)
   by 0x...: cpucycles_init (wrapper.c:314)
   by 0x...: main (try-anything.c:330)
Illegal instruction (core dumped)

Number of similar (implementation,compiler) pairs: 1, namely:
ImplementationCompiler
opt32clang -march=native -O3 -fwrapv -Qunused-arguments -fPIC -fPIE -gdwarf-4 -Wall (Ubuntu_Clang_21.1.8_(6ubuntu1))

TIMECOP error (can be valgrind bug)


error 132

Process terminating with default action of signal 4 (SIGILL)
 Illegal opcode at address 0x4006118
   at 0x...: memset (string_fortified.h:59)
   by 0x...: cpucycles_works (wrapper.c:59)
   by 0x...: supercop_cpucycles_ticks_amd64_tsc_setup (amd64-tsc.c:28)
   by 0x...: cpucycles_init (wrapper.c:314)
   by 0x...: main (try-anything.c:330)
Illegal instruction (core dumped)

Number of similar (implementation,compiler) pairs: 2, namely:
ImplementationCompiler
opt32clang -march=native -O -fwrapv -Qunused-arguments -fPIC -fPIE -gdwarf-4 -Wall (Ubuntu_Clang_21.1.8_(6ubuntu1))
refgcc -march=native -mtune=native -O -fwrapv -fPIC -fPIE -gdwarf-4 -Wall (15.2.0)

TIMECOP error (can be valgrind bug)


error 132

Process terminating with default action of signal 4 (SIGILL)
 Illegal opcode at address 0x40069D8
   at 0x...: memset (string_fortified.h:59)
   by 0x...: cpucycles_works (wrapper.c:59)
   by 0x...: supercop_cpucycles_ticks_amd64_tsc_setup (amd64-tsc.c:28)
   by 0x...: cpucycles_init (wrapper.c:314)
   by 0x...: main (try-anything.c:330)
Illegal instruction (core dumped)

Number of similar (implementation,compiler) pairs: 2, namely:
ImplementationCompiler
opt32gcc -march=native -mtune=native -O2 -fwrapv -fPIC -fPIE -gdwarf-4 -Wall (15.2.0)
opt32gcc -march=native -mtune=native -O -fwrapv -fPIC -fPIE -gdwarf-4 -Wall (15.2.0)

TIMECOP error (can be valgrind bug)


error 132

Process terminating with default action of signal 4 (SIGILL)
 Illegal opcode at address 0x4006F18
   at 0x...: memset (string_fortified.h:59)
   by 0x...: cpucycles_works (wrapper.c:59)
   by 0x...: supercop_cpucycles_ticks_amd64_tsc_setup (amd64-tsc.c:28)
   by 0x...: cpucycles_init (wrapper.c:314)
   by 0x...: main (try-anything.c:330)
Illegal instruction (core dumped)

Number of similar (implementation,compiler) pairs: 1, namely:
ImplementationCompiler
opt32gcc -march=native -mtune=native -O3 -fwrapv -fPIC -fPIE -gdwarf-4 -Wall (15.2.0)

TIMECOP error (can be valgrind bug)


error 132

Process terminating with default action of signal 4 (SIGILL)
 Illegal opcode at address 0x4005218
   at 0x...: memset (string_fortified.h:59)
   by 0x...: cpucycles_works (wrapper.c:59)
   by 0x...: supercop_cpucycles_ticks_amd64_tsc_setup (amd64-tsc.c:28)
   by 0x...: cpucycles_init (wrapper.c:314)
   by 0x...: main (try-anything.c:330)
Illegal instruction (core dumped)

Number of similar (implementation,compiler) pairs: 1, namely:
ImplementationCompiler
opt32_lowsizeclang -march=native -O2 -fwrapv -Qunused-arguments -fPIC -fPIE -gdwarf-4 -Wall (Ubuntu_Clang_21.1.8_(6ubuntu1))

TIMECOP error (can be valgrind bug)


error 132

Process terminating with default action of signal 4 (SIGILL)
 Illegal opcode at address 0x40045D8
   at 0x...: memset (string_fortified.h:59)
   by 0x...: cpucycles_works (wrapper.c:59)
   by 0x...: supercop_cpucycles_ticks_amd64_tsc_setup (amd64-tsc.c:28)
   by 0x...: cpucycles_init (wrapper.c:314)
   by 0x...: main (try-anything.c:330)
Illegal instruction (core dumped)

Number of similar (implementation,compiler) pairs: 3, namely:
ImplementationCompiler
opt32_lowsizeclang -march=native -O -fwrapv -Qunused-arguments -fPIC -fPIE -gdwarf-4 -Wall (Ubuntu_Clang_21.1.8_(6ubuntu1))
opt64_lowsizeclang -march=native -O -fwrapv -Qunused-arguments -fPIC -fPIE -gdwarf-4 -Wall (Ubuntu_Clang_21.1.8_(6ubuntu1))
opt64_lowsizegcc -march=native -mtune=native -Os -fwrapv -fPIC -fPIE -gdwarf-4 -Wall (15.2.0)

TIMECOP error (can be valgrind bug)


error 132

Process terminating with default action of signal 4 (SIGILL)
 Illegal opcode at address 0x4004C58
   at 0x...: memset (string_fortified.h:59)
   by 0x...: cpucycles_works (wrapper.c:59)
   by 0x...: supercop_cpucycles_ticks_amd64_tsc_setup (amd64-tsc.c:28)
   by 0x...: cpucycles_init (wrapper.c:314)
   by 0x...: main (try-anything.c:330)
Illegal instruction (core dumped)

Number of similar (implementation,compiler) pairs: 2, namely:
ImplementationCompiler
opt32_lowsizegcc -march=native -mtune=native -O2 -fwrapv -fPIC -fPIE -gdwarf-4 -Wall (15.2.0)
opt32_lowsizegcc -march=native -mtune=native -O -fwrapv -fPIC -fPIE -gdwarf-4 -Wall (15.2.0)

TIMECOP error (can be valgrind bug)


error 132

Process terminating with default action of signal 4 (SIGILL)
 Illegal opcode at address 0x4005198
   at 0x...: memset (string_fortified.h:59)
   by 0x...: cpucycles_works (wrapper.c:59)
   by 0x...: supercop_cpucycles_ticks_amd64_tsc_setup (amd64-tsc.c:28)
   by 0x...: cpucycles_init (wrapper.c:314)
   by 0x...: main (try-anything.c:330)
Illegal instruction (core dumped)

Number of similar (implementation,compiler) pairs: 2, namely:
ImplementationCompiler
opt32_lowsizegcc -march=native -mtune=native -O3 -fwrapv -fPIC -fPIE -gdwarf-4 -Wall (15.2.0)
opt8gcc -march=native -mtune=native -O2 -fwrapv -fPIC -fPIE -gdwarf-4 -Wall (15.2.0)

TIMECOP error (can be valgrind bug)


error 132

Process terminating with default action of signal 4 (SIGILL)
 Illegal opcode at address 0x4004698
   at 0x...: memset (string_fortified.h:59)
   by 0x...: cpucycles_works (wrapper.c:59)
   by 0x...: supercop_cpucycles_ticks_amd64_tsc_setup (amd64-tsc.c:28)
   by 0x...: cpucycles_init (wrapper.c:314)
   by 0x...: main (try-anything.c:330)
Illegal instruction (core dumped)

Number of similar (implementation,compiler) pairs: 1, namely:
ImplementationCompiler
opt32_lowsizegcc -march=native -mtune=native -Os -fwrapv -fPIC -fPIE -gdwarf-4 -Wall (15.2.0)

TIMECOP error (can be valgrind bug)


error 132

Process terminating with default action of signal 4 (SIGILL)
 Illegal opcode at address 0x40065D8
   at 0x...: memset (string_fortified.h:59)
   by 0x...: cpucycles_works (wrapper.c:59)
   by 0x...: supercop_cpucycles_ticks_amd64_tsc_setup (amd64-tsc.c:28)
   by 0x...: cpucycles_init (wrapper.c:314)
   by 0x...: main (try-anything.c:330)
Illegal instruction (core dumped)

Number of similar (implementation,compiler) pairs: 1, namely:
ImplementationCompiler
opt64clang -march=native -O2 -fwrapv -Qunused-arguments -fPIC -fPIE -gdwarf-4 -Wall (Ubuntu_Clang_21.1.8_(6ubuntu1))

TIMECOP error (can be valgrind bug)


error 132

Process terminating with default action of signal 4 (SIGILL)
 Illegal opcode at address 0x4006798
   at 0x...: memset (string_fortified.h:59)
   by 0x...: cpucycles_works (wrapper.c:59)
   by 0x...: supercop_cpucycles_ticks_amd64_tsc_setup (amd64-tsc.c:28)
   by 0x...: cpucycles_init (wrapper.c:314)
   by 0x...: main (try-anything.c:330)
Illegal instruction (core dumped)

Number of similar (implementation,compiler) pairs: 1, namely:
ImplementationCompiler
opt64clang -march=native -O3 -fwrapv -Qunused-arguments -fPIC -fPIE -gdwarf-4 -Wall (Ubuntu_Clang_21.1.8_(6ubuntu1))

TIMECOP error (can be valgrind bug)


error 132

Process terminating with default action of signal 4 (SIGILL)
 Illegal opcode at address 0x4005B58
   at 0x...: memset (string_fortified.h:59)
   by 0x...: cpucycles_works (wrapper.c:59)
   by 0x...: supercop_cpucycles_ticks_amd64_tsc_setup (amd64-tsc.c:28)
   by 0x...: cpucycles_init (wrapper.c:314)
   by 0x...: main (try-anything.c:330)
Illegal instruction (core dumped)

Number of similar (implementation,compiler) pairs: 1, namely:
ImplementationCompiler
opt64clang -march=native -O -fwrapv -Qunused-arguments -fPIC -fPIE -gdwarf-4 -Wall (Ubuntu_Clang_21.1.8_(6ubuntu1))

TIMECOP error (can be valgrind bug)


error 132

Process terminating with default action of signal 4 (SIGILL)
 Illegal opcode at address 0x4005D98
   at 0x...: memset (string_fortified.h:59)
   by 0x...: cpucycles_works (wrapper.c:59)
   by 0x...: supercop_cpucycles_ticks_amd64_tsc_setup (amd64-tsc.c:28)
   by 0x...: cpucycles_init (wrapper.c:314)
   by 0x...: main (try-anything.c:330)
Illegal instruction (core dumped)

Number of similar (implementation,compiler) pairs: 1, namely:
ImplementationCompiler
opt64clang -march=native -Os -fwrapv -Qunused-arguments -fPIC -fPIE -gdwarf-4 -Wall (Ubuntu_Clang_21.1.8_(6ubuntu1))

TIMECOP error (can be valgrind bug)


error 132

Process terminating with default action of signal 4 (SIGILL)
 Illegal opcode at address 0x4006198
   at 0x...: memset (string_fortified.h:59)
   by 0x...: cpucycles_works (wrapper.c:59)
   by 0x...: supercop_cpucycles_ticks_amd64_tsc_setup (amd64-tsc.c:28)
   by 0x...: cpucycles_init (wrapper.c:314)
   by 0x...: main (try-anything.c:330)
Illegal instruction (core dumped)

Number of similar (implementation,compiler) pairs: 1, namely:
ImplementationCompiler
opt64gcc -march=native -mtune=native -O2 -fwrapv -fPIC -fPIE -gdwarf-4 -Wall (15.2.0)

TIMECOP error (can be valgrind bug)


error 132

Process terminating with default action of signal 4 (SIGILL)
 Illegal opcode at address 0x40066D8
   at 0x...: memset (string_fortified.h:59)
   by 0x...: cpucycles_works (wrapper.c:59)
   by 0x...: supercop_cpucycles_ticks_amd64_tsc_setup (amd64-tsc.c:28)
   by 0x...: cpucycles_init (wrapper.c:314)
   by 0x...: main (try-anything.c:330)
Illegal instruction (core dumped)

Number of similar (implementation,compiler) pairs: 1, namely:
ImplementationCompiler
opt64gcc -march=native -mtune=native -O3 -fwrapv -fPIC -fPIE -gdwarf-4 -Wall (15.2.0)

TIMECOP error (can be valgrind bug)


error 132

Process terminating with default action of signal 4 (SIGILL)
 Illegal opcode at address 0x40061D8
   at 0x...: memset (string_fortified.h:59)
   by 0x...: cpucycles_works (wrapper.c:59)
   by 0x...: supercop_cpucycles_ticks_amd64_tsc_setup (amd64-tsc.c:28)
   by 0x...: cpucycles_init (wrapper.c:314)
   by 0x...: main (try-anything.c:330)
Illegal instruction (core dumped)

Number of similar (implementation,compiler) pairs: 1, namely:
ImplementationCompiler
opt64gcc -march=native -mtune=native -O -fwrapv -fPIC -fPIE -gdwarf-4 -Wall (15.2.0)

TIMECOP error (can be valgrind bug)


error 132

Process terminating with default action of signal 4 (SIGILL)
 Illegal opcode at address 0x40051D8
   at 0x...: memset (string_fortified.h:59)
   by 0x...: cpucycles_works (wrapper.c:59)
   by 0x...: supercop_cpucycles_ticks_amd64_tsc_setup (amd64-tsc.c:28)
   by 0x...: cpucycles_init (wrapper.c:314)
   by 0x...: main (try-anything.c:330)
Illegal instruction (core dumped)

Number of similar (implementation,compiler) pairs: 1, namely:
ImplementationCompiler
opt64_lowsizeclang -march=native -O2 -fwrapv -Qunused-arguments -fPIC -fPIE -gdwarf-4 -Wall (Ubuntu_Clang_21.1.8_(6ubuntu1))

TIMECOP error (can be valgrind bug)


error 132

Process terminating with default action of signal 4 (SIGILL)
 Illegal opcode at address 0x4004C18
   at 0x...: memset (string_fortified.h:59)
   by 0x...: cpucycles_works (wrapper.c:59)
   by 0x...: supercop_cpucycles_ticks_amd64_tsc_setup (amd64-tsc.c:28)
   by 0x...: cpucycles_init (wrapper.c:314)
   by 0x...: main (try-anything.c:330)
Illegal instruction (core dumped)

Number of similar (implementation,compiler) pairs: 3, namely:
ImplementationCompiler
opt64_lowsizegcc -march=native -mtune=native -O2 -fwrapv -fPIC -fPIE -gdwarf-4 -Wall (15.2.0)
opt64_lowsizegcc -march=native -mtune=native -O -fwrapv -fPIC -fPIE -gdwarf-4 -Wall (15.2.0)
opt8_lowsizeclang -march=native -O -fwrapv -Qunused-arguments -fPIC -fPIE -gdwarf-4 -Wall (Ubuntu_Clang_21.1.8_(6ubuntu1))

TIMECOP error (can be valgrind bug)


error 132

Process terminating with default action of signal 4 (SIGILL)
 Illegal opcode at address 0x4005158
   at 0x...: memset (string_fortified.h:59)
   by 0x...: cpucycles_works (wrapper.c:59)
   by 0x...: supercop_cpucycles_ticks_amd64_tsc_setup (amd64-tsc.c:28)
   by 0x...: cpucycles_init (wrapper.c:314)
   by 0x...: main (try-anything.c:330)
Illegal instruction (core dumped)

Number of similar (implementation,compiler) pairs: 2, namely:
ImplementationCompiler
opt64_lowsizegcc -march=native -mtune=native -O3 -fwrapv -fPIC -fPIE -gdwarf-4 -Wall (15.2.0)
opt8_lowsizegcc -march=native -mtune=native -O2 -fwrapv -fPIC -fPIE -gdwarf-4 -Wall (15.2.0)

TIMECOP error (can be valgrind bug)


error 132

Process terminating with default action of signal 4 (SIGILL)
 Illegal opcode at address 0x4005998
   at 0x...: memset (string_fortified.h:59)
   by 0x...: cpucycles_works (wrapper.c:59)
   by 0x...: supercop_cpucycles_ticks_amd64_tsc_setup (amd64-tsc.c:28)
   by 0x...: cpucycles_init (wrapper.c:314)
   by 0x...: main (try-anything.c:330)
Illegal instruction (core dumped)

Number of similar (implementation,compiler) pairs: 1, namely:
ImplementationCompiler
opt8clang -march=native -O2 -fwrapv -Qunused-arguments -fPIC -fPIE -gdwarf-4 -Wall (Ubuntu_Clang_21.1.8_(6ubuntu1))

TIMECOP error (can be valgrind bug)


error 132

Process terminating with default action of signal 4 (SIGILL)
 Illegal opcode at address 0x4005FD8
   at 0x...: memset (string_fortified.h:59)
   by 0x...: cpucycles_works (wrapper.c:59)
   by 0x...: supercop_cpucycles_ticks_amd64_tsc_setup (amd64-tsc.c:28)
   by 0x...: cpucycles_init (wrapper.c:314)
   by 0x...: main (try-anything.c:330)
Illegal instruction (core dumped)

Number of similar (implementation,compiler) pairs: 1, namely:
ImplementationCompiler
opt8clang -march=native -O3 -fwrapv -Qunused-arguments -fPIC -fPIE -gdwarf-4 -Wall (Ubuntu_Clang_21.1.8_(6ubuntu1))

TIMECOP error (can be valgrind bug)


error 132

Process terminating with default action of signal 4 (SIGILL)
 Illegal opcode at address 0x40059D8
   at 0x...: memset (string_fortified.h:59)
   by 0x...: cpucycles_works (wrapper.c:59)
   by 0x...: supercop_cpucycles_ticks_amd64_tsc_setup (amd64-tsc.c:28)
   by 0x...: cpucycles_init (wrapper.c:314)
   by 0x...: main (try-anything.c:330)
Illegal instruction (core dumped)

Number of similar (implementation,compiler) pairs: 1, namely:
ImplementationCompiler
opt8gcc -march=native -mtune=native -O3 -fwrapv -fPIC -fPIE -gdwarf-4 -Wall (15.2.0)

TIMECOP error (can be valgrind bug)


error 132

Process terminating with default action of signal 4 (SIGILL)
 Illegal opcode at address 0x4005958
   at 0x...: memset (string_fortified.h:59)
   by 0x...: cpucycles_works (wrapper.c:59)
   by 0x...: supercop_cpucycles_ticks_amd64_tsc_setup (amd64-tsc.c:28)
   by 0x...: cpucycles_init (wrapper.c:314)
   by 0x...: main (try-anything.c:330)
Illegal instruction (core dumped)

Number of similar (implementation,compiler) pairs: 2, namely:
ImplementationCompiler
opt8gcc -march=native -mtune=native -O -fwrapv -fPIC -fPIE -gdwarf-4 -Wall (15.2.0)
opt8_lowsizegcc -march=native -mtune=native -O -fwrapv -fPIC -fPIE -gdwarf-4 -Wall (15.2.0)

TIMECOP error (can be valgrind bug)


error 132

Process terminating with default action of signal 4 (SIGILL)
 Illegal opcode at address 0x4005658
   at 0x...: memset (string_fortified.h:59)
   by 0x...: cpucycles_works (wrapper.c:59)
   by 0x...: supercop_cpucycles_ticks_amd64_tsc_setup (amd64-tsc.c:28)
   by 0x...: cpucycles_init (wrapper.c:314)
   by 0x...: main (try-anything.c:330)
Illegal instruction (core dumped)

Number of similar (implementation,compiler) pairs: 1, namely:
ImplementationCompiler
opt8_lowsizeclang -march=native -O2 -fwrapv -Qunused-arguments -fPIC -fPIE -gdwarf-4 -Wall (Ubuntu_Clang_21.1.8_(6ubuntu1))

TIMECOP error (can be valgrind bug)


error 132

Process terminating with default action of signal 4 (SIGILL)
 Illegal opcode at address 0x4005858
   at 0x...: memset (string_fortified.h:59)
   by 0x...: cpucycles_works (wrapper.c:59)
   by 0x...: supercop_cpucycles_ticks_amd64_tsc_setup (amd64-tsc.c:28)
   by 0x...: cpucycles_init (wrapper.c:314)
   by 0x...: main (try-anything.c:330)
Illegal instruction (core dumped)

Number of similar (implementation,compiler) pairs: 2, namely:
ImplementationCompiler
opt8_lowsizegcc -march=native -mtune=native -O3 -fwrapv -fPIC -fPIE -gdwarf-4 -Wall (15.2.0)
refclang -march=native -O2 -fwrapv -Qunused-arguments -fPIC -fPIE -gdwarf-4 -Wall (Ubuntu_Clang_21.1.8_(6ubuntu1))

TIMECOP error (can be valgrind bug)


error 132

Process terminating with default action of signal 4 (SIGILL)
 Illegal opcode at address 0x4005A18
   at 0x...: memset (string_fortified.h:59)
   by 0x...: cpucycles_works (wrapper.c:59)
   by 0x...: supercop_cpucycles_ticks_amd64_tsc_setup (amd64-tsc.c:28)
   by 0x...: cpucycles_init (wrapper.c:314)
   by 0x...: main (try-anything.c:330)
Illegal instruction (core dumped)

Number of similar (implementation,compiler) pairs: 1, namely:
ImplementationCompiler
refclang -march=native -O3 -fwrapv -Qunused-arguments -fPIC -fPIE -gdwarf-4 -Wall (Ubuntu_Clang_21.1.8_(6ubuntu1))

TIMECOP error (can be valgrind bug)


error 132

Process terminating with default action of signal 4 (SIGILL)
 Illegal opcode at address 0x4004FD8
   at 0x...: memset (string_fortified.h:59)
   by 0x...: cpucycles_works (wrapper.c:59)
   by 0x...: supercop_cpucycles_ticks_amd64_tsc_setup (amd64-tsc.c:28)
   by 0x...: cpucycles_init (wrapper.c:314)
   by 0x...: main (try-anything.c:330)
Illegal instruction (core dumped)

Number of similar (implementation,compiler) pairs: 1, namely:
ImplementationCompiler
refclang -march=native -Os -fwrapv -Qunused-arguments -fPIC -fPIE -gdwarf-4 -Wall (Ubuntu_Clang_21.1.8_(6ubuntu1))

TIMECOP error (can be valgrind bug)


error 132

Process terminating with default action of signal 4 (SIGILL)
 Illegal opcode at address 0x40063D8
   at 0x...: memset (string_fortified.h:59)
   by 0x...: cpucycles_works (wrapper.c:59)
   by 0x...: supercop_cpucycles_ticks_amd64_tsc_setup (amd64-tsc.c:28)
   by 0x...: cpucycles_init (wrapper.c:314)
   by 0x...: main (try-anything.c:330)
Illegal instruction (core dumped)

Number of similar (implementation,compiler) pairs: 1, namely:
ImplementationCompiler
refgcc -march=native -mtune=native -O2 -fwrapv -fPIC -fPIE -gdwarf-4 -Wall (15.2.0)

TIMECOP error (can be valgrind bug)


error 132

Process terminating with default action of signal 4 (SIGILL)
 Illegal opcode at address 0x40068D8
   at 0x...: memset (string_fortified.h:59)
   by 0x...: cpucycles_works (wrapper.c:59)
   by 0x...: supercop_cpucycles_ticks_amd64_tsc_setup (amd64-tsc.c:28)
   by 0x...: cpucycles_init (wrapper.c:314)
   by 0x...: main (try-anything.c:330)
Illegal instruction (core dumped)

Number of similar (implementation,compiler) pairs: 1, namely:
ImplementationCompiler
refgcc -march=native -mtune=native -O3 -fwrapv -fPIC -fPIE -gdwarf-4 -Wall (15.2.0)

TIMECOP error (can be valgrind bug)


error 132

Process terminating with default action of signal 4 (SIGILL)
 Illegal opcode at address 0x4004658
   at 0x...: memset (string_fortified.h:59)
   by 0x...: cpucycles_works (wrapper.c:59)
   by 0x...: supercop_cpucycles_ticks_amd64_tsc_setup (amd64-tsc.c:28)
   by 0x...: cpucycles_init (wrapper.c:314)
   by 0x...: main (try-anything.c:330)
Illegal instruction (core dumped)

Number of similar (implementation,compiler) pairs: 1, namely:
ImplementationCompiler
refgcc -march=native -mtune=native -Os -fwrapv -fPIC -fPIE -gdwarf-4 -Wall (15.2.0)