Implementation notes: amd64, hertz, crypto_aead/schwaemm192192v1

Computer: hertz
Microarchitecture: amd64; Zen 4 (a60f12)
Architecture: amd64
CPU ID: AuthenticAMD-00a60f12-178bfbff
SUPERCOP version: 20240107
Operation: crypto_aead
Primitive: schwaemm192192v1
TimeObject sizeTest sizeImplementationCompilerBenchmark dateSUPERCOP version
1840436130 0 023436 812 1160T:optgcc_-march=native_-mtune=native_-O3_-fomit-frame-pointer_-fwrapv_-fPIC_-fPIE2023122020231217
20846010517 0 027972 820 1160T:refgcc_-march=native_-mtune=native_-O3_-fomit-frame-pointer_-fwrapv_-fPIC_-fPIE2023122020231217

Compiler output

Implementation: T:opt
Security model: timingleaks
Compiler: clang-17 -march=native -O2 -fomit-frame-pointer -fwrapv -Qunused-arguments -fPIC -fPIE
try.c: /usr/bin/ld: libcrypto_aead_schwaemm192192v1.a(encrypt.o): in function `crypto_aead_schwaemm192192v1_opt_timingleaks_encrypt':
try.c: encrypt.c:(.text+0x...): undefined reference to `processAD'
try.c: /usr/bin/ld: encrypt.c:(.text+0x...): undefined reference to `encryptPT'
try.c: /usr/bin/ld: libcrypto_aead_schwaemm192192v1.a(encrypt.o): in function `crypto_aead_schwaemm192192v1_opt_timingleaks_decrypt':
try.c: encrypt.c:(.text+0x...): undefined reference to `processAD'
try.c: /usr/bin/ld: encrypt.c:(.text+0x...): undefined reference to `decryptCT'
try.c: clang-17: error: linker command failed with exit code 1 (use -v to see invocation)

Number of similar (compiler,implementation) pairs: 2, namely:
CompilerImplementations
clang-17 -march=native -O2 -fomit-frame-pointer -fwrapv -Qunused-arguments -fPIC -fPIE T:opt
clang-17 -march=native -O3 -fomit-frame-pointer -fwrapv -Qunused-arguments -fPIC -fPIE T:opt

Compiler output

Implementation: T:opt
Security model: timingleaks
Compiler: clang-17 -march=native -Os -fomit-frame-pointer -fwrapv -Qunused-arguments -fPIC -fPIE
try.c: /usr/bin/ld: libcrypto_aead_schwaemm192192v1.a(encrypt.o): in function `crypto_aead_schwaemm192192v1_opt_timingleaks_encrypt':
try.c: encrypt.c:(.text+0x...): undefined reference to `encryptPT'
try.c: /usr/bin/ld: libcrypto_aead_schwaemm192192v1.a(encrypt.o): in function `crypto_aead_schwaemm192192v1_opt_timingleaks_decrypt':
try.c: encrypt.c:(.text+0x...): undefined reference to `decryptCT'
try.c: clang-17: error: linker command failed with exit code 1 (use -v to see invocation)

Number of similar (compiler,implementation) pairs: 1, namely:
CompilerImplementations
clang-17 -march=native -Os -fomit-frame-pointer -fwrapv -Qunused-arguments -fPIC -fPIE T:opt

Compiler output

Implementation: T:opt
Security model: timingleaks
Compiler: gcc -march=native -mtune=native -O2 -fomit-frame-pointer -fwrapv -fPIC -fPIE
try.c: /usr/bin/ld: libcrypto_aead_schwaemm192192v1.a(encrypt.o): in function `crypto_aead_schwaemm192192v1_opt_timingleaks_encrypt':
try.c: encrypt.c:(.text+0x...): undefined reference to `encryptPT'
try.c: /usr/bin/ld: libcrypto_aead_schwaemm192192v1.a(encrypt.o): in function `crypto_aead_schwaemm192192v1_opt_timingleaks_decrypt':
try.c: encrypt.c:(.text+0x...): undefined reference to `decryptCT'
try.c: collect2: error: ld returned 1 exit status

Number of similar (compiler,implementation) pairs: 1, namely:
CompilerImplementations
gcc -march=native -mtune=native -O2 -fomit-frame-pointer -fwrapv -fPIC -fPIE T:opt

Compiler output

Implementation: T:opt
Security model: timingleaks
Compiler: gcc -march=native -mtune=native -Os -fomit-frame-pointer -fwrapv -fPIC -fPIE
try.c: /usr/bin/ld: libcrypto_aead_schwaemm192192v1.a(encrypt.o): in function `crypto_aead_schwaemm192192v1_opt_timingleaks_encrypt':
try.c: encrypt.c:(.text+0x...): undefined reference to `initialize'
try.c: /usr/bin/ld: encrypt.c:(.text+0x...): undefined reference to `processAD'
try.c: /usr/bin/ld: encrypt.c:(.text+0x...): undefined reference to `encryptPT'
try.c: /usr/bin/ld: libcrypto_aead_schwaemm192192v1.a(encrypt.o): in function `crypto_aead_schwaemm192192v1_opt_timingleaks_decrypt':
try.c: encrypt.c:(.text+0x...): undefined reference to `initialize'
try.c: /usr/bin/ld: encrypt.c:(.text+0x...): undefined reference to `processAD'
try.c: /usr/bin/ld: encrypt.c:(.text+0x...): undefined reference to `decryptCT'
try.c: collect2: error: ld returned 1 exit status

Number of similar (compiler,implementation) pairs: 1, namely:
CompilerImplementations
gcc -march=native -mtune=native -Os -fomit-frame-pointer -fwrapv -fPIC -fPIE T:opt

Compiler output

Implementation: T:ref
Security model: timingleaks
Compiler: clang-17 -march=native -O2 -fomit-frame-pointer -fwrapv -Qunused-arguments -fPIC -fPIE
try.c: /usr/bin/ld: libcrypto_aead_schwaemm192192v1.a(encrypt.o): in function `crypto_aead_schwaemm192192v1_ref_timingleaks_encrypt':
try.c: encrypt.c:(.text+0x...): undefined reference to `processAD'
try.c: /usr/bin/ld: encrypt.c:(.text+0x...): undefined reference to `encryptPT'
try.c: /usr/bin/ld: libcrypto_aead_schwaemm192192v1.a(encrypt.o): in function `crypto_aead_schwaemm192192v1_ref_timingleaks_decrypt':
try.c: encrypt.c:(.text+0x...): undefined reference to `processAD'
try.c: /usr/bin/ld: encrypt.c:(.text+0x...): undefined reference to `decryptCT'
try.c: clang-17: error: linker command failed with exit code 1 (use -v to see invocation)

Number of similar (compiler,implementation) pairs: 2, namely:
CompilerImplementations
clang-17 -march=native -O2 -fomit-frame-pointer -fwrapv -Qunused-arguments -fPIC -fPIE T:ref
clang-17 -march=native -O3 -fomit-frame-pointer -fwrapv -Qunused-arguments -fPIC -fPIE T:ref

Compiler output

Implementation: T:ref
Security model: timingleaks
Compiler: clang-17 -march=native -Os -fomit-frame-pointer -fwrapv -Qunused-arguments -fPIC -fPIE
try.c: /usr/bin/ld: libcrypto_aead_schwaemm192192v1.a(encrypt.o): in function `crypto_aead_schwaemm192192v1_ref_timingleaks_encrypt':
try.c: encrypt.c:(.text+0x...): undefined reference to `encryptPT'
try.c: /usr/bin/ld: libcrypto_aead_schwaemm192192v1.a(encrypt.o): in function `crypto_aead_schwaemm192192v1_ref_timingleaks_decrypt':
try.c: encrypt.c:(.text+0x...): undefined reference to `decryptCT'
try.c: clang-17: error: linker command failed with exit code 1 (use -v to see invocation)

Number of similar (compiler,implementation) pairs: 1, namely:
CompilerImplementations
clang-17 -march=native -Os -fomit-frame-pointer -fwrapv -Qunused-arguments -fPIC -fPIE T:ref

Compiler output

Implementation: T:ref
Security model: timingleaks
Compiler: gcc -march=native -mtune=native -O2 -fomit-frame-pointer -fwrapv -fPIC -fPIE
try.c: /usr/bin/ld: libcrypto_aead_schwaemm192192v1.a(encrypt.o): in function `crypto_aead_schwaemm192192v1_ref_timingleaks_encrypt':
try.c: encrypt.c:(.text+0x...): undefined reference to `encryptPT'
try.c: /usr/bin/ld: libcrypto_aead_schwaemm192192v1.a(encrypt.o): in function `crypto_aead_schwaemm192192v1_ref_timingleaks_decrypt':
try.c: encrypt.c:(.text+0x...): undefined reference to `decryptCT'
try.c: collect2: error: ld returned 1 exit status

Number of similar (compiler,implementation) pairs: 1, namely:
CompilerImplementations
gcc -march=native -mtune=native -O2 -fomit-frame-pointer -fwrapv -fPIC -fPIE T:ref

Compiler output

Implementation: T:ref
Security model: timingleaks
Compiler: gcc -march=native -mtune=native -Os -fomit-frame-pointer -fwrapv -fPIC -fPIE
try.c: /usr/bin/ld: libcrypto_aead_schwaemm192192v1.a(encrypt.o): in function `crypto_aead_schwaemm192192v1_ref_timingleaks_encrypt':
try.c: encrypt.c:(.text+0x...): undefined reference to `initialize'
try.c: /usr/bin/ld: encrypt.c:(.text+0x...): undefined reference to `processAD'
try.c: /usr/bin/ld: encrypt.c:(.text+0x...): undefined reference to `encryptPT'
try.c: /usr/bin/ld: libcrypto_aead_schwaemm192192v1.a(encrypt.o): in function `crypto_aead_schwaemm192192v1_ref_timingleaks_decrypt':
try.c: encrypt.c:(.text+0x...): undefined reference to `initialize'
try.c: /usr/bin/ld: encrypt.c:(.text+0x...): undefined reference to `processAD'
try.c: /usr/bin/ld: encrypt.c:(.text+0x...): undefined reference to `decryptCT'
try.c: collect2: error: ld returned 1 exit status

Number of similar (compiler,implementation) pairs: 1, namely:
CompilerImplementations
gcc -march=native -mtune=native -Os -fomit-frame-pointer -fwrapv -fPIC -fPIE T:ref