Test results for amd64, hertz, crypto_aead/omdsha256k128n96tau96v1
[Page version: 20250310 13:41:42]
Measurements for amd64, hertz, crypto_aead
Test results for amd64, hertz, crypto_aead
Test results for crypto_aead/omdsha256k128n96tau96v1
Computer: hertz
Microarchitecture: amd64; Zen 4 (a60f12)
Architecture: amd64
CPU ID: AuthenticAMD-00a60f12-178bfbff
SUPERCOP version: 20250307
Operation: crypto_aead
Primitive: omdsha256k128n96tau96v1
Time | Object size | Test size | Implementation | Compiler | Benchmark date | SUPERCOP version |
137761 | 11247 0 0 | 36014 828 1096 | T:ref | clang -march=native -O2 -fwrapv -Qunused-arguments -fPIC -fPIE -gdwarf-4 -Wall | 20250308 | 20250307 |
138671 | 10099 0 0 | 34886 828 1096 | T:ref | clang -march=native -O3 -fwrapv -Qunused-arguments -fPIC -fPIE -gdwarf-4 -Wall | 20250308 | 20250307 |
139401 | 11438 0 0 | 35420 812 1192 | T:ref | gcc -march=native -mtune=native -O3 -fwrapv -fPIC -fPIE -gdwarf-4 -Wall | 20250308 | 20250307 |
148977 | 6822 0 0 | 28964 812 1192 | T:ref | gcc -march=native -mtune=native -O2 -fwrapv -fPIC -fPIE -gdwarf-4 -Wall | 20250308 | 20250307 |
156209 | 4556 0 0 | 25720 820 1096 | T:ref | clang -march=native -Os -fwrapv -Qunused-arguments -fPIC -fPIE -gdwarf-4 -Wall | 20250308 | 20250307 |
173759 | 4440 0 0 | 24047 788 1064 | T:ref | gcc -march=native -mtune=native -Os -fwrapv -fPIC -fPIE -gdwarf-4 -Wall | 20250308 | 20250307 |
Compiler output
try.c: /usr/bin/ld: libcrypto_aead_omdsha256k128n96tau96v1.a(omdsha256.o):.../supercop-data/avx/amd64/try/c/clang_-march=native_-O2_-fwrapv_-Qunused-arguments_-fPIC_-fPIE_-gdwarf-4_-Wall/timingleaks/crypto_aead/omdsha256k128n96tau96v1/avx1/work/./omdsha256.h:137: multiple definition of `Hash'; libcrypto_aead_omdsha256k128n96tau96v1.a(encrypt.o):.../supercop-data/avx/amd64/try/c/clang_-march=native_-O2_-fwrapv_-Qunused-arguments_-fPIC_-fPIE_-gdwarf-4_-Wall/timingleaks/crypto_aead/omdsha256k128n96tau96v1/avx1/work/./omdsha256.h:137: first defined here
try.c: clang: error: linker command failed with exit code 1 (use -v to see invocation)
Number of similar (implementation,compiler) pairs: 1, namely:
Implementation | Compiler |
T:avx1 | clang -march=native -O2 -fwrapv -Qunused-arguments -fPIC -fPIE -gdwarf-4 -Wall (Ubuntu_Clang_19.1.1_(1ubuntu1)) |
Compiler output
try.c: /usr/bin/ld: libcrypto_aead_omdsha256k128n96tau96v1.a(omdsha256.o):.../supercop-data/avx/amd64/try/c/clang_-march=native_-O3_-fwrapv_-Qunused-arguments_-fPIC_-fPIE_-gdwarf-4_-Wall/timingleaks/crypto_aead/omdsha256k128n96tau96v1/avx1/work/./omdsha256.h:137: multiple definition of `Hash'; libcrypto_aead_omdsha256k128n96tau96v1.a(encrypt.o):.../supercop-data/avx/amd64/try/c/clang_-march=native_-O3_-fwrapv_-Qunused-arguments_-fPIC_-fPIE_-gdwarf-4_-Wall/timingleaks/crypto_aead/omdsha256k128n96tau96v1/avx1/work/./omdsha256.h:137: first defined here
try.c: clang: error: linker command failed with exit code 1 (use -v to see invocation)
Number of similar (implementation,compiler) pairs: 1, namely:
Implementation | Compiler |
T:avx1 | clang -march=native -O3 -fwrapv -Qunused-arguments -fPIC -fPIE -gdwarf-4 -Wall (Ubuntu_Clang_19.1.1_(1ubuntu1)) |
Compiler output
try.c: /usr/bin/ld: libcrypto_aead_omdsha256k128n96tau96v1.a(omdsha256.o):.../supercop-data/avx/amd64/try/c/clang_-march=native_-Os_-fwrapv_-Qunused-arguments_-fPIC_-fPIE_-gdwarf-4_-Wall/timingleaks/crypto_aead/omdsha256k128n96tau96v1/avx1/work/./omdsha256.h:137: multiple definition of `Hash'; libcrypto_aead_omdsha256k128n96tau96v1.a(encrypt.o):.../supercop-data/avx/amd64/try/c/clang_-march=native_-Os_-fwrapv_-Qunused-arguments_-fPIC_-fPIE_-gdwarf-4_-Wall/timingleaks/crypto_aead/omdsha256k128n96tau96v1/avx1/work/./omdsha256.h:137: first defined here
try.c: clang: error: linker command failed with exit code 1 (use -v to see invocation)
Number of similar (implementation,compiler) pairs: 1, namely:
Implementation | Compiler |
T:avx1 | clang -march=native -Os -fwrapv -Qunused-arguments -fPIC -fPIE -gdwarf-4 -Wall (Ubuntu_Clang_19.1.1_(1ubuntu1)) |
Compiler output
encrypt.c: /tmp/ccdvOssn.s: Assembler messages:
encrypt.c: /tmp/ccdvOssn.s:922: Warning: dwarf line number information for .data ignored
encrypt.c: /tmp/ccdvOssn.s:924: Warning: dwarf line number information for .data ignored
encrypt.c: /tmp/ccdvOssn.s:926: Warning: dwarf line number information for .data ignored
encrypt.c: /tmp/ccdvOssn.s:927: Warning: dwarf line number information for .data ignored
encrypt.c: /tmp/ccdvOssn.s:928: Warning: dwarf line number information for .data ignored
encrypt.c: /tmp/ccdvOssn.s:939: Warning: dwarf line number information for .data ignored
encrypt.c: /tmp/ccdvOssn.s:946: Warning: dwarf line number information for .data ignored
encrypt.c: /tmp/ccdvOssn.s:949: Warning: dwarf line number information for .data ignored
encrypt.c: /tmp/ccdvOssn.s:950: Warning: dwarf line number information for .data ignored
encrypt.c: /tmp/ccdvOssn.s:957: Warning: dwarf line number information for .data ignored
encrypt.c: /tmp/ccdvOssn.s:958: Warning: dwarf line number information for .data ignored
encrypt.c: /tmp/ccdvOssn.s:961: Warning: dwarf line number information for .data ignored
encrypt.c: /tmp/ccdvOssn.s:963: Warning: dwarf line number information for .data ignored
encrypt.c: /tmp/ccdvOssn.s:966: Warning: dwarf line number information for .data ignored
encrypt.c: /tmp/ccdvOssn.s:974: Warning: dwarf line number information for .data ignored
encrypt.c: /tmp/ccdvOssn.s:985: Warning: dwarf line number information for .data ignored
encrypt.c: /tmp/ccdvOssn.s:987: Warning: dwarf line number information for .data ignored
encrypt.c: /tmp/ccdvOssn.s:989: Warning: dwarf line number information for .data ignored
encrypt.c: /tmp/ccdvOssn.s:990: Warning: dwarf line number information for .data ignored
encrypt.c: /tmp/ccdvOssn.s:991: Warning: dwarf line number information for .data ignored
encrypt.c: /tmp/ccdvOssn.s:1002: Warning: dwarf line number information for .data ignored
encrypt.c: /tmp/ccdvOssn.s:1005: Warning: dwarf line number information for .data ignored
encrypt.c: /tmp/ccdvOssn.s:1008: Warning: dwarf line number information for .data ignored
encrypt.c: /tmp/ccdvOssn.s:1011: Warning: dwarf line number information for .data ignored
encrypt.c: ...
Number of similar (implementation,compiler) pairs: 1, namely:
Implementation | Compiler |
T:avx1 | gcc -march=native -mtune=native -O2 -fwrapv -fPIC -fPIE -gdwarf-4 -Wall (14.2.0) |
Compiler output
encrypt.c: /tmp/ccRASKXu.s: Assembler messages:
encrypt.c: /tmp/ccRASKXu.s:922: Warning: dwarf line number information for .data ignored
encrypt.c: /tmp/ccRASKXu.s:924: Warning: dwarf line number information for .data ignored
encrypt.c: /tmp/ccRASKXu.s:926: Warning: dwarf line number information for .data ignored
encrypt.c: /tmp/ccRASKXu.s:927: Warning: dwarf line number information for .data ignored
encrypt.c: /tmp/ccRASKXu.s:928: Warning: dwarf line number information for .data ignored
encrypt.c: /tmp/ccRASKXu.s:939: Warning: dwarf line number information for .data ignored
encrypt.c: /tmp/ccRASKXu.s:946: Warning: dwarf line number information for .data ignored
encrypt.c: /tmp/ccRASKXu.s:949: Warning: dwarf line number information for .data ignored
encrypt.c: /tmp/ccRASKXu.s:950: Warning: dwarf line number information for .data ignored
encrypt.c: /tmp/ccRASKXu.s:957: Warning: dwarf line number information for .data ignored
encrypt.c: /tmp/ccRASKXu.s:958: Warning: dwarf line number information for .data ignored
encrypt.c: /tmp/ccRASKXu.s:961: Warning: dwarf line number information for .data ignored
encrypt.c: /tmp/ccRASKXu.s:963: Warning: dwarf line number information for .data ignored
encrypt.c: /tmp/ccRASKXu.s:966: Warning: dwarf line number information for .data ignored
encrypt.c: /tmp/ccRASKXu.s:974: Warning: dwarf line number information for .data ignored
encrypt.c: /tmp/ccRASKXu.s:985: Warning: dwarf line number information for .data ignored
encrypt.c: /tmp/ccRASKXu.s:987: Warning: dwarf line number information for .data ignored
encrypt.c: /tmp/ccRASKXu.s:989: Warning: dwarf line number information for .data ignored
encrypt.c: /tmp/ccRASKXu.s:990: Warning: dwarf line number information for .data ignored
encrypt.c: /tmp/ccRASKXu.s:991: Warning: dwarf line number information for .data ignored
encrypt.c: /tmp/ccRASKXu.s:1002: Warning: dwarf line number information for .data ignored
encrypt.c: /tmp/ccRASKXu.s:1005: Warning: dwarf line number information for .data ignored
encrypt.c: /tmp/ccRASKXu.s:1008: Warning: dwarf line number information for .data ignored
encrypt.c: /tmp/ccRASKXu.s:1011: Warning: dwarf line number information for .data ignored
encrypt.c: ...
Number of similar (implementation,compiler) pairs: 1, namely:
Implementation | Compiler |
T:avx1 | gcc -march=native -mtune=native -O3 -fwrapv -fPIC -fPIE -gdwarf-4 -Wall (14.2.0) |
Compiler output
encrypt.c: /tmp/ccSsVQ2k.s: Assembler messages:
encrypt.c: /tmp/ccSsVQ2k.s:921: Warning: dwarf line number information for .data ignored
encrypt.c: /tmp/ccSsVQ2k.s:923: Warning: dwarf line number information for .data ignored
encrypt.c: /tmp/ccSsVQ2k.s:925: Warning: dwarf line number information for .data ignored
encrypt.c: /tmp/ccSsVQ2k.s:926: Warning: dwarf line number information for .data ignored
encrypt.c: /tmp/ccSsVQ2k.s:927: Warning: dwarf line number information for .data ignored
encrypt.c: /tmp/ccSsVQ2k.s:936: Warning: dwarf line number information for .data ignored
encrypt.c: /tmp/ccSsVQ2k.s:938: Warning: dwarf line number information for .data ignored
encrypt.c: /tmp/ccSsVQ2k.s:943: Warning: dwarf line number information for .data ignored
encrypt.c: /tmp/ccSsVQ2k.s:945: Warning: dwarf line number information for .data ignored
encrypt.c: /tmp/ccSsVQ2k.s:948: Warning: dwarf line number information for .data ignored
encrypt.c: /tmp/ccSsVQ2k.s:951: Warning: dwarf line number information for .data ignored
encrypt.c: /tmp/ccSsVQ2k.s:952: Warning: dwarf line number information for .data ignored
encrypt.c: /tmp/ccSsVQ2k.s:959: Warning: dwarf line number information for .data ignored
encrypt.c: /tmp/ccSsVQ2k.s:960: Warning: dwarf line number information for .data ignored
encrypt.c: /tmp/ccSsVQ2k.s:963: Warning: dwarf line number information for .data ignored
encrypt.c: /tmp/ccSsVQ2k.s:965: Warning: dwarf line number information for .data ignored
encrypt.c: /tmp/ccSsVQ2k.s:968: Warning: dwarf line number information for .data ignored
encrypt.c: /tmp/ccSsVQ2k.s:976: Warning: dwarf line number information for .data ignored
encrypt.c: /tmp/ccSsVQ2k.s:986: Warning: dwarf line number information for .data ignored
encrypt.c: /tmp/ccSsVQ2k.s:988: Warning: dwarf line number information for .data ignored
encrypt.c: /tmp/ccSsVQ2k.s:990: Warning: dwarf line number information for .data ignored
encrypt.c: /tmp/ccSsVQ2k.s:991: Warning: dwarf line number information for .data ignored
encrypt.c: /tmp/ccSsVQ2k.s:992: Warning: dwarf line number information for .data ignored
encrypt.c: /tmp/ccSsVQ2k.s:1001: Warning: dwarf line number information for .data ignored
encrypt.c: ...
Number of similar (implementation,compiler) pairs: 1, namely:
Implementation | Compiler |
T:avx1 | gcc -march=native -mtune=native -Os -fwrapv -fPIC -fPIE -gdwarf-4 -Wall (14.2.0) |
Compiler output
try.c: /usr/bin/ld: libcrypto_aead_omdsha256k128n96tau96v1.a(omdsha256.o):.../supercop-data/avx/amd64/try/c/clang_-march=native_-O2_-fwrapv_-Qunused-arguments_-fPIC_-fPIE_-gdwarf-4_-Wall/timingleaks/crypto_aead/omdsha256k128n96tau96v1/sse4/work/./omdsha256.h:137: multiple definition of `Hash'; libcrypto_aead_omdsha256k128n96tau96v1.a(encrypt.o):.../supercop-data/avx/amd64/try/c/clang_-march=native_-O2_-fwrapv_-Qunused-arguments_-fPIC_-fPIE_-gdwarf-4_-Wall/timingleaks/crypto_aead/omdsha256k128n96tau96v1/sse4/work/./omdsha256.h:137: first defined here
try.c: clang: error: linker command failed with exit code 1 (use -v to see invocation)
Number of similar (implementation,compiler) pairs: 1, namely:
Implementation | Compiler |
T:sse4 | clang -march=native -O2 -fwrapv -Qunused-arguments -fPIC -fPIE -gdwarf-4 -Wall (Ubuntu_Clang_19.1.1_(1ubuntu1)) |
Compiler output
try.c: /usr/bin/ld: libcrypto_aead_omdsha256k128n96tau96v1.a(omdsha256.o):.../supercop-data/avx/amd64/try/c/clang_-march=native_-O3_-fwrapv_-Qunused-arguments_-fPIC_-fPIE_-gdwarf-4_-Wall/timingleaks/crypto_aead/omdsha256k128n96tau96v1/sse4/work/./omdsha256.h:137: multiple definition of `Hash'; libcrypto_aead_omdsha256k128n96tau96v1.a(encrypt.o):.../supercop-data/avx/amd64/try/c/clang_-march=native_-O3_-fwrapv_-Qunused-arguments_-fPIC_-fPIE_-gdwarf-4_-Wall/timingleaks/crypto_aead/omdsha256k128n96tau96v1/sse4/work/./omdsha256.h:137: first defined here
try.c: clang: error: linker command failed with exit code 1 (use -v to see invocation)
Number of similar (implementation,compiler) pairs: 1, namely:
Implementation | Compiler |
T:sse4 | clang -march=native -O3 -fwrapv -Qunused-arguments -fPIC -fPIE -gdwarf-4 -Wall (Ubuntu_Clang_19.1.1_(1ubuntu1)) |
Compiler output
try.c: /usr/bin/ld: libcrypto_aead_omdsha256k128n96tau96v1.a(omdsha256.o):.../supercop-data/avx/amd64/try/c/clang_-march=native_-Os_-fwrapv_-Qunused-arguments_-fPIC_-fPIE_-gdwarf-4_-Wall/timingleaks/crypto_aead/omdsha256k128n96tau96v1/sse4/work/./omdsha256.h:137: multiple definition of `Hash'; libcrypto_aead_omdsha256k128n96tau96v1.a(encrypt.o):.../supercop-data/avx/amd64/try/c/clang_-march=native_-Os_-fwrapv_-Qunused-arguments_-fPIC_-fPIE_-gdwarf-4_-Wall/timingleaks/crypto_aead/omdsha256k128n96tau96v1/sse4/work/./omdsha256.h:137: first defined here
try.c: clang: error: linker command failed with exit code 1 (use -v to see invocation)
Number of similar (implementation,compiler) pairs: 1, namely:
Implementation | Compiler |
T:sse4 | clang -march=native -Os -fwrapv -Qunused-arguments -fPIC -fPIE -gdwarf-4 -Wall (Ubuntu_Clang_19.1.1_(1ubuntu1)) |
Compiler output
encrypt.c: /tmp/cc5rXBwJ.s: Assembler messages:
encrypt.c: /tmp/cc5rXBwJ.s:961: Warning: dwarf line number information for .data ignored
encrypt.c: /tmp/cc5rXBwJ.s:963: Warning: dwarf line number information for .data ignored
encrypt.c: /tmp/cc5rXBwJ.s:965: Warning: dwarf line number information for .data ignored
encrypt.c: /tmp/cc5rXBwJ.s:966: Warning: dwarf line number information for .data ignored
encrypt.c: /tmp/cc5rXBwJ.s:967: Warning: dwarf line number information for .data ignored
encrypt.c: /tmp/cc5rXBwJ.s:978: Warning: dwarf line number information for .data ignored
encrypt.c: /tmp/cc5rXBwJ.s:985: Warning: dwarf line number information for .data ignored
encrypt.c: /tmp/cc5rXBwJ.s:988: Warning: dwarf line number information for .data ignored
encrypt.c: /tmp/cc5rXBwJ.s:989: Warning: dwarf line number information for .data ignored
encrypt.c: /tmp/cc5rXBwJ.s:996: Warning: dwarf line number information for .data ignored
encrypt.c: /tmp/cc5rXBwJ.s:997: Warning: dwarf line number information for .data ignored
encrypt.c: /tmp/cc5rXBwJ.s:1000: Warning: dwarf line number information for .data ignored
encrypt.c: /tmp/cc5rXBwJ.s:1002: Warning: dwarf line number information for .data ignored
encrypt.c: /tmp/cc5rXBwJ.s:1005: Warning: dwarf line number information for .data ignored
encrypt.c: /tmp/cc5rXBwJ.s:1013: Warning: dwarf line number information for .data ignored
encrypt.c: /tmp/cc5rXBwJ.s:1024: Warning: dwarf line number information for .data ignored
encrypt.c: /tmp/cc5rXBwJ.s:1026: Warning: dwarf line number information for .data ignored
encrypt.c: /tmp/cc5rXBwJ.s:1028: Warning: dwarf line number information for .data ignored
encrypt.c: /tmp/cc5rXBwJ.s:1029: Warning: dwarf line number information for .data ignored
encrypt.c: /tmp/cc5rXBwJ.s:1030: Warning: dwarf line number information for .data ignored
encrypt.c: /tmp/cc5rXBwJ.s:1041: Warning: dwarf line number information for .data ignored
encrypt.c: /tmp/cc5rXBwJ.s:1044: Warning: dwarf line number information for .data ignored
encrypt.c: /tmp/cc5rXBwJ.s:1047: Warning: dwarf line number information for .data ignored
encrypt.c: /tmp/cc5rXBwJ.s:1050: Warning: dwarf line number information for .data ignored
encrypt.c: ...
Number of similar (implementation,compiler) pairs: 1, namely:
Implementation | Compiler |
T:sse4 | gcc -march=native -mtune=native -O2 -fwrapv -fPIC -fPIE -gdwarf-4 -Wall (14.2.0) |
Compiler output
encrypt.c: /tmp/ccvoTmU3.s: Assembler messages:
encrypt.c: /tmp/ccvoTmU3.s:961: Warning: dwarf line number information for .data ignored
encrypt.c: /tmp/ccvoTmU3.s:963: Warning: dwarf line number information for .data ignored
encrypt.c: /tmp/ccvoTmU3.s:965: Warning: dwarf line number information for .data ignored
encrypt.c: /tmp/ccvoTmU3.s:966: Warning: dwarf line number information for .data ignored
encrypt.c: /tmp/ccvoTmU3.s:967: Warning: dwarf line number information for .data ignored
encrypt.c: /tmp/ccvoTmU3.s:978: Warning: dwarf line number information for .data ignored
encrypt.c: /tmp/ccvoTmU3.s:985: Warning: dwarf line number information for .data ignored
encrypt.c: /tmp/ccvoTmU3.s:988: Warning: dwarf line number information for .data ignored
encrypt.c: /tmp/ccvoTmU3.s:989: Warning: dwarf line number information for .data ignored
encrypt.c: /tmp/ccvoTmU3.s:996: Warning: dwarf line number information for .data ignored
encrypt.c: /tmp/ccvoTmU3.s:997: Warning: dwarf line number information for .data ignored
encrypt.c: /tmp/ccvoTmU3.s:1000: Warning: dwarf line number information for .data ignored
encrypt.c: /tmp/ccvoTmU3.s:1002: Warning: dwarf line number information for .data ignored
encrypt.c: /tmp/ccvoTmU3.s:1005: Warning: dwarf line number information for .data ignored
encrypt.c: /tmp/ccvoTmU3.s:1013: Warning: dwarf line number information for .data ignored
encrypt.c: /tmp/ccvoTmU3.s:1024: Warning: dwarf line number information for .data ignored
encrypt.c: /tmp/ccvoTmU3.s:1026: Warning: dwarf line number information for .data ignored
encrypt.c: /tmp/ccvoTmU3.s:1028: Warning: dwarf line number information for .data ignored
encrypt.c: /tmp/ccvoTmU3.s:1029: Warning: dwarf line number information for .data ignored
encrypt.c: /tmp/ccvoTmU3.s:1030: Warning: dwarf line number information for .data ignored
encrypt.c: /tmp/ccvoTmU3.s:1041: Warning: dwarf line number information for .data ignored
encrypt.c: /tmp/ccvoTmU3.s:1044: Warning: dwarf line number information for .data ignored
encrypt.c: /tmp/ccvoTmU3.s:1047: Warning: dwarf line number information for .data ignored
encrypt.c: /tmp/ccvoTmU3.s:1050: Warning: dwarf line number information for .data ignored
encrypt.c: ...
Number of similar (implementation,compiler) pairs: 1, namely:
Implementation | Compiler |
T:sse4 | gcc -march=native -mtune=native -O3 -fwrapv -fPIC -fPIE -gdwarf-4 -Wall (14.2.0) |
Compiler output
encrypt.c: /tmp/ccQQAOia.s: Assembler messages:
encrypt.c: /tmp/ccQQAOia.s:960: Warning: dwarf line number information for .data ignored
encrypt.c: /tmp/ccQQAOia.s:962: Warning: dwarf line number information for .data ignored
encrypt.c: /tmp/ccQQAOia.s:964: Warning: dwarf line number information for .data ignored
encrypt.c: /tmp/ccQQAOia.s:965: Warning: dwarf line number information for .data ignored
encrypt.c: /tmp/ccQQAOia.s:966: Warning: dwarf line number information for .data ignored
encrypt.c: /tmp/ccQQAOia.s:975: Warning: dwarf line number information for .data ignored
encrypt.c: /tmp/ccQQAOia.s:977: Warning: dwarf line number information for .data ignored
encrypt.c: /tmp/ccQQAOia.s:982: Warning: dwarf line number information for .data ignored
encrypt.c: /tmp/ccQQAOia.s:984: Warning: dwarf line number information for .data ignored
encrypt.c: /tmp/ccQQAOia.s:987: Warning: dwarf line number information for .data ignored
encrypt.c: /tmp/ccQQAOia.s:990: Warning: dwarf line number information for .data ignored
encrypt.c: /tmp/ccQQAOia.s:991: Warning: dwarf line number information for .data ignored
encrypt.c: /tmp/ccQQAOia.s:998: Warning: dwarf line number information for .data ignored
encrypt.c: /tmp/ccQQAOia.s:999: Warning: dwarf line number information for .data ignored
encrypt.c: /tmp/ccQQAOia.s:1002: Warning: dwarf line number information for .data ignored
encrypt.c: /tmp/ccQQAOia.s:1004: Warning: dwarf line number information for .data ignored
encrypt.c: /tmp/ccQQAOia.s:1007: Warning: dwarf line number information for .data ignored
encrypt.c: /tmp/ccQQAOia.s:1015: Warning: dwarf line number information for .data ignored
encrypt.c: /tmp/ccQQAOia.s:1025: Warning: dwarf line number information for .data ignored
encrypt.c: /tmp/ccQQAOia.s:1027: Warning: dwarf line number information for .data ignored
encrypt.c: /tmp/ccQQAOia.s:1029: Warning: dwarf line number information for .data ignored
encrypt.c: /tmp/ccQQAOia.s:1030: Warning: dwarf line number information for .data ignored
encrypt.c: /tmp/ccQQAOia.s:1031: Warning: dwarf line number information for .data ignored
encrypt.c: /tmp/ccQQAOia.s:1040: Warning: dwarf line number information for .data ignored
encrypt.c: ...
Number of similar (implementation,compiler) pairs: 1, namely:
Implementation | Compiler |
T:sse4 | gcc -march=native -mtune=native -Os -fwrapv -fPIC -fPIE -gdwarf-4 -Wall (14.2.0) |
Namespace violations
omdsha256.o calc_L_i T
omdsha256.o double_block T
omdsha256.o final_masking_associated_data T
omdsha256.o final_masking_message T
omdsha256.o hash T
omdsha256.o increment_masking_associated_data T
omdsha256.o increment_masking_message T
omdsha256.o key_func T
omdsha256.o l2b T
omdsha256.o ntz T
omdsha256.o omdsha256_process T
omdsha256.o triple_block T
omdsha256.o xor_block T
sha256.o sha256_comp T
Number of similar (implementation,compiler) pairs: 6, namely:
Implementation | Compiler |
T:ref | clang -march=native -O2 -fwrapv -Qunused-arguments -fPIC -fPIE -gdwarf-4 -Wall (Ubuntu_Clang_19.1.1_(1ubuntu1)) |
T:ref | clang -march=native -O3 -fwrapv -Qunused-arguments -fPIC -fPIE -gdwarf-4 -Wall (Ubuntu_Clang_19.1.1_(1ubuntu1)) |
T:ref | clang -march=native -Os -fwrapv -Qunused-arguments -fPIC -fPIE -gdwarf-4 -Wall (Ubuntu_Clang_19.1.1_(1ubuntu1)) |
T:ref | gcc -march=native -mtune=native -O2 -fwrapv -fPIC -fPIE -gdwarf-4 -Wall (14.2.0) |
T:ref | gcc -march=native -mtune=native -O3 -fwrapv -fPIC -fPIE -gdwarf-4 -Wall (14.2.0) |
T:ref | gcc -march=native -mtune=native -Os -fwrapv -fPIC -fPIE -gdwarf-4 -Wall (14.2.0) |