Implementation notes: amd64, hertz, crypto_aead/morus1280256v1

Computer: hertz
Microarchitecture: amd64; Zen 4 (a60f12)
Architecture: amd64
CPU ID: AuthenticAMD-00a60f12-178bfbff
SUPERCOP version: 20240107
Operation: crypto_aead
Primitive: morus1280256v1
TimeObject sizeTest sizeImplementationCompilerBenchmark dateSUPERCOP version
37056977 0 024819 844 1096T:avx2clang-17_-march=native_-O3_-fomit-frame-pointer_-fwrapv_-Qunused-arguments_-fPIC_-fPIE2023122020231217
37365009 0 022723 844 1096T:avx2clang-17_-march=native_-O2_-fomit-frame-pointer_-fwrapv_-Qunused-arguments_-fPIC_-fPIE2023122020231217
38144214 0 019132 836 1096T:avx2clang-17_-march=native_-Os_-fomit-frame-pointer_-fwrapv_-Qunused-arguments_-fPIC_-fPIE2023122020231217
39408622 0 026331 844 1096T:sse2clang-17_-march=native_-O2_-fomit-frame-pointer_-fwrapv_-Qunused-arguments_-fPIC_-fPIE2023122020231217
39748622 0 026459 844 1096T:sse2clang-17_-march=native_-O3_-fomit-frame-pointer_-fwrapv_-Qunused-arguments_-fPIC_-fPIE2023122020231217
39866136 0 023404 812 1160T:avx2gcc_-march=native_-mtune=native_-O3_-fomit-frame-pointer_-fwrapv_-fPIC_-fPIE2023122020231217
41793903 0 019156 812 1096T:avx2gcc_-march=native_-mtune=native_-O2_-fomit-frame-pointer_-fwrapv_-fPIC_-fPIE2023122020231217
75252942 0 017860 836 1096T:sse2clang-17_-march=native_-Os_-fomit-frame-pointer_-fwrapv_-Qunused-arguments_-fPIC_-fPIE2023122020231217
80686669 0 023924 812 1160T:sse2gcc_-march=native_-mtune=native_-O3_-fomit-frame-pointer_-fwrapv_-fPIC_-fPIE2023122020231217
835615751 0 033028 812 1160T:ref64gcc_-march=native_-mtune=native_-O3_-fomit-frame-pointer_-fwrapv_-fPIC_-fPIE2023122020231217
846612317 0 029564 812 1160T:refgcc_-march=native_-mtune=native_-O3_-fomit-frame-pointer_-fwrapv_-fPIC_-fPIE2023122020231217
85013676 0 018932 812 1096T:sse2gcc_-march=native_-mtune=native_-O2_-fomit-frame-pointer_-fwrapv_-fPIC_-fPIE2023122020231217
128266004 0 023747 844 1096T:ref64clang-17_-march=native_-O2_-fomit-frame-pointer_-fwrapv_-Qunused-arguments_-fPIC_-fPIE2023122020231217
129505110 0 020092 836 1096T:ref64clang-17_-march=native_-Os_-fomit-frame-pointer_-fwrapv_-Qunused-arguments_-fPIC_-fPIE2023122020231217
130126004 0 023875 844 1096T:ref64clang-17_-march=native_-O3_-fomit-frame-pointer_-fwrapv_-Qunused-arguments_-fPIC_-fPIE2023122020231217
146805504 0 019055 788 1064T:ref64gcc_-march=native_-mtune=native_-Os_-fomit-frame-pointer_-fwrapv_-fPIC_-fPIE2023122020231217
154266022 0 021300 812 1096T:ref64gcc_-march=native_-mtune=native_-O2_-fomit-frame-pointer_-fwrapv_-fPIC_-fPIE2023122020231217

Compiler output

Implementation: T:avx2
Security model: timingleaks
Compiler: gcc -march=native -mtune=native -Os -fomit-frame-pointer -fwrapv -fPIC -fPIE
try.c: /usr/bin/ld: libcrypto_aead_morus1280256v1.a(morus1280256v1avx2.o): in function `crypto_aead_morus1280256v1_avx2_timingleaks_encrypt':
try.c: morus1280256v1avx2.c:(.text+0x...): undefined reference to `morus_enc_aut_step'
try.c: /usr/bin/ld: morus1280256v1avx2.c:(.text+0x...): undefined reference to `morus_enc_aut_step'
try.c: /usr/bin/ld: libcrypto_aead_morus1280256v1.a(morus1280256v1avx2.o): in function `crypto_aead_morus1280256v1_avx2_timingleaks_decrypt':
try.c: morus1280256v1avx2.c:(.text+0x...): undefined reference to `morus_enc_aut_step'
try.c: /usr/bin/ld: morus1280256v1avx2.c:(.text+0x...): undefined reference to `morus_dec_aut_step'
try.c: collect2: error: ld returned 1 exit status

Number of similar (compiler,implementation) pairs: 1, namely:
CompilerImplementations
gcc -march=native -mtune=native -Os -fomit-frame-pointer -fwrapv -fPIC -fPIE T:avx2

Compiler output

Implementation: T:ref
Security model: timingleaks
Compiler: clang-17 -march=native -O2 -fomit-frame-pointer -fwrapv -Qunused-arguments -fPIC -fPIE
try.c: /usr/bin/ld: libcrypto_aead_morus1280256v1.a(encrypt.o): in function `morus_initialization':
try.c: encrypt.c:(.text+0x...): undefined reference to `morus_stateupdate'
try.c: /usr/bin/ld: encrypt.c:(.text+0x...): undefined reference to `morus_stateupdate'
try.c: /usr/bin/ld: encrypt.c:(.text+0x...): undefined reference to `morus_stateupdate'
try.c: /usr/bin/ld: encrypt.c:(.text+0x...): undefined reference to `morus_stateupdate'
try.c: /usr/bin/ld: encrypt.c:(.text+0x...): undefined reference to `morus_stateupdate'
try.c: /usr/bin/ld: libcrypto_aead_morus1280256v1.a(encrypt.o):encrypt.c:(.text+0x...): more undefined references to `morus_stateupdate' follow
try.c: clang-17: error: linker command failed with exit code 1 (use -v to see invocation)

Number of similar (compiler,implementation) pairs: 2, namely:
CompilerImplementations
clang-17 -march=native -O2 -fomit-frame-pointer -fwrapv -Qunused-arguments -fPIC -fPIE T:ref
clang-17 -march=native -O3 -fomit-frame-pointer -fwrapv -Qunused-arguments -fPIC -fPIE T:ref

Compiler output

Implementation: T:ref
Security model: timingleaks
Compiler: clang-17 -march=native -Os -fomit-frame-pointer -fwrapv -Qunused-arguments -fPIC -fPIE
try.c: /usr/bin/ld: libcrypto_aead_morus1280256v1.a(encrypt.o): in function `morus_initialization':
try.c: encrypt.c:(.text+0x...): undefined reference to `morus_stateupdate'
try.c: /usr/bin/ld: libcrypto_aead_morus1280256v1.a(encrypt.o): in function `morus_tag_generation':
try.c: encrypt.c:(.text+0x...): undefined reference to `morus_stateupdate'
try.c: /usr/bin/ld: libcrypto_aead_morus1280256v1.a(encrypt.o): in function `morus_tag_verification':
try.c: encrypt.c:(.text+0x...): undefined reference to `morus_stateupdate'
try.c: /usr/bin/ld: libcrypto_aead_morus1280256v1.a(encrypt.o): in function `morus_enc_aut_partialblock':
try.c: encrypt.c:(.text+0x...): undefined reference to `morus_stateupdate'
try.c: /usr/bin/ld: libcrypto_aead_morus1280256v1.a(encrypt.o): in function `morus_dec_aut_partialblock':
try.c: encrypt.c:(.text+0x...): undefined reference to `morus_stateupdate'
try.c: clang-17: error: linker command failed with exit code 1 (use -v to see invocation)

Number of similar (compiler,implementation) pairs: 1, namely:
CompilerImplementations
clang-17 -march=native -Os -fomit-frame-pointer -fwrapv -Qunused-arguments -fPIC -fPIE T:ref

Compiler output

Implementation: T:ref
Security model: timingleaks
Compiler: gcc -march=native -mtune=native -O2 -fomit-frame-pointer -fwrapv -fPIC -fPIE
try.c: /usr/bin/ld: libcrypto_aead_morus1280256v1.a(encrypt.o): in function `morus_initialization':
try.c: encrypt.c:(.text+0x...): undefined reference to `morus_stateupdate'
try.c: /usr/bin/ld: libcrypto_aead_morus1280256v1.a(encrypt.o): in function `morus_tag_generation':
try.c: encrypt.c:(.text+0x...): undefined reference to `morus_stateupdate'
try.c: /usr/bin/ld: libcrypto_aead_morus1280256v1.a(encrypt.o): in function `morus_tag_verification':
try.c: encrypt.c:(.text+0x...): undefined reference to `morus_stateupdate'
try.c: /usr/bin/ld: libcrypto_aead_morus1280256v1.a(encrypt.o): in function `morus_enc_aut_partialblock':
try.c: encrypt.c:(.text+0x...): undefined reference to `morus_stateupdate'
try.c: /usr/bin/ld: libcrypto_aead_morus1280256v1.a(encrypt.o): in function `morus_dec_aut_partialblock':
try.c: encrypt.c:(.text+0x...): undefined reference to `morus_stateupdate'
try.c: /usr/bin/ld: libcrypto_aead_morus1280256v1.a(encrypt.o):encrypt.c:(.text+0x...): more undefined references to `morus_stateupdate' follow
try.c: collect2: error: ld returned 1 exit status

Number of similar (compiler,implementation) pairs: 1, namely:
CompilerImplementations
gcc -march=native -mtune=native -O2 -fomit-frame-pointer -fwrapv -fPIC -fPIE T:ref

Compiler output

Implementation: T:ref
Security model: timingleaks
Compiler: gcc -march=native -mtune=native -Os -fomit-frame-pointer -fwrapv -fPIC -fPIE
try.c: /usr/bin/ld: libcrypto_aead_morus1280256v1.a(encrypt.o): in function `morus_initialization':
try.c: encrypt.c:(.text+0x...): undefined reference to `morus_stateupdate'
try.c: /usr/bin/ld: libcrypto_aead_morus1280256v1.a(encrypt.o): in function `morus_tag_generation':
try.c: encrypt.c:(.text+0x...): undefined reference to `morus_stateupdate'
try.c: /usr/bin/ld: libcrypto_aead_morus1280256v1.a(encrypt.o): in function `morus_tag_verification':
try.c: encrypt.c:(.text+0x...): undefined reference to `morus_stateupdate'
try.c: /usr/bin/ld: libcrypto_aead_morus1280256v1.a(encrypt.o): in function `morus_enc_aut_partialblock':
try.c: encrypt.c:(.text+0x...): undefined reference to `morus_stateupdate'
try.c: /usr/bin/ld: libcrypto_aead_morus1280256v1.a(encrypt.o): in function `morus_dec_aut_partialblock':
try.c: encrypt.c:(.text+0x...): undefined reference to `morus_stateupdate'
try.c: /usr/bin/ld: libcrypto_aead_morus1280256v1.a(encrypt.o): in function `crypto_aead_morus1280256v1_ref_timingleaks_encrypt':
try.c: encrypt.c:(.text+0x...): undefined reference to `morus_enc_aut_step'
try.c: /usr/bin/ld: encrypt.c:(.text+0x...): undefined reference to `morus_enc_aut_step'
try.c: /usr/bin/ld: libcrypto_aead_morus1280256v1.a(encrypt.o): in function `crypto_aead_morus1280256v1_ref_timingleaks_decrypt':
try.c: encrypt.c:(.text+0x...): undefined reference to `morus_enc_aut_step'
try.c: /usr/bin/ld: encrypt.c:(.text+0x...): undefined reference to `morus_dec_aut_step'
try.c: collect2: error: ld returned 1 exit status

Number of similar (compiler,implementation) pairs: 1, namely:
CompilerImplementations
gcc -march=native -mtune=native -Os -fomit-frame-pointer -fwrapv -fPIC -fPIE T:ref

Compiler output

Implementation: T:sse2
Security model: timingleaks
Compiler: gcc -march=native -mtune=native -Os -fomit-frame-pointer -fwrapv -fPIC -fPIE
try.c: /usr/bin/ld: libcrypto_aead_morus1280256v1.a(morus1280256v1sse2.o): in function `crypto_aead_morus1280256v1_sse2_timingleaks_encrypt':
try.c: morus1280256v1sse2.c:(.text+0x...): undefined reference to `morus_enc_aut_step'
try.c: /usr/bin/ld: morus1280256v1sse2.c:(.text+0x...): undefined reference to `morus_enc_aut_step'
try.c: /usr/bin/ld: libcrypto_aead_morus1280256v1.a(morus1280256v1sse2.o): in function `crypto_aead_morus1280256v1_sse2_timingleaks_decrypt':
try.c: morus1280256v1sse2.c:(.text+0x...): undefined reference to `morus_enc_aut_step'
try.c: /usr/bin/ld: morus1280256v1sse2.c:(.text+0x...): undefined reference to `morus_dec_aut_step'
try.c: collect2: error: ld returned 1 exit status

Number of similar (compiler,implementation) pairs: 1, namely:
CompilerImplementations
gcc -march=native -mtune=native -Os -fomit-frame-pointer -fwrapv -fPIC -fPIE T:sse2