Test results for amd64, hertz, crypto_aead/ascon128v12

[Page version: 20261007 20:07:58]

Measurements for amd64, hertz, crypto_aead Test results for amd64, hertz, crypto_aead Test results for crypto_aead/ascon128v12
Computer: hertz
Microarchitecture: amd64; Zen 4 (a60f12)
Architecture: amd64
CPU ID: AuthenticAMD-00a60f12-178bfbff
SUPERCOP version: 20261004
Operation: crypto_aead
Primitive: ascon128v12
TimeObject sizeTest sizeImplementationCompilerBenchmark dateSUPERCOP version
4753914486 0 046595 1288 1696opt64clang -march=native -O2 -fwrapv -Qunused-arguments -fPIC -fPIE -gdwarf-4 -Wall2026100620261004
4753914486 0 048003 1288 1696opt64clang -march=native -O3 -fwrapv -Qunused-arguments -fPIC -fPIE -gdwarf-4 -Wall2026100620261004
4753914436 0 040749 1280 1696opt64clang -march=native -Os -fwrapv -Qunused-arguments -fPIC -fPIE -gdwarf-4 -Wall2026100620261004
5179714263 0 039763 1288 1632opt64clang -march=native -O -fwrapv -Qunused-arguments -fPIC -fPIE -gdwarf-4 -Wall2026100620261004
5488615244 0 042350 1256 1792opt64gcc -march=native -mtune=native -O2 -fwrapv -fPIC -fPIE -gdwarf-4 -Wall2026100620261004
5492320030 0 050870 1256 1792refgcc -march=native -mtune=native -O3 -fwrapv -fPIC -fPIE -gdwarf-4 -Wall2026100620261004
5566215260 0 046030 1256 1792opt64gcc -march=native -mtune=native -O3 -fwrapv -fPIC -fPIE -gdwarf-4 -Wall2026100620261004
611541418 0 026875 1288 1632opt64_lowsizeclang -march=native -O -fwrapv -Qunused-arguments -fPIC -fPIE -gdwarf-4 -Wall2026100620261004
629211869 0 033987 1288 1696opt64_lowsizeclang -march=native -O2 -fwrapv -Qunused-arguments -fPIC -fPIE -gdwarf-4 -Wall2026100620261004
630712052 0 035595 1288 1696opt64_lowsizeclang -march=native -O3 -fwrapv -Qunused-arguments -fPIC -fPIE -gdwarf-4 -Wall2026100620261004
664301445 0 027693 1280 1696opt64_lowsizeclang -march=native -Os -fwrapv -Qunused-arguments -fPIC -fPIE -gdwarf-4 -Wall2026100620261004
6692712522 0 039662 1256 1792refgcc -march=native -mtune=native -O2 -fwrapv -fPIC -fPIE -gdwarf-4 -Wall2026100620261004
669501763 0 026873 1232 1696opt64_lowsizegcc -march=native -mtune=native -Os -fwrapv -fPIC -fPIE -gdwarf-4 -Wall2026100620261004
6712011174 0 038085 1248 1728refgcc -march=native -mtune=native -O -fwrapv -fPIC -fPIE -gdwarf-4 -Wall2026100620261004
6844017809 0 044685 1248 1728opt64gcc -march=native -mtune=native -O -fwrapv -fPIC -fPIE -gdwarf-4 -Wall2026100620261004
688287012 0 040171 1288 1696refclang -march=native -O3 -fwrapv -Qunused-arguments -fPIC -fPIE -gdwarf-4 -Wall2026100620261004
688366980 0 038763 1288 1696refclang -march=native -O2 -fwrapv -Qunused-arguments -fPIC -fPIE -gdwarf-4 -Wall2026100620261004
688962352 0 032974 1256 1792opt64_lowsizegcc -march=native -mtune=native -O3 -fwrapv -fPIC -fPIE -gdwarf-4 -Wall2026100620261004
694182077 0 029102 1256 1792opt64_lowsizegcc -march=native -mtune=native -O2 -fwrapv -fPIC -fPIE -gdwarf-4 -Wall2026100620261004
703525175 0 030659 1288 1632refclang -march=native -O -fwrapv -Qunused-arguments -fPIC -fPIE -gdwarf-4 -Wall2026100620261004
703537528 0 033773 1280 1696refclang -march=native -Os -fwrapv -Qunused-arguments -fPIC -fPIE -gdwarf-4 -Wall2026100620261004
7132220079 0 047150 1256 1792opt32gcc -march=native -mtune=native -O2 -fwrapv -fPIC -fPIE -gdwarf-4 -Wall2026100620261004
7133220079 0 050830 1256 1792opt32gcc -march=native -mtune=native -O3 -fwrapv -fPIC -fPIE -gdwarf-4 -Wall2026100620261004
721873140 0 029925 1248 1728opt64_lowsizegcc -march=native -mtune=native -O -fwrapv -fPIC -fPIE -gdwarf-4 -Wall2026100620261004
736922410 0 033046 1256 1792opt32_lowsizegcc -march=native -mtune=native -O3 -fwrapv -fPIC -fPIE -gdwarf-4 -Wall2026100620261004
743932135 0 029174 1256 1792opt32_lowsizegcc -march=native -mtune=native -O2 -fwrapv -fPIC -fPIE -gdwarf-4 -Wall2026100620261004
7535917798 0 043283 1288 1632opt32clang -march=native -O -fwrapv -Qunused-arguments -fPIC -fPIE -gdwarf-4 -Wall2026100620261004
7633426921 0 052121 1232 1696opt32gcc -march=native -mtune=native -Os -fwrapv -fPIC -fPIE -gdwarf-4 -Wall2026100620261004
774751457 0 026939 1288 1632opt32_lowsizeclang -march=native -O -fwrapv -Qunused-arguments -fPIC -fPIE -gdwarf-4 -Wall2026100620261004
7756821897 0 047065 1232 1696opt64gcc -march=native -mtune=native -Os -fwrapv -fPIC -fPIE -gdwarf-4 -Wall2026100620261004
7997422599 0 049485 1248 1728opt32gcc -march=native -mtune=native -O -fwrapv -fPIC -fPIE -gdwarf-4 -Wall2026100620261004
855023198 0 029989 1248 1728opt32_lowsizegcc -march=native -mtune=native -O -fwrapv -fPIC -fPIE -gdwarf-4 -Wall2026100620261004
868651891 0 027049 1232 1696opt32_lowsizegcc -march=native -mtune=native -Os -fwrapv -fPIC -fPIE -gdwarf-4 -Wall2026100620261004
913872590 0 027921 1232 1696refgcc -march=native -mtune=native -Os -fwrapv -fPIC -fPIE -gdwarf-4 -Wall2026100620261004
10364719056 0 050955 1288 1696opt32clang -march=native -O2 -fwrapv -Qunused-arguments -fPIC -fPIE -gdwarf-4 -Wall2026100620261004
10409419080 0 052363 1288 1696opt32clang -march=native -O3 -fwrapv -Qunused-arguments -fPIC -fPIE -gdwarf-4 -Wall2026100620261004
10454019012 0 045109 1280 1696opt32clang -march=native -Os -fwrapv -Qunused-arguments -fPIC -fPIE -gdwarf-4 -Wall2026100620261004
1342432204 0 035715 1288 1696opt32_lowsizeclang -march=native -O3 -fwrapv -Qunused-arguments -fPIC -fPIE -gdwarf-4 -Wall2026100620261004
1342772021 0 034171 1288 1696opt32_lowsizeclang -march=native -O2 -fwrapv -Qunused-arguments -fPIC -fPIE -gdwarf-4 -Wall2026100620261004
1351071582 0 027757 1280 1696opt32_lowsizeclang -march=native -Os -fwrapv -Qunused-arguments -fPIC -fPIE -gdwarf-4 -Wall2026100620261004
14452513127 0 038257 1232 1696bi32gcc -march=native -mtune=native -Os -fwrapv -fPIC -fPIE -gdwarf-4 -Wall2026100620261004
14658512148 0 038405 1280 1696bi32clang -march=native -Os -fwrapv -Qunused-arguments -fPIC -fPIE -gdwarf-4 -Wall2026100620261004
14687111988 0 044059 1288 1696bi32clang -march=native -O2 -fwrapv -Qunused-arguments -fPIC -fPIE -gdwarf-4 -Wall2026100620261004
14687111988 0 045467 1288 1696bi32clang -march=native -O3 -fwrapv -Qunused-arguments -fPIC -fPIE -gdwarf-4 -Wall2026100620261004
14739713778 0 044374 1256 1792bi32gcc -march=native -mtune=native -O3 -fwrapv -fPIC -fPIE -gdwarf-4 -Wall2026100620261004
14772713778 0 040822 1256 1792bi32gcc -march=native -mtune=native -O2 -fwrapv -fPIC -fPIE -gdwarf-4 -Wall2026100620261004
14814812544 0 038059 1288 1632bi32clang -march=native -O -fwrapv -Qunused-arguments -fPIC -fPIE -gdwarf-4 -Wall2026100620261004
1593798337 0 034733 1280 1696bi32_lowregclang -march=native -Os -fwrapv -Qunused-arguments -fPIC -fPIE -gdwarf-4 -Wall2026100620261004
1599498594 0 034171 1288 1632bi32_lowregclang -march=native -O -fwrapv -Qunused-arguments -fPIC -fPIE -gdwarf-4 -Wall2026100620261004
1610432544 0 027585 1232 1696bi32_lowsizegcc -march=native -mtune=native -Os -fwrapv -fPIC -fPIE -gdwarf-4 -Wall2026100620261004
1610882270 0 028533 1280 1696bi32_lowsizeclang -march=native -Os -fwrapv -Qunused-arguments -fPIC -fPIE -gdwarf-4 -Wall2026100620261004
1620188367 0 041899 1288 1696bi32_lowregclang -march=native -O3 -fwrapv -Qunused-arguments -fPIC -fPIE -gdwarf-4 -Wall2026100620261004
1620278351 0 040555 1288 1696bi32_lowregclang -march=native -O2 -fwrapv -Qunused-arguments -fPIC -fPIE -gdwarf-4 -Wall2026100620261004
1625742277 0 034371 1288 1696bi32_lowsizeclang -march=native -O2 -fwrapv -Qunused-arguments -fPIC -fPIE -gdwarf-4 -Wall2026100620261004
1629772479 0 035971 1288 1696bi32_lowsizeclang -march=native -O3 -fwrapv -Qunused-arguments -fPIC -fPIE -gdwarf-4 -Wall2026100620261004
1669469080 0 036182 1256 1792bi32_lowreggcc -march=native -mtune=native -O2 -fwrapv -fPIC -fPIE -gdwarf-4 -Wall2026100620261004
1676639072 0 039790 1256 1792bi32_lowreggcc -march=native -mtune=native -O3 -fwrapv -fPIC -fPIE -gdwarf-4 -Wall2026100620261004
16773210683 0 037525 1248 1728bi32_lowreggcc -march=native -mtune=native -O -fwrapv -fPIC -fPIE -gdwarf-4 -Wall2026100620261004
1691423220 0 033750 1256 1792bi32_lowsizegcc -march=native -mtune=native -O3 -fwrapv -fPIC -fPIE -gdwarf-4 -Wall2026100620261004
1699672226 0 027723 1288 1632bi32_lowsizeclang -march=native -O -fwrapv -Qunused-arguments -fPIC -fPIE -gdwarf-4 -Wall2026100620261004
1723042934 0 029878 1256 1792bi32_lowsizegcc -march=native -mtune=native -O2 -fwrapv -fPIC -fPIE -gdwarf-4 -Wall2026100620261004
1800388292 0 033481 1232 1696bi32_lowreggcc -march=native -mtune=native -Os -fwrapv -fPIC -fPIE -gdwarf-4 -Wall2026100620261004
18047216364 0 043085 1248 1728bi32gcc -march=native -mtune=native -O -fwrapv -fPIC -fPIE -gdwarf-4 -Wall2026100620261004
1843943111 0 029861 1248 1728bi32_lowsizegcc -march=native -mtune=native -O -fwrapv -fPIC -fPIE -gdwarf-4 -Wall2026100620261004
3246097781 0 038062 1256 1792bi8gcc -march=native -mtune=native -O3 -fwrapv -fPIC -fPIE -gdwarf-4 -Wall2026100620261004
3257247781 0 034446 1256 1792bi8gcc -march=native -mtune=native -O2 -fwrapv -fPIC -fPIE -gdwarf-4 -Wall2026100620261004
5292414511 0 036715 1288 1696opt8clang -march=native -O2 -fwrapv -Qunused-arguments -fPIC -fPIE -gdwarf-4 -Wall2026100620261004
5293013910 0 036035 1288 1696opt8_lowsizeclang -march=native -O2 -fwrapv -Qunused-arguments -fPIC -fPIE -gdwarf-4 -Wall2026100620261004
5556273532 0 029789 1280 1696opt8clang -march=native -Os -fwrapv -Qunused-arguments -fPIC -fPIE -gdwarf-4 -Wall2026100620261004
5563343451 0 029669 1280 1696opt8_lowsizeclang -march=native -Os -fwrapv -Qunused-arguments -fPIC -fPIE -gdwarf-4 -Wall2026100620261004
5943166953 0 038563 1288 1696bi8clang -march=native -O2 -fwrapv -Qunused-arguments -fPIC -fPIE -gdwarf-4 -Wall2026100620261004
5943236953 0 040035 1288 1696bi8clang -march=native -O3 -fwrapv -Qunused-arguments -fPIC -fPIE -gdwarf-4 -Wall2026100620261004
5950906913 0 032781 1280 1696bi8clang -march=native -Os -fwrapv -Qunused-arguments -fPIC -fPIE -gdwarf-4 -Wall2026100620261004
6112257548 0 032691 1288 1632bi8clang -march=native -O -fwrapv -Qunused-arguments -fPIC -fPIE -gdwarf-4 -Wall2026100620261004
6119426854 0 037606 1256 1792opt8gcc -march=native -mtune=native -O3 -fwrapv -fPIC -fPIE -gdwarf-4 -Wall2026100620261004
6125155680 0 036422 1256 1792opt8_lowsizegcc -march=native -mtune=native -O3 -fwrapv -fPIC -fPIE -gdwarf-4 -Wall2026100620261004
6137383806 0 030918 1256 1792opt8_lowsizegcc -march=native -mtune=native -O2 -fwrapv -fPIC -fPIE -gdwarf-4 -Wall2026100620261004
6145563983 0 031198 1256 1792opt8gcc -march=native -mtune=native -O2 -fwrapv -fPIC -fPIE -gdwarf-4 -Wall2026100620261004
7583805470 0 039083 1288 1696opt8clang -march=native -O3 -fwrapv -Qunused-arguments -fPIC -fPIE -gdwarf-4 -Wall2026100620261004
7614114869 0 038403 1288 1696opt8_lowsizeclang -march=native -O3 -fwrapv -Qunused-arguments -fPIC -fPIE -gdwarf-4 -Wall2026100620261004
8175444097 0 029579 1288 1632opt8_lowsizeclang -march=native -O -fwrapv -Qunused-arguments -fPIC -fPIE -gdwarf-4 -Wall2026100620261004
8278294846 0 030395 1288 1632opt8clang -march=native -O -fwrapv -Qunused-arguments -fPIC -fPIE -gdwarf-4 -Wall2026100620261004
9300918162 0 033041 1232 1696bi8gcc -march=native -mtune=native -Os -fwrapv -fPIC -fPIE -gdwarf-4 -Wall2026100620261004
94816411867 0 038189 1248 1728bi8gcc -march=native -mtune=native -O -fwrapv -fPIC -fPIE -gdwarf-4 -Wall2026100620261004
18886036333 0 033165 1248 1728opt8_lowsizegcc -march=native -mtune=native -O -fwrapv -fPIC -fPIE -gdwarf-4 -Wall2026100620261004
19409996377 0 033317 1248 1728opt8gcc -march=native -mtune=native -O -fwrapv -fPIC -fPIE -gdwarf-4 -Wall2026100620261004
23707115747 0 030961 1232 1696opt8_lowsizegcc -march=native -mtune=native -Os -fwrapv -fPIC -fPIE -gdwarf-4 -Wall2026100620261004
24796875868 0 031145 1232 1696opt8gcc -march=native -mtune=native -Os -fwrapv -fPIC -fPIE -gdwarf-4 -Wall2026100620261004

Compiler output


ascon.S: ascon.S:159:5: error: ambiguous instructions require an explicit suffix (could be 'jb', or 'jl')
ascon.S:     j .LPloopcond
ascon.S:     ^
ascon.S: ascon.S:162:5: error: unknown use of instruction mnemonic without a size suffix
ascon.S:     xor s5, s5, t2
ascon.S:     ^
ascon.S: ascon.S:163:15: error: expected register here
ascon.S:     lbu t2, 1(t1)
ascon.S:               ^
ascon.S: ascon.S:164:5: error: unknown use of instruction mnemonic without a size suffix
ascon.S:     xor s4, s4, t2
ascon.S:     ^
ascon.S: <instantiation>:1:1: error: unknown use of instruction mnemonic without a size suffix
ascon.S: xor t3, s1, s9
ascon.S: ^
ascon.S: ascon.S:167:5: note: while in macro instantiation
ascon.S:     sbox s1, s3, s5, s7, s9, t4, t3, t5
ascon.S:     ^
ascon.S: <instantiation>:2:5: error: unknown use of instruction mnemonic without a size suffix
ascon.S:     xor t5, s7, s9
ascon.S:     ^
ascon.S: ascon.S:167:5: note: while in macro instantiation
ascon.S:     sbox s1, s3, s5, s7, s9, t4, t3, t5
ascon.S:     ^
ascon.S: <instantiation>:3:5: error: unknown use of instruction mnemonic without a size suffix
ascon.S: ...

Number of similar (implementation,compiler) pairs: 4, namely:
ImplementationCompiler
T:asm_bi32_rv32bclang -march=native -O2 -fwrapv -Qunused-arguments -fPIC -fPIE -gdwarf-4 -Wall (Ubuntu_Clang_21.1.8_(6ubuntu1))
T:asm_bi32_rv32bclang -march=native -O3 -fwrapv -Qunused-arguments -fPIC -fPIE -gdwarf-4 -Wall (Ubuntu_Clang_21.1.8_(6ubuntu1))
T:asm_bi32_rv32bclang -march=native -O -fwrapv -Qunused-arguments -fPIC -fPIE -gdwarf-4 -Wall (Ubuntu_Clang_21.1.8_(6ubuntu1))
T:asm_bi32_rv32bclang -march=native -Os -fwrapv -Qunused-arguments -fPIC -fPIE -gdwarf-4 -Wall (Ubuntu_Clang_21.1.8_(6ubuntu1))

Compiler output


ascon.S: /tmp/ccaDqBou.s: Assembler messages:
ascon.S: ascon.S:159: Error: no such instruction: `j .LPloopcond'
ascon.S: ascon.S:162: Error: too many memory references for `xor'
ascon.S: ascon.S:163: Error: no such instruction: `lbu t2,1(t1)'
ascon.S: ascon.S:164: Error: too many memory references for `xor'
ascon.S: ascon.S:73: Error: too many memory references for `xor'
ascon.S: ascon.S:167:  Info: macro invoked from here
ascon.S: ascon.S:74: Error: too many memory references for `xor'
ascon.S: ascon.S:167:  Info: macro invoked from here
ascon.S: ascon.S:75: Error: too many memory references for `xor'
ascon.S: ascon.S:167:  Info: macro invoked from here
ascon.S: ascon.S:76: Error: no such instruction: `orn s9,s7,s9'
ascon.S: ascon.S:167:  Info: macro invoked from here
ascon.S: ascon.S:77: Error: too many memory references for `xor'
ascon.S: ascon.S:167:  Info: macro invoked from here
ascon.S: ascon.S:78: Error: too many memory references for `xor'
ascon.S: ascon.S:167:  Info: macro invoked from here
ascon.S: ascon.S:79: Error: too many memory references for `or'
ascon.S: ascon.S:167:  Info: macro invoked from here
ascon.S: ascon.S:80: Error: too many memory references for `xor'
ascon.S: ascon.S:167:  Info: macro invoked from here
ascon.S: ascon.S:81: Error: too many memory references for `xor'
ascon.S: ascon.S:167:  Info: macro invoked from here
ascon.S: ascon.S:82: Error: too many memory references for `or'
ascon.S: ascon.S:167:  Info: macro invoked from here
ascon.S: ...

Number of similar (implementation,compiler) pairs: 1, namely:
ImplementationCompiler
T:asm_bi32_rv32bgcc -march=native -mtune=native -O2 -fwrapv -fPIC -fPIE -gdwarf-4 -Wall (15.2.0)

Compiler output


ascon.S: /tmp/ccCASaLZ.s: Assembler messages:
ascon.S: ascon.S:159: Error: no such instruction: `j .LPloopcond'
ascon.S: ascon.S:162: Error: too many memory references for `xor'
ascon.S: ascon.S:163: Error: no such instruction: `lbu t2,1(t1)'
ascon.S: ascon.S:164: Error: too many memory references for `xor'
ascon.S: ascon.S:73: Error: too many memory references for `xor'
ascon.S: ascon.S:167:  Info: macro invoked from here
ascon.S: ascon.S:74: Error: too many memory references for `xor'
ascon.S: ascon.S:167:  Info: macro invoked from here
ascon.S: ascon.S:75: Error: too many memory references for `xor'
ascon.S: ascon.S:167:  Info: macro invoked from here
ascon.S: ascon.S:76: Error: no such instruction: `orn s9,s7,s9'
ascon.S: ascon.S:167:  Info: macro invoked from here
ascon.S: ascon.S:77: Error: too many memory references for `xor'
ascon.S: ascon.S:167:  Info: macro invoked from here
ascon.S: ascon.S:78: Error: too many memory references for `xor'
ascon.S: ascon.S:167:  Info: macro invoked from here
ascon.S: ascon.S:79: Error: too many memory references for `or'
ascon.S: ascon.S:167:  Info: macro invoked from here
ascon.S: ascon.S:80: Error: too many memory references for `xor'
ascon.S: ascon.S:167:  Info: macro invoked from here
ascon.S: ascon.S:81: Error: too many memory references for `xor'
ascon.S: ascon.S:167:  Info: macro invoked from here
ascon.S: ascon.S:82: Error: too many memory references for `or'
ascon.S: ascon.S:167:  Info: macro invoked from here
ascon.S: ...

Number of similar (implementation,compiler) pairs: 1, namely:
ImplementationCompiler
T:asm_bi32_rv32bgcc -march=native -mtune=native -O3 -fwrapv -fPIC -fPIE -gdwarf-4 -Wall (15.2.0)

Compiler output


ascon.S: /tmp/ccrb44W8.s: Assembler messages:
ascon.S: ascon.S:159: Error: no such instruction: `j .LPloopcond'
ascon.S: ascon.S:162: Error: too many memory references for `xor'
ascon.S: ascon.S:163: Error: no such instruction: `lbu t2,1(t1)'
ascon.S: ascon.S:164: Error: too many memory references for `xor'
ascon.S: ascon.S:73: Error: too many memory references for `xor'
ascon.S: ascon.S:167:  Info: macro invoked from here
ascon.S: ascon.S:74: Error: too many memory references for `xor'
ascon.S: ascon.S:167:  Info: macro invoked from here
ascon.S: ascon.S:75: Error: too many memory references for `xor'
ascon.S: ascon.S:167:  Info: macro invoked from here
ascon.S: ascon.S:76: Error: no such instruction: `orn s9,s7,s9'
ascon.S: ascon.S:167:  Info: macro invoked from here
ascon.S: ascon.S:77: Error: too many memory references for `xor'
ascon.S: ascon.S:167:  Info: macro invoked from here
ascon.S: ascon.S:78: Error: too many memory references for `xor'
ascon.S: ascon.S:167:  Info: macro invoked from here
ascon.S: ascon.S:79: Error: too many memory references for `or'
ascon.S: ascon.S:167:  Info: macro invoked from here
ascon.S: ascon.S:80: Error: too many memory references for `xor'
ascon.S: ascon.S:167:  Info: macro invoked from here
ascon.S: ascon.S:81: Error: too many memory references for `xor'
ascon.S: ascon.S:167:  Info: macro invoked from here
ascon.S: ascon.S:82: Error: too many memory references for `or'
ascon.S: ascon.S:167:  Info: macro invoked from here
ascon.S: ...

Number of similar (implementation,compiler) pairs: 1, namely:
ImplementationCompiler
T:asm_bi32_rv32bgcc -march=native -mtune=native -O -fwrapv -fPIC -fPIE -gdwarf-4 -Wall (15.2.0)

Compiler output


ascon.S: /tmp/ccr5FtJx.s: Assembler messages:
ascon.S: ascon.S:159: Error: no such instruction: `j .LPloopcond'
ascon.S: ascon.S:162: Error: too many memory references for `xor'
ascon.S: ascon.S:163: Error: no such instruction: `lbu t2,1(t1)'
ascon.S: ascon.S:164: Error: too many memory references for `xor'
ascon.S: ascon.S:73: Error: too many memory references for `xor'
ascon.S: ascon.S:167:  Info: macro invoked from here
ascon.S: ascon.S:74: Error: too many memory references for `xor'
ascon.S: ascon.S:167:  Info: macro invoked from here
ascon.S: ascon.S:75: Error: too many memory references for `xor'
ascon.S: ascon.S:167:  Info: macro invoked from here
ascon.S: ascon.S:76: Error: no such instruction: `orn s9,s7,s9'
ascon.S: ascon.S:167:  Info: macro invoked from here
ascon.S: ascon.S:77: Error: too many memory references for `xor'
ascon.S: ascon.S:167:  Info: macro invoked from here
ascon.S: ascon.S:78: Error: too many memory references for `xor'
ascon.S: ascon.S:167:  Info: macro invoked from here
ascon.S: ascon.S:79: Error: too many memory references for `or'
ascon.S: ascon.S:167:  Info: macro invoked from here
ascon.S: ascon.S:80: Error: too many memory references for `xor'
ascon.S: ascon.S:167:  Info: macro invoked from here
ascon.S: ascon.S:81: Error: too many memory references for `xor'
ascon.S: ascon.S:167:  Info: macro invoked from here
ascon.S: ascon.S:82: Error: too many memory references for `or'
ascon.S: ascon.S:167:  Info: macro invoked from here
ascon.S: ...

Number of similar (implementation,compiler) pairs: 1, namely:
ImplementationCompiler
T:asm_bi32_rv32bgcc -march=native -mtune=native -Os -fwrapv -fPIC -fPIE -gdwarf-4 -Wall (15.2.0)

Compiler output


ascon.S: ascon.S:1:10: fatal error: 'xtensa/coreasm.h' file not found
ascon.S:     1 | #include <xtensa/coreasm.h>
ascon.S:       |          ^~~~~~~~~~~~~~~~~~
ascon.S: 1 error generated.

Number of similar (implementation,compiler) pairs: 4, namely:
ImplementationCompiler
T:asm_esp32clang -march=native -O2 -fwrapv -Qunused-arguments -fPIC -fPIE -gdwarf-4 -Wall (Ubuntu_Clang_21.1.8_(6ubuntu1))
T:asm_esp32clang -march=native -O3 -fwrapv -Qunused-arguments -fPIC -fPIE -gdwarf-4 -Wall (Ubuntu_Clang_21.1.8_(6ubuntu1))
T:asm_esp32clang -march=native -O -fwrapv -Qunused-arguments -fPIC -fPIE -gdwarf-4 -Wall (Ubuntu_Clang_21.1.8_(6ubuntu1))
T:asm_esp32clang -march=native -Os -fwrapv -Qunused-arguments -fPIC -fPIE -gdwarf-4 -Wall (Ubuntu_Clang_21.1.8_(6ubuntu1))

Compiler output


ascon.S: ascon.S:1:10: fatal error: xtensa/coreasm.h: No such file or directory
ascon.S:     1 | #include <xtensa/coreasm.h>
ascon.S:       |          ^~~~~~~~~~~~~~~~~~
ascon.S: compilation terminated.

Number of similar (implementation,compiler) pairs: 4, namely:
ImplementationCompiler
T:asm_esp32gcc -march=native -mtune=native -O2 -fwrapv -fPIC -fPIE -gdwarf-4 -Wall (15.2.0)
T:asm_esp32gcc -march=native -mtune=native -O3 -fwrapv -fPIC -fPIE -gdwarf-4 -Wall (15.2.0)
T:asm_esp32gcc -march=native -mtune=native -O -fwrapv -fPIC -fPIE -gdwarf-4 -Wall (15.2.0)
T:asm_esp32gcc -march=native -mtune=native -Os -fwrapv -fPIC -fPIE -gdwarf-4 -Wall (15.2.0)

Compiler output


ascon.S: ascon.S:110:5: error: invalid instruction mnemonic 'li'
ascon.S:     li t6, 0x4b
ascon.S:     ^~
ascon.S: ascon.S:113:5: error: unknown use of instruction mnemonic without a size suffix
ascon.S:     xor s5, s5, t1
ascon.S:     ^
ascon.S: <instantiation>:1:1: error: unknown use of instruction mnemonic without a size suffix
ascon.S: xor t3, s1, s9
ascon.S: ^
ascon.S: ascon.S:116:5: note: while in macro instantiation
ascon.S:     sbox s1, s3, s5, s7, s9, t4, t3, t5
ascon.S:     ^
ascon.S: <instantiation>:2:5: error: unknown use of instruction mnemonic without a size suffix
ascon.S:     xor t5, s7, s9
ascon.S:     ^
ascon.S: ascon.S:116:5: note: while in macro instantiation
ascon.S:     sbox s1, s3, s5, s7, s9, t4, t3, t5
ascon.S:     ^
ascon.S: <instantiation>:3:5: error: unknown use of instruction mnemonic without a size suffix
ascon.S:     xor t4, s3, s5
ascon.S:     ^
ascon.S: ascon.S:116:5: note: while in macro instantiation
ascon.S:     sbox s1, s3, s5, s7, s9, t4, t3, t5
ascon.S:     ^
ascon.S: <instantiation>:4:5: error: invalid instruction mnemonic 'orn'
ascon.S: ...

Number of similar (implementation,compiler) pairs: 4, namely:
ImplementationCompiler
T:asm_fsr_rv32bclang -march=native -O2 -fwrapv -Qunused-arguments -fPIC -fPIE -gdwarf-4 -Wall (Ubuntu_Clang_21.1.8_(6ubuntu1))
T:asm_fsr_rv32bclang -march=native -O3 -fwrapv -Qunused-arguments -fPIC -fPIE -gdwarf-4 -Wall (Ubuntu_Clang_21.1.8_(6ubuntu1))
T:asm_fsr_rv32bclang -march=native -O -fwrapv -Qunused-arguments -fPIC -fPIE -gdwarf-4 -Wall (Ubuntu_Clang_21.1.8_(6ubuntu1))
T:asm_fsr_rv32bclang -march=native -Os -fwrapv -Qunused-arguments -fPIC -fPIE -gdwarf-4 -Wall (Ubuntu_Clang_21.1.8_(6ubuntu1))

Compiler output


ascon.S: /tmp/ccxTKaNJ.s: Assembler messages:
ascon.S: ascon.S:110: Error: no such instruction: `li t6,0x4b'
ascon.S: ascon.S:113: Error: too many memory references for `xor'
ascon.S: ascon.S:73: Error: too many memory references for `xor'
ascon.S: ascon.S:116:  Info: macro invoked from here
ascon.S: ascon.S:74: Error: too many memory references for `xor'
ascon.S: ascon.S:116:  Info: macro invoked from here
ascon.S: ascon.S:75: Error: too many memory references for `xor'
ascon.S: ascon.S:116:  Info: macro invoked from here
ascon.S: ascon.S:76: Error: no such instruction: `orn s9,s7,s9'
ascon.S: ascon.S:116:  Info: macro invoked from here
ascon.S: ascon.S:77: Error: too many memory references for `xor'
ascon.S: ascon.S:116:  Info: macro invoked from here
ascon.S: ascon.S:78: Error: too many memory references for `xor'
ascon.S: ascon.S:116:  Info: macro invoked from here
ascon.S: ascon.S:79: Error: too many memory references for `or'
ascon.S: ascon.S:116:  Info: macro invoked from here
ascon.S: ascon.S:80: Error: too many memory references for `xor'
ascon.S: ascon.S:116:  Info: macro invoked from here
ascon.S: ascon.S:81: Error: too many memory references for `xor'
ascon.S: ascon.S:116:  Info: macro invoked from here
ascon.S: ascon.S:82: Error: too many memory references for `or'
ascon.S: ascon.S:116:  Info: macro invoked from here
ascon.S: ascon.S:83: Error: too many memory references for `xor'
ascon.S: ascon.S:116:  Info: macro invoked from here
ascon.S: ...

Number of similar (implementation,compiler) pairs: 1, namely:
ImplementationCompiler
T:asm_fsr_rv32bgcc -march=native -mtune=native -O2 -fwrapv -fPIC -fPIE -gdwarf-4 -Wall (15.2.0)

Compiler output


ascon.S: /tmp/ccQNQuMz.s: Assembler messages:
ascon.S: ascon.S:110: Error: no such instruction: `li t6,0x4b'
ascon.S: ascon.S:113: Error: too many memory references for `xor'
ascon.S: ascon.S:73: Error: too many memory references for `xor'
ascon.S: ascon.S:116:  Info: macro invoked from here
ascon.S: ascon.S:74: Error: too many memory references for `xor'
ascon.S: ascon.S:116:  Info: macro invoked from here
ascon.S: ascon.S:75: Error: too many memory references for `xor'
ascon.S: ascon.S:116:  Info: macro invoked from here
ascon.S: ascon.S:76: Error: no such instruction: `orn s9,s7,s9'
ascon.S: ascon.S:116:  Info: macro invoked from here
ascon.S: ascon.S:77: Error: too many memory references for `xor'
ascon.S: ascon.S:116:  Info: macro invoked from here
ascon.S: ascon.S:78: Error: too many memory references for `xor'
ascon.S: ascon.S:116:  Info: macro invoked from here
ascon.S: ascon.S:79: Error: too many memory references for `or'
ascon.S: ascon.S:116:  Info: macro invoked from here
ascon.S: ascon.S:80: Error: too many memory references for `xor'
ascon.S: ascon.S:116:  Info: macro invoked from here
ascon.S: ascon.S:81: Error: too many memory references for `xor'
ascon.S: ascon.S:116:  Info: macro invoked from here
ascon.S: ascon.S:82: Error: too many memory references for `or'
ascon.S: ascon.S:116:  Info: macro invoked from here
ascon.S: ascon.S:83: Error: too many memory references for `xor'
ascon.S: ascon.S:116:  Info: macro invoked from here
ascon.S: ...

Number of similar (implementation,compiler) pairs: 1, namely:
ImplementationCompiler
T:asm_fsr_rv32bgcc -march=native -mtune=native -O3 -fwrapv -fPIC -fPIE -gdwarf-4 -Wall (15.2.0)

Compiler output


ascon.S: /tmp/ccqQi4Ev.s: Assembler messages:
ascon.S: ascon.S:110: Error: no such instruction: `li t6,0x4b'
ascon.S: ascon.S:113: Error: too many memory references for `xor'
ascon.S: ascon.S:73: Error: too many memory references for `xor'
ascon.S: ascon.S:116:  Info: macro invoked from here
ascon.S: ascon.S:74: Error: too many memory references for `xor'
ascon.S: ascon.S:116:  Info: macro invoked from here
ascon.S: ascon.S:75: Error: too many memory references for `xor'
ascon.S: ascon.S:116:  Info: macro invoked from here
ascon.S: ascon.S:76: Error: no such instruction: `orn s9,s7,s9'
ascon.S: ascon.S:116:  Info: macro invoked from here
ascon.S: ascon.S:77: Error: too many memory references for `xor'
ascon.S: ascon.S:116:  Info: macro invoked from here
ascon.S: ascon.S:78: Error: too many memory references for `xor'
ascon.S: ascon.S:116:  Info: macro invoked from here
ascon.S: ascon.S:79: Error: too many memory references for `or'
ascon.S: ascon.S:116:  Info: macro invoked from here
ascon.S: ascon.S:80: Error: too many memory references for `xor'
ascon.S: ascon.S:116:  Info: macro invoked from here
ascon.S: ascon.S:81: Error: too many memory references for `xor'
ascon.S: ascon.S:116:  Info: macro invoked from here
ascon.S: ascon.S:82: Error: too many memory references for `or'
ascon.S: ascon.S:116:  Info: macro invoked from here
ascon.S: ascon.S:83: Error: too many memory references for `xor'
ascon.S: ascon.S:116:  Info: macro invoked from here
ascon.S: ...

Number of similar (implementation,compiler) pairs: 1, namely:
ImplementationCompiler
T:asm_fsr_rv32bgcc -march=native -mtune=native -O -fwrapv -fPIC -fPIE -gdwarf-4 -Wall (15.2.0)

Compiler output


ascon.S: /tmp/cclvtYHS.s: Assembler messages:
ascon.S: ascon.S:110: Error: no such instruction: `li t6,0x4b'
ascon.S: ascon.S:113: Error: too many memory references for `xor'
ascon.S: ascon.S:73: Error: too many memory references for `xor'
ascon.S: ascon.S:116:  Info: macro invoked from here
ascon.S: ascon.S:74: Error: too many memory references for `xor'
ascon.S: ascon.S:116:  Info: macro invoked from here
ascon.S: ascon.S:75: Error: too many memory references for `xor'
ascon.S: ascon.S:116:  Info: macro invoked from here
ascon.S: ascon.S:76: Error: no such instruction: `orn s9,s7,s9'
ascon.S: ascon.S:116:  Info: macro invoked from here
ascon.S: ascon.S:77: Error: too many memory references for `xor'
ascon.S: ascon.S:116:  Info: macro invoked from here
ascon.S: ascon.S:78: Error: too many memory references for `xor'
ascon.S: ascon.S:116:  Info: macro invoked from here
ascon.S: ascon.S:79: Error: too many memory references for `or'
ascon.S: ascon.S:116:  Info: macro invoked from here
ascon.S: ascon.S:80: Error: too many memory references for `xor'
ascon.S: ascon.S:116:  Info: macro invoked from here
ascon.S: ascon.S:81: Error: too many memory references for `xor'
ascon.S: ascon.S:116:  Info: macro invoked from here
ascon.S: ascon.S:82: Error: too many memory references for `or'
ascon.S: ascon.S:116:  Info: macro invoked from here
ascon.S: ascon.S:83: Error: too many memory references for `xor'
ascon.S: ascon.S:116:  Info: macro invoked from here
ascon.S: ...

Number of similar (implementation,compiler) pairs: 1, namely:
ImplementationCompiler
T:asm_fsr_rv32bgcc -march=native -mtune=native -Os -fwrapv -fPIC -fPIE -gdwarf-4 -Wall (15.2.0)

Compiler output


ascon.S: ascon.S:118:5: error: invalid instruction mnemonic 'li'
ascon.S:     li t6, 0x4b
ascon.S:     ^~
ascon.S: ascon.S:121:5: error: unknown use of instruction mnemonic without a size suffix
ascon.S:     xor s5, s5, t1
ascon.S:     ^
ascon.S: <instantiation>:1:1: error: unknown use of instruction mnemonic without a size suffix
ascon.S: xor t3, s1, s9
ascon.S: ^
ascon.S: ascon.S:124:5: note: while in macro instantiation
ascon.S:     sbox s1, s3, s5, s7, s9, t4, t3, t5
ascon.S:     ^
ascon.S: <instantiation>:2:5: error: unknown use of instruction mnemonic without a size suffix
ascon.S:     xor t5, s7, s9
ascon.S:     ^
ascon.S: ascon.S:124:5: note: while in macro instantiation
ascon.S:     sbox s1, s3, s5, s7, s9, t4, t3, t5
ascon.S:     ^
ascon.S: <instantiation>:3:5: error: unknown use of instruction mnemonic without a size suffix
ascon.S:     xor t4, s3, s5
ascon.S:     ^
ascon.S: ascon.S:124:5: note: while in macro instantiation
ascon.S:     sbox s1, s3, s5, s7, s9, t4, t3, t5
ascon.S:     ^
ascon.S: <instantiation>:4:5: error: invalid instruction mnemonic 'orn'
ascon.S: ...

Number of similar (implementation,compiler) pairs: 4, namely:
ImplementationCompiler
T:asm_rv32bclang -march=native -O2 -fwrapv -Qunused-arguments -fPIC -fPIE -gdwarf-4 -Wall (Ubuntu_Clang_21.1.8_(6ubuntu1))
T:asm_rv32bclang -march=native -O3 -fwrapv -Qunused-arguments -fPIC -fPIE -gdwarf-4 -Wall (Ubuntu_Clang_21.1.8_(6ubuntu1))
T:asm_rv32bclang -march=native -O -fwrapv -Qunused-arguments -fPIC -fPIE -gdwarf-4 -Wall (Ubuntu_Clang_21.1.8_(6ubuntu1))
T:asm_rv32bclang -march=native -Os -fwrapv -Qunused-arguments -fPIC -fPIE -gdwarf-4 -Wall (Ubuntu_Clang_21.1.8_(6ubuntu1))

Compiler output


ascon.S: /tmp/ccqrgRv9.s: Assembler messages:
ascon.S: ascon.S:118: Error: no such instruction: `li t6,0x4b'
ascon.S: ascon.S:121: Error: too many memory references for `xor'
ascon.S: ascon.S:73: Error: too many memory references for `xor'
ascon.S: ascon.S:124:  Info: macro invoked from here
ascon.S: ascon.S:74: Error: too many memory references for `xor'
ascon.S: ascon.S:124:  Info: macro invoked from here
ascon.S: ascon.S:75: Error: too many memory references for `xor'
ascon.S: ascon.S:124:  Info: macro invoked from here
ascon.S: ascon.S:76: Error: no such instruction: `orn s9,s7,s9'
ascon.S: ascon.S:124:  Info: macro invoked from here
ascon.S: ascon.S:77: Error: too many memory references for `xor'
ascon.S: ascon.S:124:  Info: macro invoked from here
ascon.S: ascon.S:78: Error: too many memory references for `xor'
ascon.S: ascon.S:124:  Info: macro invoked from here
ascon.S: ascon.S:79: Error: too many memory references for `or'
ascon.S: ascon.S:124:  Info: macro invoked from here
ascon.S: ascon.S:80: Error: too many memory references for `xor'
ascon.S: ascon.S:124:  Info: macro invoked from here
ascon.S: ascon.S:81: Error: too many memory references for `xor'
ascon.S: ascon.S:124:  Info: macro invoked from here
ascon.S: ascon.S:82: Error: too many memory references for `or'
ascon.S: ascon.S:124:  Info: macro invoked from here
ascon.S: ascon.S:83: Error: too many memory references for `xor'
ascon.S: ascon.S:124:  Info: macro invoked from here
ascon.S: ...

Number of similar (implementation,compiler) pairs: 1, namely:
ImplementationCompiler
T:asm_rv32bgcc -march=native -mtune=native -O2 -fwrapv -fPIC -fPIE -gdwarf-4 -Wall (15.2.0)

Compiler output


ascon.S: /tmp/cc2ilsBI.s: Assembler messages:
ascon.S: ascon.S:118: Error: no such instruction: `li t6,0x4b'
ascon.S: ascon.S:121: Error: too many memory references for `xor'
ascon.S: ascon.S:73: Error: too many memory references for `xor'
ascon.S: ascon.S:124:  Info: macro invoked from here
ascon.S: ascon.S:74: Error: too many memory references for `xor'
ascon.S: ascon.S:124:  Info: macro invoked from here
ascon.S: ascon.S:75: Error: too many memory references for `xor'
ascon.S: ascon.S:124:  Info: macro invoked from here
ascon.S: ascon.S:76: Error: no such instruction: `orn s9,s7,s9'
ascon.S: ascon.S:124:  Info: macro invoked from here
ascon.S: ascon.S:77: Error: too many memory references for `xor'
ascon.S: ascon.S:124:  Info: macro invoked from here
ascon.S: ascon.S:78: Error: too many memory references for `xor'
ascon.S: ascon.S:124:  Info: macro invoked from here
ascon.S: ascon.S:79: Error: too many memory references for `or'
ascon.S: ascon.S:124:  Info: macro invoked from here
ascon.S: ascon.S:80: Error: too many memory references for `xor'
ascon.S: ascon.S:124:  Info: macro invoked from here
ascon.S: ascon.S:81: Error: too many memory references for `xor'
ascon.S: ascon.S:124:  Info: macro invoked from here
ascon.S: ascon.S:82: Error: too many memory references for `or'
ascon.S: ascon.S:124:  Info: macro invoked from here
ascon.S: ascon.S:83: Error: too many memory references for `xor'
ascon.S: ascon.S:124:  Info: macro invoked from here
ascon.S: ...

Number of similar (implementation,compiler) pairs: 1, namely:
ImplementationCompiler
T:asm_rv32bgcc -march=native -mtune=native -O3 -fwrapv -fPIC -fPIE -gdwarf-4 -Wall (15.2.0)

Compiler output


ascon.S: /tmp/ccloUDej.s: Assembler messages:
ascon.S: ascon.S:118: Error: no such instruction: `li t6,0x4b'
ascon.S: ascon.S:121: Error: too many memory references for `xor'
ascon.S: ascon.S:73: Error: too many memory references for `xor'
ascon.S: ascon.S:124:  Info: macro invoked from here
ascon.S: ascon.S:74: Error: too many memory references for `xor'
ascon.S: ascon.S:124:  Info: macro invoked from here
ascon.S: ascon.S:75: Error: too many memory references for `xor'
ascon.S: ascon.S:124:  Info: macro invoked from here
ascon.S: ascon.S:76: Error: no such instruction: `orn s9,s7,s9'
ascon.S: ascon.S:124:  Info: macro invoked from here
ascon.S: ascon.S:77: Error: too many memory references for `xor'
ascon.S: ascon.S:124:  Info: macro invoked from here
ascon.S: ascon.S:78: Error: too many memory references for `xor'
ascon.S: ascon.S:124:  Info: macro invoked from here
ascon.S: ascon.S:79: Error: too many memory references for `or'
ascon.S: ascon.S:124:  Info: macro invoked from here
ascon.S: ascon.S:80: Error: too many memory references for `xor'
ascon.S: ascon.S:124:  Info: macro invoked from here
ascon.S: ascon.S:81: Error: too many memory references for `xor'
ascon.S: ascon.S:124:  Info: macro invoked from here
ascon.S: ascon.S:82: Error: too many memory references for `or'
ascon.S: ascon.S:124:  Info: macro invoked from here
ascon.S: ascon.S:83: Error: too many memory references for `xor'
ascon.S: ascon.S:124:  Info: macro invoked from here
ascon.S: ...

Number of similar (implementation,compiler) pairs: 1, namely:
ImplementationCompiler
T:asm_rv32bgcc -march=native -mtune=native -O -fwrapv -fPIC -fPIE -gdwarf-4 -Wall (15.2.0)

Compiler output


ascon.S: /tmp/ccgVXp1g.s: Assembler messages:
ascon.S: ascon.S:118: Error: no such instruction: `li t6,0x4b'
ascon.S: ascon.S:121: Error: too many memory references for `xor'
ascon.S: ascon.S:73: Error: too many memory references for `xor'
ascon.S: ascon.S:124:  Info: macro invoked from here
ascon.S: ascon.S:74: Error: too many memory references for `xor'
ascon.S: ascon.S:124:  Info: macro invoked from here
ascon.S: ascon.S:75: Error: too many memory references for `xor'
ascon.S: ascon.S:124:  Info: macro invoked from here
ascon.S: ascon.S:76: Error: no such instruction: `orn s9,s7,s9'
ascon.S: ascon.S:124:  Info: macro invoked from here
ascon.S: ascon.S:77: Error: too many memory references for `xor'
ascon.S: ascon.S:124:  Info: macro invoked from here
ascon.S: ascon.S:78: Error: too many memory references for `xor'
ascon.S: ascon.S:124:  Info: macro invoked from here
ascon.S: ascon.S:79: Error: too many memory references for `or'
ascon.S: ascon.S:124:  Info: macro invoked from here
ascon.S: ascon.S:80: Error: too many memory references for `xor'
ascon.S: ascon.S:124:  Info: macro invoked from here
ascon.S: ascon.S:81: Error: too many memory references for `xor'
ascon.S: ascon.S:124:  Info: macro invoked from here
ascon.S: ascon.S:82: Error: too many memory references for `or'
ascon.S: ascon.S:124:  Info: macro invoked from here
ascon.S: ascon.S:83: Error: too many memory references for `xor'
ascon.S: ascon.S:124:  Info: macro invoked from here
ascon.S: ...

Number of similar (implementation,compiler) pairs: 1, namely:
ImplementationCompiler
T:asm_rv32bgcc -march=native -mtune=native -Os -fwrapv -fPIC -fPIE -gdwarf-4 -Wall (15.2.0)

Compiler output


ascon.S: ascon.S:120:5: error: invalid instruction mnemonic 'li'
ascon.S:     li t6, 0x4b
ascon.S:     ^~
ascon.S: ascon.S:123:5: error: unknown use of instruction mnemonic without a size suffix
ascon.S:     xor s5, s5, t1
ascon.S:     ^
ascon.S: <instantiation>:1:1: error: unknown use of instruction mnemonic without a size suffix
ascon.S: xor t3, s1, s9
ascon.S: ^
ascon.S: ascon.S:126:5: note: while in macro instantiation
ascon.S:     sbox s1, s3, s5, s7, s9, t4, t3, t5
ascon.S:     ^
ascon.S: <instantiation>:2:5: error: unknown use of instruction mnemonic without a size suffix
ascon.S:     xor t5, s7, s9
ascon.S:     ^
ascon.S: ascon.S:126:5: note: while in macro instantiation
ascon.S:     sbox s1, s3, s5, s7, s9, t4, t3, t5
ascon.S:     ^
ascon.S: <instantiation>:3:5: error: invalid instruction mnemonic 'xori'
ascon.S:     xori s9, s9, -1
ascon.S:     ^~~~
ascon.S: ascon.S:126:5: note: while in macro instantiation
ascon.S:     sbox s1, s3, s5, s7, s9, t4, t3, t5
ascon.S:     ^
ascon.S: <instantiation>:4:5: error: unknown use of instruction mnemonic without a size suffix
ascon.S: ...

Number of similar (implementation,compiler) pairs: 4, namely:
ImplementationCompiler
T:asm_rv32iclang -march=native -O2 -fwrapv -Qunused-arguments -fPIC -fPIE -gdwarf-4 -Wall (Ubuntu_Clang_21.1.8_(6ubuntu1))
T:asm_rv32iclang -march=native -O3 -fwrapv -Qunused-arguments -fPIC -fPIE -gdwarf-4 -Wall (Ubuntu_Clang_21.1.8_(6ubuntu1))
T:asm_rv32iclang -march=native -O -fwrapv -Qunused-arguments -fPIC -fPIE -gdwarf-4 -Wall (Ubuntu_Clang_21.1.8_(6ubuntu1))
T:asm_rv32iclang -march=native -Os -fwrapv -Qunused-arguments -fPIC -fPIE -gdwarf-4 -Wall (Ubuntu_Clang_21.1.8_(6ubuntu1))

Compiler output


ascon.S: /tmp/ccW3AhdR.s: Assembler messages:
ascon.S: ascon.S:120: Error: no such instruction: `li t6,0x4b'
ascon.S: ascon.S:123: Error: too many memory references for `xor'
ascon.S: ascon.S:73: Error: too many memory references for `xor'
ascon.S: ascon.S:126:  Info: macro invoked from here
ascon.S: ascon.S:74: Error: too many memory references for `xor'
ascon.S: ascon.S:126:  Info: macro invoked from here
ascon.S: ascon.S:75: Error: no such instruction: `xori s9,s9,-1'
ascon.S: ascon.S:126:  Info: macro invoked from here
ascon.S: ascon.S:76: Error: too many memory references for `xor'
ascon.S: ascon.S:126:  Info: macro invoked from here
ascon.S: ascon.S:77: Error: too many memory references for `or'
ascon.S: ascon.S:126:  Info: macro invoked from here
ascon.S: ascon.S:78: Error: too many memory references for `xor'
ascon.S: ascon.S:126:  Info: macro invoked from here
ascon.S: ascon.S:79: Error: too many memory references for `xor'
ascon.S: ascon.S:126:  Info: macro invoked from here
ascon.S: ascon.S:80: Error: too many memory references for `or'
ascon.S: ascon.S:126:  Info: macro invoked from here
ascon.S: ascon.S:81: Error: too many memory references for `xor'
ascon.S: ascon.S:126:  Info: macro invoked from here
ascon.S: ascon.S:82: Error: too many memory references for `xor'
ascon.S: ascon.S:126:  Info: macro invoked from here
ascon.S: ascon.S:83: Error: too many memory references for `or'
ascon.S: ascon.S:126:  Info: macro invoked from here
ascon.S: ...

Number of similar (implementation,compiler) pairs: 1, namely:
ImplementationCompiler
T:asm_rv32igcc -march=native -mtune=native -O2 -fwrapv -fPIC -fPIE -gdwarf-4 -Wall (15.2.0)

Compiler output


ascon.S: /tmp/ccvnTfI6.s: Assembler messages:
ascon.S: ascon.S:120: Error: no such instruction: `li t6,0x4b'
ascon.S: ascon.S:123: Error: too many memory references for `xor'
ascon.S: ascon.S:73: Error: too many memory references for `xor'
ascon.S: ascon.S:126:  Info: macro invoked from here
ascon.S: ascon.S:74: Error: too many memory references for `xor'
ascon.S: ascon.S:126:  Info: macro invoked from here
ascon.S: ascon.S:75: Error: no such instruction: `xori s9,s9,-1'
ascon.S: ascon.S:126:  Info: macro invoked from here
ascon.S: ascon.S:76: Error: too many memory references for `xor'
ascon.S: ascon.S:126:  Info: macro invoked from here
ascon.S: ascon.S:77: Error: too many memory references for `or'
ascon.S: ascon.S:126:  Info: macro invoked from here
ascon.S: ascon.S:78: Error: too many memory references for `xor'
ascon.S: ascon.S:126:  Info: macro invoked from here
ascon.S: ascon.S:79: Error: too many memory references for `xor'
ascon.S: ascon.S:126:  Info: macro invoked from here
ascon.S: ascon.S:80: Error: too many memory references for `or'
ascon.S: ascon.S:126:  Info: macro invoked from here
ascon.S: ascon.S:81: Error: too many memory references for `xor'
ascon.S: ascon.S:126:  Info: macro invoked from here
ascon.S: ascon.S:82: Error: too many memory references for `xor'
ascon.S: ascon.S:126:  Info: macro invoked from here
ascon.S: ascon.S:83: Error: too many memory references for `or'
ascon.S: ascon.S:126:  Info: macro invoked from here
ascon.S: ...

Number of similar (implementation,compiler) pairs: 1, namely:
ImplementationCompiler
T:asm_rv32igcc -march=native -mtune=native -O3 -fwrapv -fPIC -fPIE -gdwarf-4 -Wall (15.2.0)

Compiler output


ascon.S: /tmp/ccw9lwka.s: Assembler messages:
ascon.S: ascon.S:120: Error: no such instruction: `li t6,0x4b'
ascon.S: ascon.S:123: Error: too many memory references for `xor'
ascon.S: ascon.S:73: Error: too many memory references for `xor'
ascon.S: ascon.S:126:  Info: macro invoked from here
ascon.S: ascon.S:74: Error: too many memory references for `xor'
ascon.S: ascon.S:126:  Info: macro invoked from here
ascon.S: ascon.S:75: Error: no such instruction: `xori s9,s9,-1'
ascon.S: ascon.S:126:  Info: macro invoked from here
ascon.S: ascon.S:76: Error: too many memory references for `xor'
ascon.S: ascon.S:126:  Info: macro invoked from here
ascon.S: ascon.S:77: Error: too many memory references for `or'
ascon.S: ascon.S:126:  Info: macro invoked from here
ascon.S: ascon.S:78: Error: too many memory references for `xor'
ascon.S: ascon.S:126:  Info: macro invoked from here
ascon.S: ascon.S:79: Error: too many memory references for `xor'
ascon.S: ascon.S:126:  Info: macro invoked from here
ascon.S: ascon.S:80: Error: too many memory references for `or'
ascon.S: ascon.S:126:  Info: macro invoked from here
ascon.S: ascon.S:81: Error: too many memory references for `xor'
ascon.S: ascon.S:126:  Info: macro invoked from here
ascon.S: ascon.S:82: Error: too many memory references for `xor'
ascon.S: ascon.S:126:  Info: macro invoked from here
ascon.S: ascon.S:83: Error: too many memory references for `or'
ascon.S: ascon.S:126:  Info: macro invoked from here
ascon.S: ...

Number of similar (implementation,compiler) pairs: 1, namely:
ImplementationCompiler
T:asm_rv32igcc -march=native -mtune=native -O -fwrapv -fPIC -fPIE -gdwarf-4 -Wall (15.2.0)

Compiler output


ascon.S: /tmp/ccotIoNM.s: Assembler messages:
ascon.S: ascon.S:120: Error: no such instruction: `li t6,0x4b'
ascon.S: ascon.S:123: Error: too many memory references for `xor'
ascon.S: ascon.S:73: Error: too many memory references for `xor'
ascon.S: ascon.S:126:  Info: macro invoked from here
ascon.S: ascon.S:74: Error: too many memory references for `xor'
ascon.S: ascon.S:126:  Info: macro invoked from here
ascon.S: ascon.S:75: Error: no such instruction: `xori s9,s9,-1'
ascon.S: ascon.S:126:  Info: macro invoked from here
ascon.S: ascon.S:76: Error: too many memory references for `xor'
ascon.S: ascon.S:126:  Info: macro invoked from here
ascon.S: ascon.S:77: Error: too many memory references for `or'
ascon.S: ascon.S:126:  Info: macro invoked from here
ascon.S: ascon.S:78: Error: too many memory references for `xor'
ascon.S: ascon.S:126:  Info: macro invoked from here
ascon.S: ascon.S:79: Error: too many memory references for `xor'
ascon.S: ascon.S:126:  Info: macro invoked from here
ascon.S: ascon.S:80: Error: too many memory references for `or'
ascon.S: ascon.S:126:  Info: macro invoked from here
ascon.S: ascon.S:81: Error: too many memory references for `xor'
ascon.S: ascon.S:126:  Info: macro invoked from here
ascon.S: ascon.S:82: Error: too many memory references for `xor'
ascon.S: ascon.S:126:  Info: macro invoked from here
ascon.S: ascon.S:83: Error: too many memory references for `or'
ascon.S: ascon.S:126:  Info: macro invoked from here
ascon.S: ...

Number of similar (implementation,compiler) pairs: 1, namely:
ImplementationCompiler
T:asm_rv32igcc -march=native -mtune=native -Os -fwrapv -fPIC -fPIE -gdwarf-4 -Wall (15.2.0)

Compiler output


aead.c: aead.c:35:18: error: static declaration of 'ascon_initaead' follows non-static declaration
aead.c:    35 | forceinline void ascon_initaead(ascon_state_t* s, const ascon_key_t* key,
aead.c:       |                  ^
aead.c: ./ascon.h:22:6: note: previous declaration is here
aead.c:    22 | void ascon_initaead(ascon_state_t* s, const ascon_key_t* key,
aead.c:       |      ^
aead.c: aead.c:57:18: error: static declaration of 'ascon_adata' follows non-static declaration
aead.c:    57 | forceinline void ascon_adata(ascon_state_t* s, const uint8_t* ad,
aead.c:       |                  ^
aead.c: ./ascon.h:24:6: note: previous declaration is here
aead.c:    24 | void ascon_adata(ascon_state_t* s, const uint8_t* ad, uint64_t adlen);
aead.c:       |      ^
aead.c: aead.c:93:18: error: static declaration of 'ascon_encrypt' follows non-static declaration
aead.c:    93 | forceinline void ascon_encrypt(ascon_state_t* s, uint8_t* c, const uint8_t* m,
aead.c:       |                  ^
aead.c: ./ascon.h:25:6: note: previous declaration is here
aead.c:    25 | void ascon_encrypt(ascon_state_t* s, uint8_t* c, const uint8_t* m,
aead.c:       |      ^
aead.c: aead.c:131:18: error: static declaration of 'ascon_decrypt' follows non-static declaration
aead.c:   131 | forceinline void ascon_decrypt(ascon_state_t* s, uint8_t* m, const uint8_t* c,
aead.c:       |                  ^
aead.c: ./ascon.h:27:6: note: previous declaration is here
aead.c:    27 | void ascon_decrypt(ascon_state_t* s, uint8_t* m, const uint8_t* c,
aead.c:       |      ^
aead.c: aead.c:175:18: error: static declaration of 'ascon_final' follows non-static declaration
aead.c: ...

Number of similar (implementation,compiler) pairs: 4, namely:
ImplementationCompiler
avx512clang -march=native -O2 -fwrapv -Qunused-arguments -fPIC -fPIE -gdwarf-4 -Wall (Ubuntu_Clang_21.1.8_(6ubuntu1))
avx512clang -march=native -O3 -fwrapv -Qunused-arguments -fPIC -fPIE -gdwarf-4 -Wall (Ubuntu_Clang_21.1.8_(6ubuntu1))
avx512clang -march=native -O -fwrapv -Qunused-arguments -fPIC -fPIE -gdwarf-4 -Wall (Ubuntu_Clang_21.1.8_(6ubuntu1))
avx512clang -march=native -Os -fwrapv -Qunused-arguments -fPIC -fPIE -gdwarf-4 -Wall (Ubuntu_Clang_21.1.8_(6ubuntu1))

Compiler output


aead.c: aead.c:35:18: error: static declaration of 'ascon_initaead' follows non-static declaration
aead.c:    35 | forceinline void ascon_initaead(ascon_state_t* s, const ascon_key_t* key,
aead.c:       |                  ^~~~~~~~~~~~~~
aead.c: In file included from aead.c:2:
aead.c: ascon.h:22:6: note: previous declaration of 'ascon_initaead' with type 'void(ascon_state_t *, const ascon_key_t *, const uint8_t *)' {aka 'void(ascon_state_t *, const ascon_key_t *, const unsigned char *)'}
aead.c:    22 | void ascon_initaead(ascon_state_t* s, const ascon_key_t* key,
aead.c:       |      ^~~~~~~~~~~~~~
aead.c: aead.c:57:18: error: static declaration of 'ascon_adata' follows non-static declaration
aead.c:    57 | forceinline void ascon_adata(ascon_state_t* s, const uint8_t* ad,
aead.c:       |                  ^~~~~~~~~~~
aead.c: ascon.h:24:6: note: previous declaration of 'ascon_adata' with type 'void(ascon_state_t *, const uint8_t *, uint64_t)' {aka 'void(ascon_state_t *, const unsigned char *, long unsigned int)'}
aead.c:    24 | void ascon_adata(ascon_state_t* s, const uint8_t* ad, uint64_t adlen);
aead.c:       |      ^~~~~~~~~~~
aead.c: aead.c:93:18: error: static declaration of 'ascon_encrypt' follows non-static declaration
aead.c:    93 | forceinline void ascon_encrypt(ascon_state_t* s, uint8_t* c, const uint8_t* m,
aead.c:       |                  ^~~~~~~~~~~~~
aead.c: ascon.h:25:6: note: previous declaration of 'ascon_encrypt' with type 'void(ascon_state_t *, uint8_t *, const uint8_t *, uint64_t)' {aka 'void(ascon_state_t *, unsigned char *, const unsigned char *, long unsigned int)'}
aead.c:    25 | void ascon_encrypt(ascon_state_t* s, uint8_t* c, const uint8_t* m,
aead.c:       |      ^~~~~~~~~~~~~
aead.c: aead.c:131:18: error: static declaration of 'ascon_decrypt' follows non-static declaration
aead.c:   131 | forceinline void ascon_decrypt(ascon_state_t* s, uint8_t* m, const uint8_t* c,
aead.c:       |                  ^~~~~~~~~~~~~
aead.c: ascon.h:27:6: note: previous declaration of 'ascon_decrypt' with type 'void(ascon_state_t *, uint8_t *, const uint8_t *, uint64_t)' {aka 'void(ascon_state_t *, unsigned char *, const unsigned char *, long unsigned int)'}
aead.c:    27 | void ascon_decrypt(ascon_state_t* s, uint8_t* m, const uint8_t* c,
aead.c:       |      ^~~~~~~~~~~~~
aead.c: ...

Number of similar (implementation,compiler) pairs: 4, namely:
ImplementationCompiler
avx512gcc -march=native -mtune=native -O2 -fwrapv -fPIC -fPIE -gdwarf-4 -Wall (15.2.0)
avx512gcc -march=native -mtune=native -O3 -fwrapv -fPIC -fPIE -gdwarf-4 -Wall (15.2.0)
avx512gcc -march=native -mtune=native -O -fwrapv -fPIC -fPIE -gdwarf-4 -Wall (15.2.0)
avx512gcc -march=native -mtune=native -Os -fwrapv -fPIC -fPIE -gdwarf-4 -Wall (15.2.0)

Compiler output


update.c: update.c:21:13: warning: unused variable 'rate' [-Wunused-variable]
update.c:    21 |   const int rate = ASCON_AEAD_RATE;
update.c:       |             ^~~~
update.c: 1 warning generated.

Number of similar (implementation,compiler) pairs: 12, namely:
ImplementationCompiler
bi32_lowsizeclang -march=native -O2 -fwrapv -Qunused-arguments -fPIC -fPIE -gdwarf-4 -Wall (Ubuntu_Clang_21.1.8_(6ubuntu1))
bi32_lowsizeclang -march=native -O3 -fwrapv -Qunused-arguments -fPIC -fPIE -gdwarf-4 -Wall (Ubuntu_Clang_21.1.8_(6ubuntu1))
bi32_lowsizeclang -march=native -O -fwrapv -Qunused-arguments -fPIC -fPIE -gdwarf-4 -Wall (Ubuntu_Clang_21.1.8_(6ubuntu1))
bi32_lowsizeclang -march=native -Os -fwrapv -Qunused-arguments -fPIC -fPIE -gdwarf-4 -Wall (Ubuntu_Clang_21.1.8_(6ubuntu1))
opt32_lowsizeclang -march=native -O2 -fwrapv -Qunused-arguments -fPIC -fPIE -gdwarf-4 -Wall (Ubuntu_Clang_21.1.8_(6ubuntu1))
opt32_lowsizeclang -march=native -O3 -fwrapv -Qunused-arguments -fPIC -fPIE -gdwarf-4 -Wall (Ubuntu_Clang_21.1.8_(6ubuntu1))
opt32_lowsizeclang -march=native -O -fwrapv -Qunused-arguments -fPIC -fPIE -gdwarf-4 -Wall (Ubuntu_Clang_21.1.8_(6ubuntu1))
opt32_lowsizeclang -march=native -Os -fwrapv -Qunused-arguments -fPIC -fPIE -gdwarf-4 -Wall (Ubuntu_Clang_21.1.8_(6ubuntu1))
opt64_lowsizeclang -march=native -O2 -fwrapv -Qunused-arguments -fPIC -fPIE -gdwarf-4 -Wall (Ubuntu_Clang_21.1.8_(6ubuntu1))
opt64_lowsizeclang -march=native -O3 -fwrapv -Qunused-arguments -fPIC -fPIE -gdwarf-4 -Wall (Ubuntu_Clang_21.1.8_(6ubuntu1))
opt64_lowsizeclang -march=native -O -fwrapv -Qunused-arguments -fPIC -fPIE -gdwarf-4 -Wall (Ubuntu_Clang_21.1.8_(6ubuntu1))
opt64_lowsizeclang -march=native -Os -fwrapv -Qunused-arguments -fPIC -fPIE -gdwarf-4 -Wall (Ubuntu_Clang_21.1.8_(6ubuntu1))

Compiler output


update.c: update.c: In function 'ascon_update':
update.c: update.c:21:13: warning: unused variable 'rate' [-Wunused-variable]
update.c:    21 |   const int rate = ASCON_AEAD_RATE;
update.c:       |             ^~~~

Number of similar (implementation,compiler) pairs: 12, namely:
ImplementationCompiler
bi32_lowsizegcc -march=native -mtune=native -O2 -fwrapv -fPIC -fPIE -gdwarf-4 -Wall (15.2.0)
bi32_lowsizegcc -march=native -mtune=native -O3 -fwrapv -fPIC -fPIE -gdwarf-4 -Wall (15.2.0)
bi32_lowsizegcc -march=native -mtune=native -O -fwrapv -fPIC -fPIE -gdwarf-4 -Wall (15.2.0)
bi32_lowsizegcc -march=native -mtune=native -Os -fwrapv -fPIC -fPIE -gdwarf-4 -Wall (15.2.0)
opt32_lowsizegcc -march=native -mtune=native -O2 -fwrapv -fPIC -fPIE -gdwarf-4 -Wall (15.2.0)
opt32_lowsizegcc -march=native -mtune=native -O3 -fwrapv -fPIC -fPIE -gdwarf-4 -Wall (15.2.0)
opt32_lowsizegcc -march=native -mtune=native -O -fwrapv -fPIC -fPIE -gdwarf-4 -Wall (15.2.0)
opt32_lowsizegcc -march=native -mtune=native -Os -fwrapv -fPIC -fPIE -gdwarf-4 -Wall (15.2.0)
opt64_lowsizegcc -march=native -mtune=native -O2 -fwrapv -fPIC -fPIE -gdwarf-4 -Wall (15.2.0)
opt64_lowsizegcc -march=native -mtune=native -O3 -fwrapv -fPIC -fPIE -gdwarf-4 -Wall (15.2.0)
opt64_lowsizegcc -march=native -mtune=native -O -fwrapv -fPIC -fPIE -gdwarf-4 -Wall (15.2.0)
opt64_lowsizegcc -march=native -mtune=native -Os -fwrapv -fPIC -fPIE -gdwarf-4 -Wall (15.2.0)

Compiler output


try.c: /usr/bin/x86_64-linux-gnu-ld.bfd: /tmp/try-small-37a43a.o: in function `doit':
try.c: .../supercop-data/hertz/amd64/try/c/clang_-march=native_-O2_-fwrapv_-Qunused-arguments_-fPIC_-fPIE_-gdwarf-4_-Wall/timingleaks/crypto_aead/ascon128v12/esp32/work/./try.c:133:(.text+0x...): undefined reference to `crypto_aead_ascon128v12_esp32_timingleaks_encrypt'
try.c: /usr/bin/x86_64-linux-gnu-ld.bfd: .../supercop-data/hertz/amd64/try/c/clang_-march=native_-O2_-fwrapv_-Qunused-arguments_-fPIC_-fPIE_-gdwarf-4_-Wall/timingleaks/crypto_aead/ascon128v12/esp32/work/./try.c:135:(.text+0x...): undefined reference to `crypto_aead_ascon128v12_esp32_timingleaks_decrypt'
try.c: /usr/bin/x86_64-linux-gnu-ld.bfd: /tmp/try-small-37a43a.o: in function `test':
try.c: .../supercop-data/hertz/amd64/try/c/clang_-march=native_-O2_-fwrapv_-Qunused-arguments_-fPIC_-fPIE_-gdwarf-4_-Wall/timingleaks/crypto_aead/ascon128v12/esp32/work/./try.c:159:(.text+0x...): undefined reference to `crypto_aead_ascon128v12_esp32_timingleaks_encrypt'
try.c: /usr/bin/x86_64-linux-gnu-ld.bfd: .../supercop-data/hertz/amd64/try/c/clang_-march=native_-O2_-fwrapv_-Qunused-arguments_-fPIC_-fPIE_-gdwarf-4_-Wall/timingleaks/crypto_aead/ascon128v12/esp32/work/./try.c:189:(.text+0x...): undefined reference to `crypto_aead_ascon128v12_esp32_timingleaks_encrypt'
try.c: /usr/bin/x86_64-linux-gnu-ld.bfd: .../supercop-data/hertz/amd64/try/c/clang_-march=native_-O2_-fwrapv_-Qunused-arguments_-fPIC_-fPIE_-gdwarf-4_-Wall/timingleaks/crypto_aead/ascon128v12/esp32/work/./try.c:300:(.text+0x...): undefined reference to `crypto_aead_ascon128v12_esp32_timingleaks_decrypt'
try.c: /usr/bin/x86_64-linux-gnu-ld.bfd: .../supercop-data/hertz/amd64/try/c/clang_-march=native_-O2_-fwrapv_-Qunused-arguments_-fPIC_-fPIE_-gdwarf-4_-Wall/timingleaks/crypto_aead/ascon128v12/esp32/work/./try.c:331:(.text+0x...): undefined reference to `crypto_aead_ascon128v12_esp32_timingleaks_decrypt'
try.c: /usr/bin/x86_64-linux-gnu-ld.bfd: .../supercop-data/hertz/amd64/try/c/clang_-march=native_-O2_-fwrapv_-Qunused-arguments_-fPIC_-fPIE_-gdwarf-4_-Wall/timingleaks/crypto_aead/ascon128v12/esp32/work/./try.c:476:(.text+0x...): undefined reference to `crypto_aead_ascon128v12_esp32_timingleaks_decrypt'
try.c: /usr/bin/x86_64-linux-gnu-ld.bfd: .../supercop-data/hertz/amd64/try/c/clang_-march=native_-O2_-fwrapv_-Qunused-arguments_-fPIC_-fPIE_-gdwarf-4_-Wall/timingleaks/crypto_aead/ascon128v12/esp32/work/./try.c:480:(.text+0x...): undefined reference to `crypto_aead_ascon128v12_esp32_timingleaks_decrypt'
try.c: /usr/bin/x86_64-linux-gnu-ld.bfd: .../supercop-data/hertz/amd64/try/c/clang_-march=native_-O2_-fwrapv_-Qunused-arguments_-fPIC_-fPIE_-gdwarf-4_-Wall/timingleaks/crypto_aead/ascon128v12/esp32/work/./try.c:484:(.text+0x...): undefined reference to `crypto_aead_ascon128v12_esp32_timingleaks_decrypt'
try.c: clang: error: linker command failed with exit code 1 (use -v to see invocation)

Number of similar (implementation,compiler) pairs: 1, namely:
ImplementationCompiler
T:esp32clang -march=native -O2 -fwrapv -Qunused-arguments -fPIC -fPIE -gdwarf-4 -Wall (Ubuntu_Clang_21.1.8_(6ubuntu1))

Compiler output


try.c: /usr/bin/x86_64-linux-gnu-ld.bfd: /tmp/try-small-be9916.o: in function `doit':
try.c: .../supercop-data/hertz/amd64/try/c/clang_-march=native_-O3_-fwrapv_-Qunused-arguments_-fPIC_-fPIE_-gdwarf-4_-Wall/timingleaks/crypto_aead/ascon128v12/esp32/work/./try.c:133:(.text+0x...): undefined reference to `crypto_aead_ascon128v12_esp32_timingleaks_encrypt'
try.c: /usr/bin/x86_64-linux-gnu-ld.bfd: .../supercop-data/hertz/amd64/try/c/clang_-march=native_-O3_-fwrapv_-Qunused-arguments_-fPIC_-fPIE_-gdwarf-4_-Wall/timingleaks/crypto_aead/ascon128v12/esp32/work/./try.c:135:(.text+0x...): undefined reference to `crypto_aead_ascon128v12_esp32_timingleaks_decrypt'
try.c: /usr/bin/x86_64-linux-gnu-ld.bfd: /tmp/try-small-be9916.o: in function `test':
try.c: .../supercop-data/hertz/amd64/try/c/clang_-march=native_-O3_-fwrapv_-Qunused-arguments_-fPIC_-fPIE_-gdwarf-4_-Wall/timingleaks/crypto_aead/ascon128v12/esp32/work/./try.c:159:(.text+0x...): undefined reference to `crypto_aead_ascon128v12_esp32_timingleaks_encrypt'
try.c: /usr/bin/x86_64-linux-gnu-ld.bfd: .../supercop-data/hertz/amd64/try/c/clang_-march=native_-O3_-fwrapv_-Qunused-arguments_-fPIC_-fPIE_-gdwarf-4_-Wall/timingleaks/crypto_aead/ascon128v12/esp32/work/./try.c:189:(.text+0x...): undefined reference to `crypto_aead_ascon128v12_esp32_timingleaks_encrypt'
try.c: /usr/bin/x86_64-linux-gnu-ld.bfd: .../supercop-data/hertz/amd64/try/c/clang_-march=native_-O3_-fwrapv_-Qunused-arguments_-fPIC_-fPIE_-gdwarf-4_-Wall/timingleaks/crypto_aead/ascon128v12/esp32/work/./try.c:300:(.text+0x...): undefined reference to `crypto_aead_ascon128v12_esp32_timingleaks_decrypt'
try.c: /usr/bin/x86_64-linux-gnu-ld.bfd: .../supercop-data/hertz/amd64/try/c/clang_-march=native_-O3_-fwrapv_-Qunused-arguments_-fPIC_-fPIE_-gdwarf-4_-Wall/timingleaks/crypto_aead/ascon128v12/esp32/work/./try.c:331:(.text+0x...): undefined reference to `crypto_aead_ascon128v12_esp32_timingleaks_decrypt'
try.c: /usr/bin/x86_64-linux-gnu-ld.bfd: .../supercop-data/hertz/amd64/try/c/clang_-march=native_-O3_-fwrapv_-Qunused-arguments_-fPIC_-fPIE_-gdwarf-4_-Wall/timingleaks/crypto_aead/ascon128v12/esp32/work/./try.c:476:(.text+0x...): undefined reference to `crypto_aead_ascon128v12_esp32_timingleaks_decrypt'
try.c: /usr/bin/x86_64-linux-gnu-ld.bfd: .../supercop-data/hertz/amd64/try/c/clang_-march=native_-O3_-fwrapv_-Qunused-arguments_-fPIC_-fPIE_-gdwarf-4_-Wall/timingleaks/crypto_aead/ascon128v12/esp32/work/./try.c:480:(.text+0x...): undefined reference to `crypto_aead_ascon128v12_esp32_timingleaks_decrypt'
try.c: /usr/bin/x86_64-linux-gnu-ld.bfd: .../supercop-data/hertz/amd64/try/c/clang_-march=native_-O3_-fwrapv_-Qunused-arguments_-fPIC_-fPIE_-gdwarf-4_-Wall/timingleaks/crypto_aead/ascon128v12/esp32/work/./try.c:484:(.text+0x...): undefined reference to `crypto_aead_ascon128v12_esp32_timingleaks_decrypt'
try.c: clang: error: linker command failed with exit code 1 (use -v to see invocation)

Number of similar (implementation,compiler) pairs: 1, namely:
ImplementationCompiler
T:esp32clang -march=native -O3 -fwrapv -Qunused-arguments -fPIC -fPIE -gdwarf-4 -Wall (Ubuntu_Clang_21.1.8_(6ubuntu1))

Compiler output


try.c: /usr/bin/x86_64-linux-gnu-ld.bfd: /tmp/try-small-cd6004.o: in function `doit':
try.c: .../supercop-data/hertz/amd64/try/c/clang_-march=native_-O_-fwrapv_-Qunused-arguments_-fPIC_-fPIE_-gdwarf-4_-Wall/timingleaks/crypto_aead/ascon128v12/esp32/work/./try.c:133:(.text+0x...): undefined reference to `crypto_aead_ascon128v12_esp32_timingleaks_encrypt'
try.c: /usr/bin/x86_64-linux-gnu-ld.bfd: .../supercop-data/hertz/amd64/try/c/clang_-march=native_-O_-fwrapv_-Qunused-arguments_-fPIC_-fPIE_-gdwarf-4_-Wall/timingleaks/crypto_aead/ascon128v12/esp32/work/./try.c:135:(.text+0x...): undefined reference to `crypto_aead_ascon128v12_esp32_timingleaks_decrypt'
try.c: /usr/bin/x86_64-linux-gnu-ld.bfd: /tmp/try-small-cd6004.o: in function `test':
try.c: .../supercop-data/hertz/amd64/try/c/clang_-march=native_-O_-fwrapv_-Qunused-arguments_-fPIC_-fPIE_-gdwarf-4_-Wall/timingleaks/crypto_aead/ascon128v12/esp32/work/./try.c:159:(.text+0x...): undefined reference to `crypto_aead_ascon128v12_esp32_timingleaks_encrypt'
try.c: /usr/bin/x86_64-linux-gnu-ld.bfd: .../supercop-data/hertz/amd64/try/c/clang_-march=native_-O_-fwrapv_-Qunused-arguments_-fPIC_-fPIE_-gdwarf-4_-Wall/timingleaks/crypto_aead/ascon128v12/esp32/work/./try.c:189:(.text+0x...): undefined reference to `crypto_aead_ascon128v12_esp32_timingleaks_encrypt'
try.c: /usr/bin/x86_64-linux-gnu-ld.bfd: .../supercop-data/hertz/amd64/try/c/clang_-march=native_-O_-fwrapv_-Qunused-arguments_-fPIC_-fPIE_-gdwarf-4_-Wall/timingleaks/crypto_aead/ascon128v12/esp32/work/./try.c:300:(.text+0x...): undefined reference to `crypto_aead_ascon128v12_esp32_timingleaks_decrypt'
try.c: /usr/bin/x86_64-linux-gnu-ld.bfd: .../supercop-data/hertz/amd64/try/c/clang_-march=native_-O_-fwrapv_-Qunused-arguments_-fPIC_-fPIE_-gdwarf-4_-Wall/timingleaks/crypto_aead/ascon128v12/esp32/work/./try.c:331:(.text+0x...): undefined reference to `crypto_aead_ascon128v12_esp32_timingleaks_decrypt'
try.c: /usr/bin/x86_64-linux-gnu-ld.bfd: .../supercop-data/hertz/amd64/try/c/clang_-march=native_-O_-fwrapv_-Qunused-arguments_-fPIC_-fPIE_-gdwarf-4_-Wall/timingleaks/crypto_aead/ascon128v12/esp32/work/./try.c:476:(.text+0x...): undefined reference to `crypto_aead_ascon128v12_esp32_timingleaks_decrypt'
try.c: /usr/bin/x86_64-linux-gnu-ld.bfd: .../supercop-data/hertz/amd64/try/c/clang_-march=native_-O_-fwrapv_-Qunused-arguments_-fPIC_-fPIE_-gdwarf-4_-Wall/timingleaks/crypto_aead/ascon128v12/esp32/work/./try.c:480:(.text+0x...): undefined reference to `crypto_aead_ascon128v12_esp32_timingleaks_decrypt'
try.c: /usr/bin/x86_64-linux-gnu-ld.bfd: .../supercop-data/hertz/amd64/try/c/clang_-march=native_-O_-fwrapv_-Qunused-arguments_-fPIC_-fPIE_-gdwarf-4_-Wall/timingleaks/crypto_aead/ascon128v12/esp32/work/./try.c:484:(.text+0x...): undefined reference to `crypto_aead_ascon128v12_esp32_timingleaks_decrypt'
try.c: clang: error: linker command failed with exit code 1 (use -v to see invocation)

Number of similar (implementation,compiler) pairs: 1, namely:
ImplementationCompiler
T:esp32clang -march=native -O -fwrapv -Qunused-arguments -fPIC -fPIE -gdwarf-4 -Wall (Ubuntu_Clang_21.1.8_(6ubuntu1))

Compiler output


try.c: /usr/bin/x86_64-linux-gnu-ld.bfd: /tmp/try-small-c5eee7.o: in function `doit':
try.c: .../supercop-data/hertz/amd64/try/c/clang_-march=native_-Os_-fwrapv_-Qunused-arguments_-fPIC_-fPIE_-gdwarf-4_-Wall/timingleaks/crypto_aead/ascon128v12/esp32/work/./try.c:133:(.text+0x...): undefined reference to `crypto_aead_ascon128v12_esp32_timingleaks_encrypt'
try.c: /usr/bin/x86_64-linux-gnu-ld.bfd: .../supercop-data/hertz/amd64/try/c/clang_-march=native_-Os_-fwrapv_-Qunused-arguments_-fPIC_-fPIE_-gdwarf-4_-Wall/timingleaks/crypto_aead/ascon128v12/esp32/work/./try.c:135:(.text+0x...): undefined reference to `crypto_aead_ascon128v12_esp32_timingleaks_decrypt'
try.c: /usr/bin/x86_64-linux-gnu-ld.bfd: /tmp/try-small-c5eee7.o: in function `test':
try.c: .../supercop-data/hertz/amd64/try/c/clang_-march=native_-Os_-fwrapv_-Qunused-arguments_-fPIC_-fPIE_-gdwarf-4_-Wall/timingleaks/crypto_aead/ascon128v12/esp32/work/./try.c:159:(.text+0x...): undefined reference to `crypto_aead_ascon128v12_esp32_timingleaks_encrypt'
try.c: /usr/bin/x86_64-linux-gnu-ld.bfd: .../supercop-data/hertz/amd64/try/c/clang_-march=native_-Os_-fwrapv_-Qunused-arguments_-fPIC_-fPIE_-gdwarf-4_-Wall/timingleaks/crypto_aead/ascon128v12/esp32/work/./try.c:189:(.text+0x...): undefined reference to `crypto_aead_ascon128v12_esp32_timingleaks_encrypt'
try.c: /usr/bin/x86_64-linux-gnu-ld.bfd: .../supercop-data/hertz/amd64/try/c/clang_-march=native_-Os_-fwrapv_-Qunused-arguments_-fPIC_-fPIE_-gdwarf-4_-Wall/timingleaks/crypto_aead/ascon128v12/esp32/work/./try.c:300:(.text+0x...): undefined reference to `crypto_aead_ascon128v12_esp32_timingleaks_decrypt'
try.c: /usr/bin/x86_64-linux-gnu-ld.bfd: .../supercop-data/hertz/amd64/try/c/clang_-march=native_-Os_-fwrapv_-Qunused-arguments_-fPIC_-fPIE_-gdwarf-4_-Wall/timingleaks/crypto_aead/ascon128v12/esp32/work/./try.c:331:(.text+0x...): undefined reference to `crypto_aead_ascon128v12_esp32_timingleaks_decrypt'
try.c: /usr/bin/x86_64-linux-gnu-ld.bfd: .../supercop-data/hertz/amd64/try/c/clang_-march=native_-Os_-fwrapv_-Qunused-arguments_-fPIC_-fPIE_-gdwarf-4_-Wall/timingleaks/crypto_aead/ascon128v12/esp32/work/./try.c:476:(.text+0x...): undefined reference to `crypto_aead_ascon128v12_esp32_timingleaks_decrypt'
try.c: /usr/bin/x86_64-linux-gnu-ld.bfd: .../supercop-data/hertz/amd64/try/c/clang_-march=native_-Os_-fwrapv_-Qunused-arguments_-fPIC_-fPIE_-gdwarf-4_-Wall/timingleaks/crypto_aead/ascon128v12/esp32/work/./try.c:480:(.text+0x...): undefined reference to `crypto_aead_ascon128v12_esp32_timingleaks_decrypt'
try.c: /usr/bin/x86_64-linux-gnu-ld.bfd: .../supercop-data/hertz/amd64/try/c/clang_-march=native_-Os_-fwrapv_-Qunused-arguments_-fPIC_-fPIE_-gdwarf-4_-Wall/timingleaks/crypto_aead/ascon128v12/esp32/work/./try.c:484:(.text+0x...): undefined reference to `crypto_aead_ascon128v12_esp32_timingleaks_decrypt'
try.c: clang: error: linker command failed with exit code 1 (use -v to see invocation)

Number of similar (implementation,compiler) pairs: 1, namely:
ImplementationCompiler
T:esp32clang -march=native -Os -fwrapv -Qunused-arguments -fPIC -fPIE -gdwarf-4 -Wall (Ubuntu_Clang_21.1.8_(6ubuntu1))

Compiler output


try.c: /usr/bin/x86_64-linux-gnu-ld.bfd: /tmp/ccYyPogH.o: in function `doit':
try.c: .../supercop-data/hertz/amd64/try/c/gcc_-march=native_-mtune=native_-O2_-fwrapv_-fPIC_-fPIE_-gdwarf-4_-Wall/timingleaks/crypto_aead/ascon128v12/esp32/work/try.c:133:(.text+0x...): undefined reference to `crypto_aead_ascon128v12_esp32_timingleaks_encrypt'
try.c: /usr/bin/x86_64-linux-gnu-ld.bfd: .../supercop-data/hertz/amd64/try/c/gcc_-march=native_-mtune=native_-O2_-fwrapv_-fPIC_-fPIE_-gdwarf-4_-Wall/timingleaks/crypto_aead/ascon128v12/esp32/work/try.c:135:(.text+0x...): undefined reference to `crypto_aead_ascon128v12_esp32_timingleaks_decrypt'
try.c: /usr/bin/x86_64-linux-gnu-ld.bfd: /tmp/ccYyPogH.o: in function `test':
try.c: .../supercop-data/hertz/amd64/try/c/gcc_-march=native_-mtune=native_-O2_-fwrapv_-fPIC_-fPIE_-gdwarf-4_-Wall/timingleaks/crypto_aead/ascon128v12/esp32/work/try.c:189:(.text+0x...): undefined reference to `crypto_aead_ascon128v12_esp32_timingleaks_encrypt'
try.c: /usr/bin/x86_64-linux-gnu-ld.bfd: .../supercop-data/hertz/amd64/try/c/gcc_-march=native_-mtune=native_-O2_-fwrapv_-fPIC_-fPIE_-gdwarf-4_-Wall/timingleaks/crypto_aead/ascon128v12/esp32/work/try.c:300:(.text+0x...): undefined reference to `crypto_aead_ascon128v12_esp32_timingleaks_decrypt'
try.c: /usr/bin/x86_64-linux-gnu-ld.bfd: .../supercop-data/hertz/amd64/try/c/gcc_-march=native_-mtune=native_-O2_-fwrapv_-fPIC_-fPIE_-gdwarf-4_-Wall/timingleaks/crypto_aead/ascon128v12/esp32/work/try.c:331:(.text+0x...): undefined reference to `crypto_aead_ascon128v12_esp32_timingleaks_decrypt'
try.c: /usr/bin/x86_64-linux-gnu-ld.bfd: .../supercop-data/hertz/amd64/try/c/gcc_-march=native_-mtune=native_-O2_-fwrapv_-fPIC_-fPIE_-gdwarf-4_-Wall/timingleaks/crypto_aead/ascon128v12/esp32/work/try.c:476:(.text+0x...): undefined reference to `crypto_aead_ascon128v12_esp32_timingleaks_decrypt'
try.c: /usr/bin/x86_64-linux-gnu-ld.bfd: .../supercop-data/hertz/amd64/try/c/gcc_-march=native_-mtune=native_-O2_-fwrapv_-fPIC_-fPIE_-gdwarf-4_-Wall/timingleaks/crypto_aead/ascon128v12/esp32/work/try.c:480:(.text+0x...): undefined reference to `crypto_aead_ascon128v12_esp32_timingleaks_decrypt'
try.c: /usr/bin/x86_64-linux-gnu-ld.bfd: .../supercop-data/hertz/amd64/try/c/gcc_-march=native_-mtune=native_-O2_-fwrapv_-fPIC_-fPIE_-gdwarf-4_-Wall/timingleaks/crypto_aead/ascon128v12/esp32/work/try.c:484:(.text+0x...): undefined reference to `crypto_aead_ascon128v12_esp32_timingleaks_decrypt'
try.c: /usr/bin/x86_64-linux-gnu-ld.bfd: .../supercop-data/hertz/amd64/try/c/gcc_-march=native_-mtune=native_-O2_-fwrapv_-fPIC_-fPIE_-gdwarf-4_-Wall/timingleaks/crypto_aead/ascon128v12/esp32/work/try.c:159:(.text+0x...): undefined reference to `crypto_aead_ascon128v12_esp32_timingleaks_encrypt'
try.c: collect2: error: ld returned 1 exit status

Number of similar (implementation,compiler) pairs: 1, namely:
ImplementationCompiler
T:esp32gcc -march=native -mtune=native -O2 -fwrapv -fPIC -fPIE -gdwarf-4 -Wall (15.2.0)

Compiler output


try.c: /usr/bin/x86_64-linux-gnu-ld.bfd: /tmp/ccx54O6g.o: in function `doit':
try.c: .../supercop-data/hertz/amd64/try/c/gcc_-march=native_-mtune=native_-O3_-fwrapv_-fPIC_-fPIE_-gdwarf-4_-Wall/timingleaks/crypto_aead/ascon128v12/esp32/work/try.c:133:(.text+0x...): undefined reference to `crypto_aead_ascon128v12_esp32_timingleaks_encrypt'
try.c: /usr/bin/x86_64-linux-gnu-ld.bfd: .../supercop-data/hertz/amd64/try/c/gcc_-march=native_-mtune=native_-O3_-fwrapv_-fPIC_-fPIE_-gdwarf-4_-Wall/timingleaks/crypto_aead/ascon128v12/esp32/work/try.c:135:(.text+0x...): undefined reference to `crypto_aead_ascon128v12_esp32_timingleaks_decrypt'
try.c: /usr/bin/x86_64-linux-gnu-ld.bfd: /tmp/ccx54O6g.o: in function `test':
try.c: .../supercop-data/hertz/amd64/try/c/gcc_-march=native_-mtune=native_-O3_-fwrapv_-fPIC_-fPIE_-gdwarf-4_-Wall/timingleaks/crypto_aead/ascon128v12/esp32/work/try.c:189:(.text+0x...): undefined reference to `crypto_aead_ascon128v12_esp32_timingleaks_encrypt'
try.c: /usr/bin/x86_64-linux-gnu-ld.bfd: .../supercop-data/hertz/amd64/try/c/gcc_-march=native_-mtune=native_-O3_-fwrapv_-fPIC_-fPIE_-gdwarf-4_-Wall/timingleaks/crypto_aead/ascon128v12/esp32/work/try.c:300:(.text+0x...): undefined reference to `crypto_aead_ascon128v12_esp32_timingleaks_decrypt'
try.c: /usr/bin/x86_64-linux-gnu-ld.bfd: .../supercop-data/hertz/amd64/try/c/gcc_-march=native_-mtune=native_-O3_-fwrapv_-fPIC_-fPIE_-gdwarf-4_-Wall/timingleaks/crypto_aead/ascon128v12/esp32/work/try.c:331:(.text+0x...): undefined reference to `crypto_aead_ascon128v12_esp32_timingleaks_decrypt'
try.c: /usr/bin/x86_64-linux-gnu-ld.bfd: .../supercop-data/hertz/amd64/try/c/gcc_-march=native_-mtune=native_-O3_-fwrapv_-fPIC_-fPIE_-gdwarf-4_-Wall/timingleaks/crypto_aead/ascon128v12/esp32/work/try.c:476:(.text+0x...): undefined reference to `crypto_aead_ascon128v12_esp32_timingleaks_decrypt'
try.c: /usr/bin/x86_64-linux-gnu-ld.bfd: .../supercop-data/hertz/amd64/try/c/gcc_-march=native_-mtune=native_-O3_-fwrapv_-fPIC_-fPIE_-gdwarf-4_-Wall/timingleaks/crypto_aead/ascon128v12/esp32/work/try.c:480:(.text+0x...): undefined reference to `crypto_aead_ascon128v12_esp32_timingleaks_decrypt'
try.c: /usr/bin/x86_64-linux-gnu-ld.bfd: .../supercop-data/hertz/amd64/try/c/gcc_-march=native_-mtune=native_-O3_-fwrapv_-fPIC_-fPIE_-gdwarf-4_-Wall/timingleaks/crypto_aead/ascon128v12/esp32/work/try.c:484:(.text+0x...): undefined reference to `crypto_aead_ascon128v12_esp32_timingleaks_decrypt'
try.c: /usr/bin/x86_64-linux-gnu-ld.bfd: .../supercop-data/hertz/amd64/try/c/gcc_-march=native_-mtune=native_-O3_-fwrapv_-fPIC_-fPIE_-gdwarf-4_-Wall/timingleaks/crypto_aead/ascon128v12/esp32/work/try.c:159:(.text+0x...): undefined reference to `crypto_aead_ascon128v12_esp32_timingleaks_encrypt'
try.c: collect2: error: ld returned 1 exit status

Number of similar (implementation,compiler) pairs: 1, namely:
ImplementationCompiler
T:esp32gcc -march=native -mtune=native -O3 -fwrapv -fPIC -fPIE -gdwarf-4 -Wall (15.2.0)

Compiler output


try.c: /usr/bin/x86_64-linux-gnu-ld.bfd: /tmp/ccQ4uuck.o: in function `doit':
try.c: .../supercop-data/hertz/amd64/try/c/gcc_-march=native_-mtune=native_-O_-fwrapv_-fPIC_-fPIE_-gdwarf-4_-Wall/timingleaks/crypto_aead/ascon128v12/esp32/work/try.c:133:(.text+0x...): undefined reference to `crypto_aead_ascon128v12_esp32_timingleaks_encrypt'
try.c: /usr/bin/x86_64-linux-gnu-ld.bfd: .../supercop-data/hertz/amd64/try/c/gcc_-march=native_-mtune=native_-O_-fwrapv_-fPIC_-fPIE_-gdwarf-4_-Wall/timingleaks/crypto_aead/ascon128v12/esp32/work/try.c:135:(.text+0x...): undefined reference to `crypto_aead_ascon128v12_esp32_timingleaks_decrypt'
try.c: /usr/bin/x86_64-linux-gnu-ld.bfd: /tmp/ccQ4uuck.o: in function `test':
try.c: .../supercop-data/hertz/amd64/try/c/gcc_-march=native_-mtune=native_-O_-fwrapv_-fPIC_-fPIE_-gdwarf-4_-Wall/timingleaks/crypto_aead/ascon128v12/esp32/work/try.c:159:(.text+0x...): undefined reference to `crypto_aead_ascon128v12_esp32_timingleaks_encrypt'
try.c: /usr/bin/x86_64-linux-gnu-ld.bfd: .../supercop-data/hertz/amd64/try/c/gcc_-march=native_-mtune=native_-O_-fwrapv_-fPIC_-fPIE_-gdwarf-4_-Wall/timingleaks/crypto_aead/ascon128v12/esp32/work/try.c:189:(.text+0x...): undefined reference to `crypto_aead_ascon128v12_esp32_timingleaks_encrypt'
try.c: /usr/bin/x86_64-linux-gnu-ld.bfd: .../supercop-data/hertz/amd64/try/c/gcc_-march=native_-mtune=native_-O_-fwrapv_-fPIC_-fPIE_-gdwarf-4_-Wall/timingleaks/crypto_aead/ascon128v12/esp32/work/try.c:300:(.text+0x...): undefined reference to `crypto_aead_ascon128v12_esp32_timingleaks_decrypt'
try.c: /usr/bin/x86_64-linux-gnu-ld.bfd: .../supercop-data/hertz/amd64/try/c/gcc_-march=native_-mtune=native_-O_-fwrapv_-fPIC_-fPIE_-gdwarf-4_-Wall/timingleaks/crypto_aead/ascon128v12/esp32/work/try.c:331:(.text+0x...): undefined reference to `crypto_aead_ascon128v12_esp32_timingleaks_decrypt'
try.c: /usr/bin/x86_64-linux-gnu-ld.bfd: .../supercop-data/hertz/amd64/try/c/gcc_-march=native_-mtune=native_-O_-fwrapv_-fPIC_-fPIE_-gdwarf-4_-Wall/timingleaks/crypto_aead/ascon128v12/esp32/work/try.c:476:(.text+0x...): undefined reference to `crypto_aead_ascon128v12_esp32_timingleaks_decrypt'
try.c: /usr/bin/x86_64-linux-gnu-ld.bfd: .../supercop-data/hertz/amd64/try/c/gcc_-march=native_-mtune=native_-O_-fwrapv_-fPIC_-fPIE_-gdwarf-4_-Wall/timingleaks/crypto_aead/ascon128v12/esp32/work/try.c:480:(.text+0x...): undefined reference to `crypto_aead_ascon128v12_esp32_timingleaks_decrypt'
try.c: /usr/bin/x86_64-linux-gnu-ld.bfd: .../supercop-data/hertz/amd64/try/c/gcc_-march=native_-mtune=native_-O_-fwrapv_-fPIC_-fPIE_-gdwarf-4_-Wall/timingleaks/crypto_aead/ascon128v12/esp32/work/try.c:484:(.text+0x...): undefined reference to `crypto_aead_ascon128v12_esp32_timingleaks_decrypt'
try.c: collect2: error: ld returned 1 exit status

Number of similar (implementation,compiler) pairs: 1, namely:
ImplementationCompiler
T:esp32gcc -march=native -mtune=native -O -fwrapv -fPIC -fPIE -gdwarf-4 -Wall (15.2.0)

Compiler output


try.c: /usr/bin/x86_64-linux-gnu-ld.bfd: /tmp/cc655pHK.o: in function `doit':
try.c: .../supercop-data/hertz/amd64/try/c/gcc_-march=native_-mtune=native_-Os_-fwrapv_-fPIC_-fPIE_-gdwarf-4_-Wall/timingleaks/crypto_aead/ascon128v12/esp32/work/try.c:133:(.text+0x...): undefined reference to `crypto_aead_ascon128v12_esp32_timingleaks_encrypt'
try.c: /usr/bin/x86_64-linux-gnu-ld.bfd: .../supercop-data/hertz/amd64/try/c/gcc_-march=native_-mtune=native_-Os_-fwrapv_-fPIC_-fPIE_-gdwarf-4_-Wall/timingleaks/crypto_aead/ascon128v12/esp32/work/try.c:135:(.text+0x...): undefined reference to `crypto_aead_ascon128v12_esp32_timingleaks_decrypt'
try.c: /usr/bin/x86_64-linux-gnu-ld.bfd: /tmp/cc655pHK.o: in function `test':
try.c: .../supercop-data/hertz/amd64/try/c/gcc_-march=native_-mtune=native_-Os_-fwrapv_-fPIC_-fPIE_-gdwarf-4_-Wall/timingleaks/crypto_aead/ascon128v12/esp32/work/try.c:159:(.text+0x...): undefined reference to `crypto_aead_ascon128v12_esp32_timingleaks_encrypt'
try.c: /usr/bin/x86_64-linux-gnu-ld.bfd: .../supercop-data/hertz/amd64/try/c/gcc_-march=native_-mtune=native_-Os_-fwrapv_-fPIC_-fPIE_-gdwarf-4_-Wall/timingleaks/crypto_aead/ascon128v12/esp32/work/try.c:189:(.text+0x...): undefined reference to `crypto_aead_ascon128v12_esp32_timingleaks_encrypt'
try.c: /usr/bin/x86_64-linux-gnu-ld.bfd: .../supercop-data/hertz/amd64/try/c/gcc_-march=native_-mtune=native_-Os_-fwrapv_-fPIC_-fPIE_-gdwarf-4_-Wall/timingleaks/crypto_aead/ascon128v12/esp32/work/try.c:300:(.text+0x...): undefined reference to `crypto_aead_ascon128v12_esp32_timingleaks_decrypt'
try.c: /usr/bin/x86_64-linux-gnu-ld.bfd: .../supercop-data/hertz/amd64/try/c/gcc_-march=native_-mtune=native_-Os_-fwrapv_-fPIC_-fPIE_-gdwarf-4_-Wall/timingleaks/crypto_aead/ascon128v12/esp32/work/try.c:331:(.text+0x...): undefined reference to `crypto_aead_ascon128v12_esp32_timingleaks_decrypt'
try.c: /usr/bin/x86_64-linux-gnu-ld.bfd: .../supercop-data/hertz/amd64/try/c/gcc_-march=native_-mtune=native_-Os_-fwrapv_-fPIC_-fPIE_-gdwarf-4_-Wall/timingleaks/crypto_aead/ascon128v12/esp32/work/try.c:476:(.text+0x...): undefined reference to `crypto_aead_ascon128v12_esp32_timingleaks_decrypt'
try.c: /usr/bin/x86_64-linux-gnu-ld.bfd: .../supercop-data/hertz/amd64/try/c/gcc_-march=native_-mtune=native_-Os_-fwrapv_-fPIC_-fPIE_-gdwarf-4_-Wall/timingleaks/crypto_aead/ascon128v12/esp32/work/try.c:480:(.text+0x...): undefined reference to `crypto_aead_ascon128v12_esp32_timingleaks_decrypt'
try.c: /usr/bin/x86_64-linux-gnu-ld.bfd: .../supercop-data/hertz/amd64/try/c/gcc_-march=native_-mtune=native_-Os_-fwrapv_-fPIC_-fPIE_-gdwarf-4_-Wall/timingleaks/crypto_aead/ascon128v12/esp32/work/try.c:484:(.text+0x...): undefined reference to `crypto_aead_ascon128v12_esp32_timingleaks_decrypt'
try.c: collect2: error: ld returned 1 exit status

Number of similar (implementation,compiler) pairs: 1, namely:
ImplementationCompiler
T:esp32gcc -march=native -mtune=native -Os -fwrapv -fPIC -fPIE -gdwarf-4 -Wall (15.2.0)

Compiler output


aead.c: In file included from round.h:8,
aead.c:                  from permutations.h:11,
aead.c:                  from aead.c:5:
aead.c: In function 'memxor',
aead.c:     inlined from 'ascon_final' at aead.c:145:3:
aead.c: word.h:102:12: warning: writing 1 byte into a region of size 0 [-Wstringop-overflow=]
aead.c:   102 |     *dst++ ^= *src++;
aead.c:       |            ^~
aead.c: aead.c: In function 'ascon_final':
aead.c: aead.c:134:45: note: at offset 32 into destination object 's' of size [0, 32]
aead.c:   134 | forceinline void ascon_final(ascon_state_t* s, const ascon_key_t* key) {
aead.c:       |                              ~~~~~~~~~~~~~~~^
aead.c: In function 'memxor',
aead.c:     inlined from 'ascon_final' at aead.c:145:3:
aead.c: word.h:102:12: warning: writing 1 byte into a region of size 0 [-Wstringop-overflow=]
aead.c:   102 |     *dst++ ^= *src++;
aead.c:       |            ^~
aead.c: aead.c: In function 'ascon_final':
aead.c: aead.c:134:45: note: at offset 33 into destination object 's' of size [0, 32]
aead.c:   134 | forceinline void ascon_final(ascon_state_t* s, const ascon_key_t* key) {
aead.c:       |                              ~~~~~~~~~~~~~~~^
aead.c: In function 'memxor',
aead.c:     inlined from 'ascon_final' at aead.c:145:3:
aead.c: word.h:102:12: warning: writing 1 byte into a region of size 0 [-Wstringop-overflow=]
aead.c:   102 |     *dst++ ^= *src++;
aead.c: ...

Number of similar (implementation,compiler) pairs: 1, namely:
ImplementationCompiler
opt8gcc -march=native -mtune=native -O3 -fwrapv -fPIC -fPIE -gdwarf-4 -Wall (15.2.0)

Compiler output


aead.c: In file included from round.h:8,
aead.c:                  from permutations.h:11,
aead.c:                  from aead.c:5:
aead.c: In function 'memxor',
aead.c:     inlined from 'ascon_final' at aead.c:60:3:
aead.c: word.h:102:12: warning: writing 1 byte into a region of size 0 [-Wstringop-overflow=]
aead.c:   102 |     *dst++ ^= *src++;
aead.c:       |            ^~
aead.c: aead.c: In function 'ascon_final':
aead.c: aead.c:49:45: note: at offset 32 into destination object 's' of size [0, 32]
aead.c:    49 | forceinline void ascon_final(ascon_state_t* s, const ascon_key_t* key) {
aead.c:       |                              ~~~~~~~~~~~~~~~^
aead.c: In function 'memxor',
aead.c:     inlined from 'ascon_final' at aead.c:60:3:
aead.c: word.h:102:12: warning: writing 1 byte into a region of size 0 [-Wstringop-overflow=]
aead.c:   102 |     *dst++ ^= *src++;
aead.c:       |            ^~
aead.c: aead.c: In function 'ascon_final':
aead.c: aead.c:49:45: note: at offset 33 into destination object 's' of size [0, 32]
aead.c:    49 | forceinline void ascon_final(ascon_state_t* s, const ascon_key_t* key) {
aead.c:       |                              ~~~~~~~~~~~~~~~^
aead.c: In function 'memxor',
aead.c:     inlined from 'ascon_final' at aead.c:60:3:
aead.c: word.h:102:12: warning: writing 1 byte into a region of size 0 [-Wstringop-overflow=]
aead.c:   102 |     *dst++ ^= *src++;
aead.c: ...

Number of similar (implementation,compiler) pairs: 1, namely:
ImplementationCompiler
opt8_lowsizegcc -march=native -mtune=native -O3 -fwrapv -fPIC -fPIE -gdwarf-4 -Wall (15.2.0)

Namespace violations


constants.o constants R
interleave.o B R
permutations.o P12 T
permutations.o P6 T

Number of similar (implementation,compiler) pairs: 8, namely:
ImplementationCompiler
bi32clang -march=native -O2 -fwrapv -Qunused-arguments -fPIC -fPIE -gdwarf-4 -Wall (Ubuntu_Clang_21.1.8_(6ubuntu1))
bi32clang -march=native -O3 -fwrapv -Qunused-arguments -fPIC -fPIE -gdwarf-4 -Wall (Ubuntu_Clang_21.1.8_(6ubuntu1))
bi32clang -march=native -O -fwrapv -Qunused-arguments -fPIC -fPIE -gdwarf-4 -Wall (Ubuntu_Clang_21.1.8_(6ubuntu1))
bi32clang -march=native -Os -fwrapv -Qunused-arguments -fPIC -fPIE -gdwarf-4 -Wall (Ubuntu_Clang_21.1.8_(6ubuntu1))
bi32gcc -march=native -mtune=native -O2 -fwrapv -fPIC -fPIE -gdwarf-4 -Wall (15.2.0)
bi32gcc -march=native -mtune=native -O3 -fwrapv -fPIC -fPIE -gdwarf-4 -Wall (15.2.0)
bi32gcc -march=native -mtune=native -O -fwrapv -fPIC -fPIE -gdwarf-4 -Wall (15.2.0)
bi32gcc -march=native -mtune=native -Os -fwrapv -fPIC -fPIE -gdwarf-4 -Wall (15.2.0)

Namespace violations


aead.o ascon_adata T
aead.o ascon_decrypt T
aead.o ascon_encrypt T
aead.o ascon_final T
aead.o ascon_initaead T
aead.o ascon_loadkey T
constants.o constants R
interleave.o B R

Number of similar (implementation,compiler) pairs: 8, namely:
ImplementationCompiler
bi32_lowregclang -march=native -O2 -fwrapv -Qunused-arguments -fPIC -fPIE -gdwarf-4 -Wall (Ubuntu_Clang_21.1.8_(6ubuntu1))
bi32_lowregclang -march=native -O3 -fwrapv -Qunused-arguments -fPIC -fPIE -gdwarf-4 -Wall (Ubuntu_Clang_21.1.8_(6ubuntu1))
bi32_lowregclang -march=native -O -fwrapv -Qunused-arguments -fPIC -fPIE -gdwarf-4 -Wall (Ubuntu_Clang_21.1.8_(6ubuntu1))
bi32_lowregclang -march=native -Os -fwrapv -Qunused-arguments -fPIC -fPIE -gdwarf-4 -Wall (Ubuntu_Clang_21.1.8_(6ubuntu1))
bi32_lowreggcc -march=native -mtune=native -O2 -fwrapv -fPIC -fPIE -gdwarf-4 -Wall (15.2.0)
bi32_lowreggcc -march=native -mtune=native -O3 -fwrapv -fPIC -fPIE -gdwarf-4 -Wall (15.2.0)
bi32_lowreggcc -march=native -mtune=native -O -fwrapv -fPIC -fPIE -gdwarf-4 -Wall (15.2.0)
bi32_lowreggcc -march=native -mtune=native -Os -fwrapv -fPIC -fPIE -gdwarf-4 -Wall (15.2.0)

Namespace violations


aead.o ascon_aead T
constants.o constants R
interleave.o B R
interleave.o FROMBI T
interleave.o TOBI T
permutations.o P T
update.o ascon_update T

Number of similar (implementation,compiler) pairs: 8, namely:
ImplementationCompiler
bi32_lowsizeclang -march=native -O2 -fwrapv -Qunused-arguments -fPIC -fPIE -gdwarf-4 -Wall (Ubuntu_Clang_21.1.8_(6ubuntu1))
bi32_lowsizeclang -march=native -O3 -fwrapv -Qunused-arguments -fPIC -fPIE -gdwarf-4 -Wall (Ubuntu_Clang_21.1.8_(6ubuntu1))
bi32_lowsizeclang -march=native -O -fwrapv -Qunused-arguments -fPIC -fPIE -gdwarf-4 -Wall (Ubuntu_Clang_21.1.8_(6ubuntu1))
bi32_lowsizeclang -march=native -Os -fwrapv -Qunused-arguments -fPIC -fPIE -gdwarf-4 -Wall (Ubuntu_Clang_21.1.8_(6ubuntu1))
bi32_lowsizegcc -march=native -mtune=native -O2 -fwrapv -fPIC -fPIE -gdwarf-4 -Wall (15.2.0)
bi32_lowsizegcc -march=native -mtune=native -O3 -fwrapv -fPIC -fPIE -gdwarf-4 -Wall (15.2.0)
bi32_lowsizegcc -march=native -mtune=native -O -fwrapv -fPIC -fPIE -gdwarf-4 -Wall (15.2.0)
bi32_lowsizegcc -march=native -mtune=native -Os -fwrapv -fPIC -fPIE -gdwarf-4 -Wall (15.2.0)

Namespace violations


constants.o constants R
interleave.o FROMBI T
interleave.o TOBI T
permutations.o P T

Number of similar (implementation,compiler) pairs: 8, namely:
ImplementationCompiler
bi8clang -march=native -O2 -fwrapv -Qunused-arguments -fPIC -fPIE -gdwarf-4 -Wall (Ubuntu_Clang_21.1.8_(6ubuntu1))
bi8clang -march=native -O3 -fwrapv -Qunused-arguments -fPIC -fPIE -gdwarf-4 -Wall (Ubuntu_Clang_21.1.8_(6ubuntu1))
bi8clang -march=native -O -fwrapv -Qunused-arguments -fPIC -fPIE -gdwarf-4 -Wall (Ubuntu_Clang_21.1.8_(6ubuntu1))
bi8clang -march=native -Os -fwrapv -Qunused-arguments -fPIC -fPIE -gdwarf-4 -Wall (Ubuntu_Clang_21.1.8_(6ubuntu1))
bi8gcc -march=native -mtune=native -O2 -fwrapv -fPIC -fPIE -gdwarf-4 -Wall (15.2.0)
bi8gcc -march=native -mtune=native -O3 -fwrapv -fPIC -fPIE -gdwarf-4 -Wall (15.2.0)
bi8gcc -march=native -mtune=native -O -fwrapv -fPIC -fPIE -gdwarf-4 -Wall (15.2.0)
bi8gcc -march=native -mtune=native -Os -fwrapv -fPIC -fPIE -gdwarf-4 -Wall (15.2.0)

Namespace violations


aead.o ascon_aead T
permutations.o P T
update.o ascon_update T

Number of similar (implementation,compiler) pairs: 16, namely:
ImplementationCompiler
opt32_lowsizeclang -march=native -O2 -fwrapv -Qunused-arguments -fPIC -fPIE -gdwarf-4 -Wall (Ubuntu_Clang_21.1.8_(6ubuntu1))
opt32_lowsizeclang -march=native -O3 -fwrapv -Qunused-arguments -fPIC -fPIE -gdwarf-4 -Wall (Ubuntu_Clang_21.1.8_(6ubuntu1))
opt32_lowsizeclang -march=native -O -fwrapv -Qunused-arguments -fPIC -fPIE -gdwarf-4 -Wall (Ubuntu_Clang_21.1.8_(6ubuntu1))
opt32_lowsizeclang -march=native -Os -fwrapv -Qunused-arguments -fPIC -fPIE -gdwarf-4 -Wall (Ubuntu_Clang_21.1.8_(6ubuntu1))
opt32_lowsizegcc -march=native -mtune=native -O2 -fwrapv -fPIC -fPIE -gdwarf-4 -Wall (15.2.0)
opt32_lowsizegcc -march=native -mtune=native -O3 -fwrapv -fPIC -fPIE -gdwarf-4 -Wall (15.2.0)
opt32_lowsizegcc -march=native -mtune=native -O -fwrapv -fPIC -fPIE -gdwarf-4 -Wall (15.2.0)
opt32_lowsizegcc -march=native -mtune=native -Os -fwrapv -fPIC -fPIE -gdwarf-4 -Wall (15.2.0)
opt64_lowsizeclang -march=native -O2 -fwrapv -Qunused-arguments -fPIC -fPIE -gdwarf-4 -Wall (Ubuntu_Clang_21.1.8_(6ubuntu1))
opt64_lowsizeclang -march=native -O3 -fwrapv -Qunused-arguments -fPIC -fPIE -gdwarf-4 -Wall (Ubuntu_Clang_21.1.8_(6ubuntu1))
opt64_lowsizeclang -march=native -O -fwrapv -Qunused-arguments -fPIC -fPIE -gdwarf-4 -Wall (Ubuntu_Clang_21.1.8_(6ubuntu1))
opt64_lowsizeclang -march=native -Os -fwrapv -Qunused-arguments -fPIC -fPIE -gdwarf-4 -Wall (Ubuntu_Clang_21.1.8_(6ubuntu1))
opt64_lowsizegcc -march=native -mtune=native -O2 -fwrapv -fPIC -fPIE -gdwarf-4 -Wall (15.2.0)
opt64_lowsizegcc -march=native -mtune=native -O3 -fwrapv -fPIC -fPIE -gdwarf-4 -Wall (15.2.0)
opt64_lowsizegcc -march=native -mtune=native -O -fwrapv -fPIC -fPIE -gdwarf-4 -Wall (15.2.0)
opt64_lowsizegcc -march=native -mtune=native -Os -fwrapv -fPIC -fPIE -gdwarf-4 -Wall (15.2.0)

Namespace violations


aead.o ascon_adata T
aead.o ascon_decrypt T
aead.o ascon_encrypt T
aead.o ascon_final T
aead.o ascon_initaead T
aead.o ascon_loadkey T
permutations.o P T

Number of similar (implementation,compiler) pairs: 8, namely:
ImplementationCompiler
opt8clang -march=native -O2 -fwrapv -Qunused-arguments -fPIC -fPIE -gdwarf-4 -Wall (Ubuntu_Clang_21.1.8_(6ubuntu1))
opt8clang -march=native -O3 -fwrapv -Qunused-arguments -fPIC -fPIE -gdwarf-4 -Wall (Ubuntu_Clang_21.1.8_(6ubuntu1))
opt8clang -march=native -O -fwrapv -Qunused-arguments -fPIC -fPIE -gdwarf-4 -Wall (Ubuntu_Clang_21.1.8_(6ubuntu1))
opt8clang -march=native -Os -fwrapv -Qunused-arguments -fPIC -fPIE -gdwarf-4 -Wall (Ubuntu_Clang_21.1.8_(6ubuntu1))
opt8gcc -march=native -mtune=native -O2 -fwrapv -fPIC -fPIE -gdwarf-4 -Wall (15.2.0)
opt8gcc -march=native -mtune=native -O3 -fwrapv -fPIC -fPIE -gdwarf-4 -Wall (15.2.0)
opt8gcc -march=native -mtune=native -O -fwrapv -fPIC -fPIE -gdwarf-4 -Wall (15.2.0)
opt8gcc -march=native -mtune=native -Os -fwrapv -fPIC -fPIE -gdwarf-4 -Wall (15.2.0)

Namespace violations


aead.o ascon_final T
aead.o ascon_initaead T
aead.o ascon_loadkey T
permutations.o P T
update.o ascon_update T

Number of similar (implementation,compiler) pairs: 8, namely:
ImplementationCompiler
opt8_lowsizeclang -march=native -O2 -fwrapv -Qunused-arguments -fPIC -fPIE -gdwarf-4 -Wall (Ubuntu_Clang_21.1.8_(6ubuntu1))
opt8_lowsizeclang -march=native -O3 -fwrapv -Qunused-arguments -fPIC -fPIE -gdwarf-4 -Wall (Ubuntu_Clang_21.1.8_(6ubuntu1))
opt8_lowsizeclang -march=native -O -fwrapv -Qunused-arguments -fPIC -fPIE -gdwarf-4 -Wall (Ubuntu_Clang_21.1.8_(6ubuntu1))
opt8_lowsizeclang -march=native -Os -fwrapv -Qunused-arguments -fPIC -fPIE -gdwarf-4 -Wall (Ubuntu_Clang_21.1.8_(6ubuntu1))
opt8_lowsizegcc -march=native -mtune=native -O2 -fwrapv -fPIC -fPIE -gdwarf-4 -Wall (15.2.0)
opt8_lowsizegcc -march=native -mtune=native -O3 -fwrapv -fPIC -fPIE -gdwarf-4 -Wall (15.2.0)
opt8_lowsizegcc -march=native -mtune=native -O -fwrapv -fPIC -fPIE -gdwarf-4 -Wall (15.2.0)
opt8_lowsizegcc -march=native -mtune=native -Os -fwrapv -fPIC -fPIE -gdwarf-4 -Wall (15.2.0)

TIMECOP error (can be valgrind bug)


error 132

Process terminating with default action of signal 4 (SIGILL)
 Illegal opcode at address 0x4008718
   at 0x...: memset (string_fortified.h:59)
   by 0x...: cpucycles_works (wrapper.c:59)
   by 0x...: supercop_cpucycles_ticks_amd64_tsc_setup (amd64-tsc.c:28)
   by 0x...: cpucycles_init (wrapper.c:314)
   by 0x...: main (try-anything.c:330)
Illegal instruction (core dumped)

Number of similar (implementation,compiler) pairs: 1, namely:
ImplementationCompiler
bi32clang -march=native -O2 -fwrapv -Qunused-arguments -fPIC -fPIE -gdwarf-4 -Wall (Ubuntu_Clang_21.1.8_(6ubuntu1))

TIMECOP error (can be valgrind bug)


error 132

Process terminating with default action of signal 4 (SIGILL)
 Illegal opcode at address 0x40088D8
   at 0x...: memset (string_fortified.h:59)
   by 0x...: cpucycles_works (wrapper.c:59)
   by 0x...: supercop_cpucycles_ticks_amd64_tsc_setup (amd64-tsc.c:28)
   by 0x...: cpucycles_init (wrapper.c:314)
   by 0x...: main (try-anything.c:330)
Illegal instruction (core dumped)

Number of similar (implementation,compiler) pairs: 1, namely:
ImplementationCompiler
bi32clang -march=native -O3 -fwrapv -Qunused-arguments -fPIC -fPIE -gdwarf-4 -Wall (Ubuntu_Clang_21.1.8_(6ubuntu1))

TIMECOP error (can be valgrind bug)


error 132

Process terminating with default action of signal 4 (SIGILL)
 Illegal opcode at address 0x4007ED8
   at 0x...: memset (string_fortified.h:59)
   by 0x...: cpucycles_works (wrapper.c:59)
   by 0x...: supercop_cpucycles_ticks_amd64_tsc_setup (amd64-tsc.c:28)
   by 0x...: cpucycles_init (wrapper.c:314)
   by 0x...: main (try-anything.c:330)
Illegal instruction (core dumped)

Number of similar (implementation,compiler) pairs: 1, namely:
ImplementationCompiler
bi32clang -march=native -O -fwrapv -Qunused-arguments -fPIC -fPIE -gdwarf-4 -Wall (Ubuntu_Clang_21.1.8_(6ubuntu1))

TIMECOP error (can be valgrind bug)


error 132

Process terminating with default action of signal 4 (SIGILL)
 Illegal opcode at address 0x4007F18
   at 0x...: memset (string_fortified.h:59)
   by 0x...: cpucycles_works (wrapper.c:59)
   by 0x...: supercop_cpucycles_ticks_amd64_tsc_setup (amd64-tsc.c:28)
   by 0x...: cpucycles_init (wrapper.c:314)
   by 0x...: main (try-anything.c:330)
Illegal instruction (core dumped)

Number of similar (implementation,compiler) pairs: 1, namely:
ImplementationCompiler
bi32clang -march=native -Os -fwrapv -Qunused-arguments -fPIC -fPIE -gdwarf-4 -Wall (Ubuntu_Clang_21.1.8_(6ubuntu1))

TIMECOP error (can be valgrind bug)


error 132

Process terminating with default action of signal 4 (SIGILL)
 Illegal opcode at address 0x4008918
   at 0x...: memset (string_fortified.h:59)
   by 0x...: cpucycles_works (wrapper.c:59)
   by 0x...: supercop_cpucycles_ticks_amd64_tsc_setup (amd64-tsc.c:28)
   by 0x...: cpucycles_init (wrapper.c:314)
   by 0x...: main (try-anything.c:330)
Illegal instruction (core dumped)

Number of similar (implementation,compiler) pairs: 2, namely:
ImplementationCompiler
bi32gcc -march=native -mtune=native -O2 -fwrapv -fPIC -fPIE -gdwarf-4 -Wall (15.2.0)
opt64clang -march=native -Os -fwrapv -Qunused-arguments -fPIC -fPIE -gdwarf-4 -Wall (Ubuntu_Clang_21.1.8_(6ubuntu1))

TIMECOP error (can be valgrind bug)


error 132

Process terminating with default action of signal 4 (SIGILL)
 Illegal opcode at address 0x4008E18
   at 0x...: memset (string_fortified.h:59)
   by 0x...: cpucycles_works (wrapper.c:59)
   by 0x...: supercop_cpucycles_ticks_amd64_tsc_setup (amd64-tsc.c:28)
   by 0x...: cpucycles_init (wrapper.c:314)
   by 0x...: main (try-anything.c:330)
Illegal instruction (core dumped)

Number of similar (implementation,compiler) pairs: 1, namely:
ImplementationCompiler
bi32gcc -march=native -mtune=native -O3 -fwrapv -fPIC -fPIE -gdwarf-4 -Wall (15.2.0)

TIMECOP error (can be valgrind bug)


error 132

Process terminating with default action of signal 4 (SIGILL)
 Illegal opcode at address 0x4009158
   at 0x...: memset (string_fortified.h:59)
   by 0x...: cpucycles_works (wrapper.c:59)
   by 0x...: supercop_cpucycles_ticks_amd64_tsc_setup (amd64-tsc.c:28)
   by 0x...: cpucycles_init (wrapper.c:314)
   by 0x...: main (try-anything.c:330)
Illegal instruction (core dumped)

Number of similar (implementation,compiler) pairs: 1, namely:
ImplementationCompiler
bi32gcc -march=native -mtune=native -O -fwrapv -fPIC -fPIE -gdwarf-4 -Wall (15.2.0)

TIMECOP error (can be valgrind bug)


error 132

Process terminating with default action of signal 4 (SIGILL)
 Illegal opcode at address 0x4008018
   at 0x...: memset (string_fortified.h:59)
   by 0x...: cpucycles_works (wrapper.c:59)
   by 0x...: supercop_cpucycles_ticks_amd64_tsc_setup (amd64-tsc.c:28)
   by 0x...: cpucycles_init (wrapper.c:314)
   by 0x...: main (try-anything.c:330)
Illegal instruction (core dumped)

Number of similar (implementation,compiler) pairs: 1, namely:
ImplementationCompiler
bi32gcc -march=native -mtune=native -Os -fwrapv -fPIC -fPIE -gdwarf-4 -Wall (15.2.0)

TIMECOP error (can be valgrind bug)


error 132

Process terminating with default action of signal 4 (SIGILL)
 Illegal opcode at address 0x4007818
   at 0x...: memset (string_fortified.h:59)
   by 0x...: cpucycles_works (wrapper.c:59)
   by 0x...: supercop_cpucycles_ticks_amd64_tsc_setup (amd64-tsc.c:28)
   by 0x...: cpucycles_init (wrapper.c:314)
   by 0x...: main (try-anything.c:330)
Illegal instruction (core dumped)

Number of similar (implementation,compiler) pairs: 1, namely:
ImplementationCompiler
bi32_lowregclang -march=native -O2 -fwrapv -Qunused-arguments -fPIC -fPIE -gdwarf-4 -Wall (Ubuntu_Clang_21.1.8_(6ubuntu1))

TIMECOP error (can be valgrind bug)


error 132

Process terminating with default action of signal 4 (SIGILL)
 Illegal opcode at address 0x40079D8
   at 0x...: memset (string_fortified.h:59)
   by 0x...: cpucycles_works (wrapper.c:59)
   by 0x...: supercop_cpucycles_ticks_amd64_tsc_setup (amd64-tsc.c:28)
   by 0x...: cpucycles_init (wrapper.c:314)
   by 0x...: main (try-anything.c:330)
Illegal instruction (core dumped)

Number of similar (implementation,compiler) pairs: 1, namely:
ImplementationCompiler
bi32_lowregclang -march=native -O3 -fwrapv -Qunused-arguments -fPIC -fPIE -gdwarf-4 -Wall (Ubuntu_Clang_21.1.8_(6ubuntu1))

TIMECOP error (can be valgrind bug)


error 132

Process terminating with default action of signal 4 (SIGILL)
 Illegal opcode at address 0x4006E98
   at 0x...: memset (string_fortified.h:59)
   by 0x...: cpucycles_works (wrapper.c:59)
   by 0x...: supercop_cpucycles_ticks_amd64_tsc_setup (amd64-tsc.c:28)
   by 0x...: cpucycles_init (wrapper.c:314)
   by 0x...: main (try-anything.c:330)
Illegal instruction (core dumped)

Number of similar (implementation,compiler) pairs: 2, namely:
ImplementationCompiler
bi32_lowregclang -march=native -O -fwrapv -Qunused-arguments -fPIC -fPIE -gdwarf-4 -Wall (Ubuntu_Clang_21.1.8_(6ubuntu1))
refclang -march=native -O2 -fwrapv -Qunused-arguments -fPIC -fPIE -gdwarf-4 -Wall (Ubuntu_Clang_21.1.8_(6ubuntu1))

TIMECOP error (can be valgrind bug)


error 132

Process terminating with default action of signal 4 (SIGILL)
 Illegal opcode at address 0x4006F18
   at 0x...: memset (string_fortified.h:59)
   by 0x...: cpucycles_works (wrapper.c:59)
   by 0x...: supercop_cpucycles_ticks_amd64_tsc_setup (amd64-tsc.c:28)
   by 0x...: cpucycles_init (wrapper.c:314)
   by 0x...: main (try-anything.c:330)
Illegal instruction (core dumped)

Number of similar (implementation,compiler) pairs: 1, namely:
ImplementationCompiler
bi32_lowregclang -march=native -Os -fwrapv -Qunused-arguments -fPIC -fPIE -gdwarf-4 -Wall (Ubuntu_Clang_21.1.8_(6ubuntu1))

TIMECOP error (can be valgrind bug)


error 132

Process terminating with default action of signal 4 (SIGILL)
 Illegal opcode at address 0x40075D8
   at 0x...: memset (string_fortified.h:59)
   by 0x...: cpucycles_works (wrapper.c:59)
   by 0x...: supercop_cpucycles_ticks_amd64_tsc_setup (amd64-tsc.c:28)
   by 0x...: cpucycles_init (wrapper.c:314)
   by 0x...: main (try-anything.c:330)
Illegal instruction (core dumped)

Number of similar (implementation,compiler) pairs: 1, namely:
ImplementationCompiler
bi32_lowreggcc -march=native -mtune=native -O2 -fwrapv -fPIC -fPIE -gdwarf-4 -Wall (15.2.0)

TIMECOP error (can be valgrind bug)


error 132

Process terminating with default action of signal 4 (SIGILL)
 Illegal opcode at address 0x4007AD8
   at 0x...: memset (string_fortified.h:59)
   by 0x...: cpucycles_works (wrapper.c:59)
   by 0x...: supercop_cpucycles_ticks_amd64_tsc_setup (amd64-tsc.c:28)
   by 0x...: cpucycles_init (wrapper.c:314)
   by 0x...: main (try-anything.c:330)
Illegal instruction (core dumped)

Number of similar (implementation,compiler) pairs: 1, namely:
ImplementationCompiler
bi32_lowreggcc -march=native -mtune=native -O3 -fwrapv -fPIC -fPIE -gdwarf-4 -Wall (15.2.0)

TIMECOP error (can be valgrind bug)


error 132

Process terminating with default action of signal 4 (SIGILL)
 Illegal opcode at address 0x4007A18
   at 0x...: memset (string_fortified.h:59)
   by 0x...: cpucycles_works (wrapper.c:59)
   by 0x...: supercop_cpucycles_ticks_amd64_tsc_setup (amd64-tsc.c:28)
   by 0x...: cpucycles_init (wrapper.c:314)
   by 0x...: main (try-anything.c:330)
Illegal instruction (core dumped)

Number of similar (implementation,compiler) pairs: 1, namely:
ImplementationCompiler
bi32_lowreggcc -march=native -mtune=native -O -fwrapv -fPIC -fPIE -gdwarf-4 -Wall (15.2.0)

TIMECOP error (can be valgrind bug)


error 132

Process terminating with default action of signal 4 (SIGILL)
 Illegal opcode at address 0x4006C58
   at 0x...: memset (string_fortified.h:59)
   by 0x...: cpucycles_works (wrapper.c:59)
   by 0x...: supercop_cpucycles_ticks_amd64_tsc_setup (amd64-tsc.c:28)
   by 0x...: cpucycles_init (wrapper.c:314)
   by 0x...: main (try-anything.c:330)
Illegal instruction (core dumped)

Number of similar (implementation,compiler) pairs: 1, namely:
ImplementationCompiler
bi32_lowreggcc -march=native -mtune=native -Os -fwrapv -fPIC -fPIE -gdwarf-4 -Wall (15.2.0)

TIMECOP error (can be valgrind bug)


error 132

Process terminating with default action of signal 4 (SIGILL)
 Illegal opcode at address 0x4006118
   at 0x...: memset (string_fortified.h:59)
   by 0x...: cpucycles_works (wrapper.c:59)
   by 0x...: supercop_cpucycles_ticks_amd64_tsc_setup (amd64-tsc.c:28)
   by 0x...: cpucycles_init (wrapper.c:314)
   by 0x...: main (try-anything.c:330)
Illegal instruction (core dumped)

Number of similar (implementation,compiler) pairs: 1, namely:
ImplementationCompiler
bi32_lowsizeclang -march=native -O2 -fwrapv -Qunused-arguments -fPIC -fPIE -gdwarf-4 -Wall (Ubuntu_Clang_21.1.8_(6ubuntu1))

TIMECOP error (can be valgrind bug)


error 132

Process terminating with default action of signal 4 (SIGILL)
 Illegal opcode at address 0x40063D8
   at 0x...: memset (string_fortified.h:59)
   by 0x...: cpucycles_works (wrapper.c:59)
   by 0x...: supercop_cpucycles_ticks_amd64_tsc_setup (amd64-tsc.c:28)
   by 0x...: cpucycles_init (wrapper.c:314)
   by 0x...: main (try-anything.c:330)
Illegal instruction (core dumped)

Number of similar (implementation,compiler) pairs: 1, namely:
ImplementationCompiler
bi32_lowsizeclang -march=native -O3 -fwrapv -Qunused-arguments -fPIC -fPIE -gdwarf-4 -Wall (Ubuntu_Clang_21.1.8_(6ubuntu1))

TIMECOP error (can be valgrind bug)


error 132

Process terminating with default action of signal 4 (SIGILL)
 Illegal opcode at address 0x4005618
   at 0x...: memset (string_fortified.h:59)
   by 0x...: cpucycles_works (wrapper.c:59)
   by 0x...: supercop_cpucycles_ticks_amd64_tsc_setup (amd64-tsc.c:28)
   by 0x...: cpucycles_init (wrapper.c:314)
   by 0x...: main (try-anything.c:330)
Illegal instruction (core dumped)

Number of similar (implementation,compiler) pairs: 1, namely:
ImplementationCompiler
bi32_lowsizeclang -march=native -O -fwrapv -Qunused-arguments -fPIC -fPIE -gdwarf-4 -Wall (Ubuntu_Clang_21.1.8_(6ubuntu1))

TIMECOP error (can be valgrind bug)


error 132

Process terminating with default action of signal 4 (SIGILL)
 Illegal opcode at address 0x4005858
   at 0x...: memset (string_fortified.h:59)
   by 0x...: cpucycles_works (wrapper.c:59)
   by 0x...: supercop_cpucycles_ticks_amd64_tsc_setup (amd64-tsc.c:28)
   by 0x...: cpucycles_init (wrapper.c:314)
   by 0x...: main (try-anything.c:330)
Illegal instruction (core dumped)

Number of similar (implementation,compiler) pairs: 1, namely:
ImplementationCompiler
bi32_lowsizeclang -march=native -Os -fwrapv -Qunused-arguments -fPIC -fPIE -gdwarf-4 -Wall (Ubuntu_Clang_21.1.8_(6ubuntu1))

TIMECOP error (can be valgrind bug)


error 132

Process terminating with default action of signal 4 (SIGILL)
 Illegal opcode at address 0x4005DD8
   at 0x...: memset (string_fortified.h:59)
   by 0x...: cpucycles_works (wrapper.c:59)
   by 0x...: supercop_cpucycles_ticks_amd64_tsc_setup (amd64-tsc.c:28)
   by 0x...: cpucycles_init (wrapper.c:314)
   by 0x...: main (try-anything.c:330)
Illegal instruction (core dumped)

Number of similar (implementation,compiler) pairs: 1, namely:
ImplementationCompiler
bi32_lowsizegcc -march=native -mtune=native -O2 -fwrapv -fPIC -fPIE -gdwarf-4 -Wall (15.2.0)

TIMECOP error (can be valgrind bug)


error 132

Process terminating with default action of signal 4 (SIGILL)
 Illegal opcode at address 0x4006418
   at 0x...: memset (string_fortified.h:59)
   by 0x...: cpucycles_works (wrapper.c:59)
   by 0x...: supercop_cpucycles_ticks_amd64_tsc_setup (amd64-tsc.c:28)
   by 0x...: cpucycles_init (wrapper.c:314)
   by 0x...: main (try-anything.c:330)
Illegal instruction (core dumped)

Number of similar (implementation,compiler) pairs: 1, namely:
ImplementationCompiler
bi32_lowsizegcc -march=native -mtune=native -O3 -fwrapv -fPIC -fPIE -gdwarf-4 -Wall (15.2.0)

TIMECOP error (can be valgrind bug)


error 132

Process terminating with default action of signal 4 (SIGILL)
 Illegal opcode at address 0x4005C98
   at 0x...: memset (string_fortified.h:59)
   by 0x...: cpucycles_works (wrapper.c:59)
   by 0x...: supercop_cpucycles_ticks_amd64_tsc_setup (amd64-tsc.c:28)
   by 0x...: cpucycles_init (wrapper.c:314)
   by 0x...: main (try-anything.c:330)
Illegal instruction (core dumped)

Number of similar (implementation,compiler) pairs: 1, namely:
ImplementationCompiler
bi32_lowsizegcc -march=native -mtune=native -O -fwrapv -fPIC -fPIE -gdwarf-4 -Wall (15.2.0)

TIMECOP error (can be valgrind bug)


error 132

Process terminating with default action of signal 4 (SIGILL)
 Illegal opcode at address 0x40055D8
   at 0x...: memset (string_fortified.h:59)
   by 0x...: cpucycles_works (wrapper.c:59)
   by 0x...: supercop_cpucycles_ticks_amd64_tsc_setup (amd64-tsc.c:28)
   by 0x...: cpucycles_init (wrapper.c:314)
   by 0x...: main (try-anything.c:330)
Illegal instruction (core dumped)

Number of similar (implementation,compiler) pairs: 1, namely:
ImplementationCompiler
bi32_lowsizegcc -march=native -mtune=native -Os -fwrapv -fPIC -fPIE -gdwarf-4 -Wall (15.2.0)

TIMECOP error (can be valgrind bug)


error 132

Process terminating with default action of signal 4 (SIGILL)
 Illegal opcode at address 0x4007198
   at 0x...: memset (string_fortified.h:59)
   by 0x...: cpucycles_works (wrapper.c:59)
   by 0x...: supercop_cpucycles_ticks_amd64_tsc_setup (amd64-tsc.c:28)
   by 0x...: cpucycles_init (wrapper.c:314)
   by 0x...: main (try-anything.c:330)
Illegal instruction (core dumped)

Number of similar (implementation,compiler) pairs: 1, namely:
ImplementationCompiler
bi8clang -march=native -O2 -fwrapv -Qunused-arguments -fPIC -fPIE -gdwarf-4 -Wall (Ubuntu_Clang_21.1.8_(6ubuntu1))

TIMECOP error (can be valgrind bug)


error 132

Process terminating with default action of signal 4 (SIGILL)
 Illegal opcode at address 0x4007358
   at 0x...: memset (string_fortified.h:59)
   by 0x...: cpucycles_works (wrapper.c:59)
   by 0x...: supercop_cpucycles_ticks_amd64_tsc_setup (amd64-tsc.c:28)
   by 0x...: cpucycles_init (wrapper.c:314)
   by 0x...: main (try-anything.c:330)
Illegal instruction (core dumped)

Number of similar (implementation,compiler) pairs: 1, namely:
ImplementationCompiler
bi8clang -march=native -O3 -fwrapv -Qunused-arguments -fPIC -fPIE -gdwarf-4 -Wall (Ubuntu_Clang_21.1.8_(6ubuntu1))

TIMECOP error (can be valgrind bug)


error 132

Process terminating with default action of signal 4 (SIGILL)
 Illegal opcode at address 0x40069D8
   at 0x...: memset (string_fortified.h:59)
   by 0x...: cpucycles_works (wrapper.c:59)
   by 0x...: supercop_cpucycles_ticks_amd64_tsc_setup (amd64-tsc.c:28)
   by 0x...: cpucycles_init (wrapper.c:314)
   by 0x...: main (try-anything.c:330)
Illegal instruction (core dumped)

Number of similar (implementation,compiler) pairs: 1, namely:
ImplementationCompiler
bi8clang -march=native -O -fwrapv -Qunused-arguments -fPIC -fPIE -gdwarf-4 -Wall (Ubuntu_Clang_21.1.8_(6ubuntu1))

TIMECOP error (can be valgrind bug)


error 132

Process terminating with default action of signal 4 (SIGILL)
 Illegal opcode at address 0x4006898
   at 0x...: memset (string_fortified.h:59)
   by 0x...: cpucycles_works (wrapper.c:59)
   by 0x...: supercop_cpucycles_ticks_amd64_tsc_setup (amd64-tsc.c:28)
   by 0x...: cpucycles_init (wrapper.c:314)
   by 0x...: main (try-anything.c:330)
Illegal instruction (core dumped)

Number of similar (implementation,compiler) pairs: 1, namely:
ImplementationCompiler
bi8clang -march=native -Os -fwrapv -Qunused-arguments -fPIC -fPIE -gdwarf-4 -Wall (Ubuntu_Clang_21.1.8_(6ubuntu1))

TIMECOP error (can be valgrind bug)


error 132

Process terminating with default action of signal 4 (SIGILL)
 Illegal opcode at address 0x4006F58
   at 0x...: memset (string_fortified.h:59)
   by 0x...: cpucycles_works (wrapper.c:59)
   by 0x...: supercop_cpucycles_ticks_amd64_tsc_setup (amd64-tsc.c:28)
   by 0x...: cpucycles_init (wrapper.c:314)
   by 0x...: main (try-anything.c:330)
Illegal instruction (core dumped)

Number of similar (implementation,compiler) pairs: 1, namely:
ImplementationCompiler
bi8gcc -march=native -mtune=native -O2 -fwrapv -fPIC -fPIE -gdwarf-4 -Wall (15.2.0)

TIMECOP error (can be valgrind bug)


error 132

Process terminating with default action of signal 4 (SIGILL)
 Illegal opcode at address 0x4007498
   at 0x...: memset (string_fortified.h:59)
   by 0x...: cpucycles_works (wrapper.c:59)
   by 0x...: supercop_cpucycles_ticks_amd64_tsc_setup (amd64-tsc.c:28)
   by 0x...: cpucycles_init (wrapper.c:314)
   by 0x...: main (try-anything.c:330)
Illegal instruction (core dumped)

Number of similar (implementation,compiler) pairs: 1, namely:
ImplementationCompiler
bi8gcc -march=native -mtune=native -O3 -fwrapv -fPIC -fPIE -gdwarf-4 -Wall (15.2.0)

TIMECOP error (can be valgrind bug)


error 132

Process terminating with default action of signal 4 (SIGILL)
 Illegal opcode at address 0x4007DD8
   at 0x...: memset (string_fortified.h:59)
   by 0x...: cpucycles_works (wrapper.c:59)
   by 0x...: supercop_cpucycles_ticks_amd64_tsc_setup (amd64-tsc.c:28)
   by 0x...: cpucycles_init (wrapper.c:314)
   by 0x...: main (try-anything.c:330)
Illegal instruction (core dumped)

Number of similar (implementation,compiler) pairs: 2, namely:
ImplementationCompiler
bi8gcc -march=native -mtune=native -O -fwrapv -fPIC -fPIE -gdwarf-4 -Wall (15.2.0)
refgcc -march=native -mtune=native -O -fwrapv -fPIC -fPIE -gdwarf-4 -Wall (15.2.0)

TIMECOP error (can be valgrind bug)


error 132

Process terminating with default action of signal 4 (SIGILL)
 Illegal opcode at address 0x4006B98
   at 0x...: memset (string_fortified.h:59)
   by 0x...: cpucycles_works (wrapper.c:59)
   by 0x...: supercop_cpucycles_ticks_amd64_tsc_setup (amd64-tsc.c:28)
   by 0x...: cpucycles_init (wrapper.c:314)
   by 0x...: main (try-anything.c:330)
Illegal instruction (core dumped)

Number of similar (implementation,compiler) pairs: 2, namely:
ImplementationCompiler
bi8gcc -march=native -mtune=native -Os -fwrapv -fPIC -fPIE -gdwarf-4 -Wall (15.2.0)
opt8_lowsizeclang -march=native -O3 -fwrapv -Qunused-arguments -fPIC -fPIE -gdwarf-4 -Wall (Ubuntu_Clang_21.1.8_(6ubuntu1))

TIMECOP error (can be valgrind bug)


error 132

Process terminating with default action of signal 4 (SIGILL)
 Illegal opcode at address 0x400A218
   at 0x...: memset (string_fortified.h:59)
   by 0x...: cpucycles_works (wrapper.c:59)
   by 0x...: supercop_cpucycles_ticks_amd64_tsc_setup (amd64-tsc.c:28)
   by 0x...: cpucycles_init (wrapper.c:314)
   by 0x...: main (try-anything.c:330)
Illegal instruction (core dumped)

Number of similar (implementation,compiler) pairs: 1, namely:
ImplementationCompiler
opt32clang -march=native -O2 -fwrapv -Qunused-arguments -fPIC -fPIE -gdwarf-4 -Wall (Ubuntu_Clang_21.1.8_(6ubuntu1))

TIMECOP error (can be valgrind bug)


error 132

Process terminating with default action of signal 4 (SIGILL)
 Illegal opcode at address 0x400A418
   at 0x...: memset (string_fortified.h:59)
   by 0x...: cpucycles_works (wrapper.c:59)
   by 0x...: supercop_cpucycles_ticks_amd64_tsc_setup (amd64-tsc.c:28)
   by 0x...: cpucycles_init (wrapper.c:314)
   by 0x...: main (try-anything.c:330)
Illegal instruction (core dumped)

Number of similar (implementation,compiler) pairs: 1, namely:
ImplementationCompiler
opt32clang -march=native -O3 -fwrapv -Qunused-arguments -fPIC -fPIE -gdwarf-4 -Wall (Ubuntu_Clang_21.1.8_(6ubuntu1))

TIMECOP error (can be valgrind bug)


error 132

Process terminating with default action of signal 4 (SIGILL)
 Illegal opcode at address 0x4009418
   at 0x...: memset (string_fortified.h:59)
   by 0x...: cpucycles_works (wrapper.c:59)
   by 0x...: supercop_cpucycles_ticks_amd64_tsc_setup (amd64-tsc.c:28)
   by 0x...: cpucycles_init (wrapper.c:314)
   by 0x...: main (try-anything.c:330)
Illegal instruction (core dumped)

Number of similar (implementation,compiler) pairs: 1, namely:
ImplementationCompiler
opt32clang -march=native -O -fwrapv -Qunused-arguments -fPIC -fPIE -gdwarf-4 -Wall (Ubuntu_Clang_21.1.8_(6ubuntu1))

TIMECOP error (can be valgrind bug)


error 132

Process terminating with default action of signal 4 (SIGILL)
 Illegal opcode at address 0x4009918
   at 0x...: memset (string_fortified.h:59)
   by 0x...: cpucycles_works (wrapper.c:59)
   by 0x...: supercop_cpucycles_ticks_amd64_tsc_setup (amd64-tsc.c:28)
   by 0x...: cpucycles_init (wrapper.c:314)
   by 0x...: main (try-anything.c:330)
Illegal instruction (core dumped)

Number of similar (implementation,compiler) pairs: 1, namely:
ImplementationCompiler
opt32clang -march=native -Os -fwrapv -Qunused-arguments -fPIC -fPIE -gdwarf-4 -Wall (Ubuntu_Clang_21.1.8_(6ubuntu1))

TIMECOP error (can be valgrind bug)


error 132

Process terminating with default action of signal 4 (SIGILL)
 Illegal opcode at address 0x400A2D8
   at 0x...: memset (string_fortified.h:59)
   by 0x...: cpucycles_works (wrapper.c:59)
   by 0x...: supercop_cpucycles_ticks_amd64_tsc_setup (amd64-tsc.c:28)
   by 0x...: cpucycles_init (wrapper.c:314)
   by 0x...: main (try-anything.c:330)
Illegal instruction (core dumped)

Number of similar (implementation,compiler) pairs: 1, namely:
ImplementationCompiler
opt32gcc -march=native -mtune=native -O2 -fwrapv -fPIC -fPIE -gdwarf-4 -Wall (15.2.0)

TIMECOP error (can be valgrind bug)


error 132

Process terminating with default action of signal 4 (SIGILL)
 Illegal opcode at address 0x400A7D8
   at 0x...: memset (string_fortified.h:59)
   by 0x...: cpucycles_works (wrapper.c:59)
   by 0x...: supercop_cpucycles_ticks_amd64_tsc_setup (amd64-tsc.c:28)
   by 0x...: cpucycles_init (wrapper.c:314)
   by 0x...: main (try-anything.c:330)
Illegal instruction (core dumped)

Number of similar (implementation,compiler) pairs: 1, namely:
ImplementationCompiler
opt32gcc -march=native -mtune=native -O3 -fwrapv -fPIC -fPIE -gdwarf-4 -Wall (15.2.0)

TIMECOP error (can be valgrind bug)


error 132

Process terminating with default action of signal 4 (SIGILL)
 Illegal opcode at address 0x400AA98
   at 0x...: memset (string_fortified.h:59)
   by 0x...: cpucycles_works (wrapper.c:59)
   by 0x...: supercop_cpucycles_ticks_amd64_tsc_setup (amd64-tsc.c:28)
   by 0x...: cpucycles_init (wrapper.c:314)
   by 0x...: main (try-anything.c:330)
Illegal instruction (core dumped)

Number of similar (implementation,compiler) pairs: 1, namely:
ImplementationCompiler
opt32gcc -march=native -mtune=native -O -fwrapv -fPIC -fPIE -gdwarf-4 -Wall (15.2.0)

TIMECOP error (can be valgrind bug)


error 132

Process terminating with default action of signal 4 (SIGILL)
 Illegal opcode at address 0x400B618
   at 0x...: memset (string_fortified.h:59)
   by 0x...: cpucycles_works (wrapper.c:59)
   by 0x...: supercop_cpucycles_ticks_amd64_tsc_setup (amd64-tsc.c:28)
   by 0x...: cpucycles_init (wrapper.c:314)
   by 0x...: main (try-anything.c:330)
Illegal instruction (core dumped)

Number of similar (implementation,compiler) pairs: 1, namely:
ImplementationCompiler
opt32gcc -march=native -mtune=native -Os -fwrapv -fPIC -fPIE -gdwarf-4 -Wall (15.2.0)

TIMECOP error (can be valgrind bug)


error 132

Process terminating with default action of signal 4 (SIGILL)
 Illegal opcode at address 0x4006058
   at 0x...: memset (string_fortified.h:59)
   by 0x...: cpucycles_works (wrapper.c:59)
   by 0x...: supercop_cpucycles_ticks_amd64_tsc_setup (amd64-tsc.c:28)
   by 0x...: cpucycles_init (wrapper.c:314)
   by 0x...: main (try-anything.c:330)
Illegal instruction (core dumped)

Number of similar (implementation,compiler) pairs: 1, namely:
ImplementationCompiler
opt32_lowsizeclang -march=native -O2 -fwrapv -Qunused-arguments -fPIC -fPIE -gdwarf-4 -Wall (Ubuntu_Clang_21.1.8_(6ubuntu1))

TIMECOP error (can be valgrind bug)


error 132

Process terminating with default action of signal 4 (SIGILL)
 Illegal opcode at address 0x40062D8
   at 0x...: memset (string_fortified.h:59)
   by 0x...: cpucycles_works (wrapper.c:59)
   by 0x...: supercop_cpucycles_ticks_amd64_tsc_setup (amd64-tsc.c:28)
   by 0x...: cpucycles_init (wrapper.c:314)
   by 0x...: main (try-anything.c:330)
Illegal instruction (core dumped)

Number of similar (implementation,compiler) pairs: 2, namely:
ImplementationCompiler
opt32_lowsizeclang -march=native -O3 -fwrapv -Qunused-arguments -fPIC -fPIE -gdwarf-4 -Wall (Ubuntu_Clang_21.1.8_(6ubuntu1))
opt8_lowsizegcc -march=native -mtune=native -Os -fwrapv -fPIC -fPIE -gdwarf-4 -Wall (15.2.0)

TIMECOP error (can be valgrind bug)


error 132

Process terminating with default action of signal 4 (SIGILL)
 Illegal opcode at address 0x4005398
   at 0x...: memset (string_fortified.h:59)
   by 0x...: cpucycles_works (wrapper.c:59)
   by 0x...: supercop_cpucycles_ticks_amd64_tsc_setup (amd64-tsc.c:28)
   by 0x...: cpucycles_init (wrapper.c:314)
   by 0x...: main (try-anything.c:330)
Illegal instruction (core dumped)

Number of similar (implementation,compiler) pairs: 1, namely:
ImplementationCompiler
opt32_lowsizeclang -march=native -O -fwrapv -Qunused-arguments -fPIC -fPIE -gdwarf-4 -Wall (Ubuntu_Clang_21.1.8_(6ubuntu1))

TIMECOP error (can be valgrind bug)


error 132

Process terminating with default action of signal 4 (SIGILL)
 Illegal opcode at address 0x4005598
   at 0x...: memset (string_fortified.h:59)
   by 0x...: cpucycles_works (wrapper.c:59)
   by 0x...: supercop_cpucycles_ticks_amd64_tsc_setup (amd64-tsc.c:28)
   by 0x...: cpucycles_init (wrapper.c:314)
   by 0x...: main (try-anything.c:330)
Illegal instruction (core dumped)

Number of similar (implementation,compiler) pairs: 2, namely:
ImplementationCompiler
opt32_lowsizeclang -march=native -Os -fwrapv -Qunused-arguments -fPIC -fPIE -gdwarf-4 -Wall (Ubuntu_Clang_21.1.8_(6ubuntu1))
opt64_lowsizeclang -march=native -Os -fwrapv -Qunused-arguments -fPIC -fPIE -gdwarf-4 -Wall (Ubuntu_Clang_21.1.8_(6ubuntu1))

TIMECOP error (can be valgrind bug)


error 132

Process terminating with default action of signal 4 (SIGILL)
 Illegal opcode at address 0x4005B58
   at 0x...: memset (string_fortified.h:59)
   by 0x...: cpucycles_works (wrapper.c:59)
   by 0x...: supercop_cpucycles_ticks_amd64_tsc_setup (amd64-tsc.c:28)
   by 0x...: cpucycles_init (wrapper.c:314)
   by 0x...: main (try-anything.c:330)
Illegal instruction (core dumped)

Number of similar (implementation,compiler) pairs: 2, namely:
ImplementationCompiler
opt32_lowsizegcc -march=native -mtune=native -O2 -fwrapv -fPIC -fPIE -gdwarf-4 -Wall (15.2.0)
opt64_lowsizegcc -march=native -mtune=native -O2 -fwrapv -fPIC -fPIE -gdwarf-4 -Wall (15.2.0)

TIMECOP error (can be valgrind bug)


error 132

Process terminating with default action of signal 4 (SIGILL)
 Illegal opcode at address 0x4006198
   at 0x...: memset (string_fortified.h:59)
   by 0x...: cpucycles_works (wrapper.c:59)
   by 0x...: supercop_cpucycles_ticks_amd64_tsc_setup (amd64-tsc.c:28)
   by 0x...: cpucycles_init (wrapper.c:314)
   by 0x...: main (try-anything.c:330)
Illegal instruction (core dumped)

Number of similar (implementation,compiler) pairs: 1, namely:
ImplementationCompiler
opt32_lowsizegcc -march=native -mtune=native -O3 -fwrapv -fPIC -fPIE -gdwarf-4 -Wall (15.2.0)

TIMECOP error (can be valgrind bug)


error 132

Process terminating with default action of signal 4 (SIGILL)
 Illegal opcode at address 0x4005D98
   at 0x...: memset (string_fortified.h:59)
   by 0x...: cpucycles_works (wrapper.c:59)
   by 0x...: supercop_cpucycles_ticks_amd64_tsc_setup (amd64-tsc.c:28)
   by 0x...: cpucycles_init (wrapper.c:314)
   by 0x...: main (try-anything.c:330)
Illegal instruction (core dumped)

Number of similar (implementation,compiler) pairs: 1, namely:
ImplementationCompiler
opt32_lowsizegcc -march=native -mtune=native -O -fwrapv -fPIC -fPIE -gdwarf-4 -Wall (15.2.0)

TIMECOP error (can be valgrind bug)


error 132

Process terminating with default action of signal 4 (SIGILL)
 Illegal opcode at address 0x4005418
   at 0x...: memset (string_fortified.h:59)
   by 0x...: cpucycles_works (wrapper.c:59)
   by 0x...: supercop_cpucycles_ticks_amd64_tsc_setup (amd64-tsc.c:28)
   by 0x...: cpucycles_init (wrapper.c:314)
   by 0x...: main (try-anything.c:330)
Illegal instruction (core dumped)

Number of similar (implementation,compiler) pairs: 1, namely:
ImplementationCompiler
opt32_lowsizegcc -march=native -mtune=native -Os -fwrapv -fPIC -fPIE -gdwarf-4 -Wall (15.2.0)

TIMECOP error (can be valgrind bug)


error 132

Process terminating with default action of signal 4 (SIGILL)
 Illegal opcode at address 0x4009218
   at 0x...: memset (string_fortified.h:59)
   by 0x...: cpucycles_works (wrapper.c:59)
   by 0x...: supercop_cpucycles_ticks_amd64_tsc_setup (amd64-tsc.c:28)
   by 0x...: cpucycles_init (wrapper.c:314)
   by 0x...: main (try-anything.c:330)
Illegal instruction (core dumped)

Number of similar (implementation,compiler) pairs: 1, namely:
ImplementationCompiler
opt64clang -march=native -O2 -fwrapv -Qunused-arguments -fPIC -fPIE -gdwarf-4 -Wall (Ubuntu_Clang_21.1.8_(6ubuntu1))

TIMECOP error (can be valgrind bug)


error 132

Process terminating with default action of signal 4 (SIGILL)
 Illegal opcode at address 0x40093D8
   at 0x...: memset (string_fortified.h:59)
   by 0x...: cpucycles_works (wrapper.c:59)
   by 0x...: supercop_cpucycles_ticks_amd64_tsc_setup (amd64-tsc.c:28)
   by 0x...: cpucycles_init (wrapper.c:314)
   by 0x...: main (try-anything.c:330)
Illegal instruction (core dumped)

Number of similar (implementation,compiler) pairs: 1, namely:
ImplementationCompiler
opt64clang -march=native -O3 -fwrapv -Qunused-arguments -fPIC -fPIE -gdwarf-4 -Wall (Ubuntu_Clang_21.1.8_(6ubuntu1))

TIMECOP error (can be valgrind bug)


error 132

Process terminating with default action of signal 4 (SIGILL)
 Illegal opcode at address 0x4008658
   at 0x...: memset (string_fortified.h:59)
   by 0x...: cpucycles_works (wrapper.c:59)
   by 0x...: supercop_cpucycles_ticks_amd64_tsc_setup (amd64-tsc.c:28)
   by 0x...: cpucycles_init (wrapper.c:314)
   by 0x...: main (try-anything.c:330)
Illegal instruction (core dumped)

Number of similar (implementation,compiler) pairs: 1, namely:
ImplementationCompiler
opt64clang -march=native -O -fwrapv -Qunused-arguments -fPIC -fPIE -gdwarf-4 -Wall (Ubuntu_Clang_21.1.8_(6ubuntu1))

TIMECOP error (can be valgrind bug)


error 132

Process terminating with default action of signal 4 (SIGILL)
 Illegal opcode at address 0x4008FD8
   at 0x...: memset (string_fortified.h:59)
   by 0x...: cpucycles_works (wrapper.c:59)
   by 0x...: supercop_cpucycles_ticks_amd64_tsc_setup (amd64-tsc.c:28)
   by 0x...: cpucycles_init (wrapper.c:314)
   by 0x...: main (try-anything.c:330)
Illegal instruction (core dumped)

Number of similar (implementation,compiler) pairs: 1, namely:
ImplementationCompiler
opt64gcc -march=native -mtune=native -O2 -fwrapv -fPIC -fPIE -gdwarf-4 -Wall (15.2.0)

TIMECOP error (can be valgrind bug)


error 132

Process terminating with default action of signal 4 (SIGILL)
 Illegal opcode at address 0x4009518
   at 0x...: memset (string_fortified.h:59)
   by 0x...: cpucycles_works (wrapper.c:59)
   by 0x...: supercop_cpucycles_ticks_amd64_tsc_setup (amd64-tsc.c:28)
   by 0x...: cpucycles_init (wrapper.c:314)
   by 0x...: main (try-anything.c:330)
Illegal instruction (core dumped)

Number of similar (implementation,compiler) pairs: 1, namely:
ImplementationCompiler
opt64gcc -march=native -mtune=native -O3 -fwrapv -fPIC -fPIE -gdwarf-4 -Wall (15.2.0)

TIMECOP error (can be valgrind bug)


error 132

Process terminating with default action of signal 4 (SIGILL)
 Illegal opcode at address 0x40097D8
   at 0x...: memset (string_fortified.h:59)
   by 0x...: cpucycles_works (wrapper.c:59)
   by 0x...: supercop_cpucycles_ticks_amd64_tsc_setup (amd64-tsc.c:28)
   by 0x...: cpucycles_init (wrapper.c:314)
   by 0x...: main (try-anything.c:330)
Illegal instruction (core dumped)

Number of similar (implementation,compiler) pairs: 1, namely:
ImplementationCompiler
opt64gcc -march=native -mtune=native -O -fwrapv -fPIC -fPIE -gdwarf-4 -Wall (15.2.0)

TIMECOP error (can be valgrind bug)


error 132

Process terminating with default action of signal 4 (SIGILL)
 Illegal opcode at address 0x400A258
   at 0x...: memset (string_fortified.h:59)
   by 0x...: cpucycles_works (wrapper.c:59)
   by 0x...: supercop_cpucycles_ticks_amd64_tsc_setup (amd64-tsc.c:28)
   by 0x...: cpucycles_init (wrapper.c:314)
   by 0x...: main (try-anything.c:330)
Illegal instruction (core dumped)

Number of similar (implementation,compiler) pairs: 1, namely:
ImplementationCompiler
opt64gcc -march=native -mtune=native -Os -fwrapv -fPIC -fPIE -gdwarf-4 -Wall (15.2.0)

TIMECOP error (can be valgrind bug)


error 132

Process terminating with default action of signal 4 (SIGILL)
 Illegal opcode at address 0x4006018
   at 0x...: memset (string_fortified.h:59)
   by 0x...: cpucycles_works (wrapper.c:59)
   by 0x...: supercop_cpucycles_ticks_amd64_tsc_setup (amd64-tsc.c:28)
   by 0x...: cpucycles_init (wrapper.c:314)
   by 0x...: main (try-anything.c:330)
Illegal instruction (core dumped)

Number of similar (implementation,compiler) pairs: 2, namely:
ImplementationCompiler
opt64_lowsizeclang -march=native -O2 -fwrapv -Qunused-arguments -fPIC -fPIE -gdwarf-4 -Wall (Ubuntu_Clang_21.1.8_(6ubuntu1))
opt8clang -march=native -O -fwrapv -Qunused-arguments -fPIC -fPIE -gdwarf-4 -Wall (Ubuntu_Clang_21.1.8_(6ubuntu1))

TIMECOP error (can be valgrind bug)


error 132

Process terminating with default action of signal 4 (SIGILL)
 Illegal opcode at address 0x4006298
   at 0x...: memset (string_fortified.h:59)
   by 0x...: cpucycles_works (wrapper.c:59)
   by 0x...: supercop_cpucycles_ticks_amd64_tsc_setup (amd64-tsc.c:28)
   by 0x...: cpucycles_init (wrapper.c:314)
   by 0x...: main (try-anything.c:330)
Illegal instruction (core dumped)

Number of similar (implementation,compiler) pairs: 2, namely:
ImplementationCompiler
opt64_lowsizeclang -march=native -O3 -fwrapv -Qunused-arguments -fPIC -fPIE -gdwarf-4 -Wall (Ubuntu_Clang_21.1.8_(6ubuntu1))
refclang -march=native -O -fwrapv -Qunused-arguments -fPIC -fPIE -gdwarf-4 -Wall (Ubuntu_Clang_21.1.8_(6ubuntu1))

TIMECOP error (can be valgrind bug)


error 132

Process terminating with default action of signal 4 (SIGILL)
 Illegal opcode at address 0x4005358
   at 0x...: memset (string_fortified.h:59)
   by 0x...: cpucycles_works (wrapper.c:59)
   by 0x...: supercop_cpucycles_ticks_amd64_tsc_setup (amd64-tsc.c:28)
   by 0x...: cpucycles_init (wrapper.c:314)
   by 0x...: main (try-anything.c:330)
Illegal instruction (core dumped)

Number of similar (implementation,compiler) pairs: 2, namely:
ImplementationCompiler
opt64_lowsizeclang -march=native -O -fwrapv -Qunused-arguments -fPIC -fPIE -gdwarf-4 -Wall (Ubuntu_Clang_21.1.8_(6ubuntu1))
opt64_lowsizegcc -march=native -mtune=native -Os -fwrapv -fPIC -fPIE -gdwarf-4 -Wall (15.2.0)

TIMECOP error (can be valgrind bug)


error 132

Process terminating with default action of signal 4 (SIGILL)
 Illegal opcode at address 0x4006158
   at 0x...: memset (string_fortified.h:59)
   by 0x...: cpucycles_works (wrapper.c:59)
   by 0x...: supercop_cpucycles_ticks_amd64_tsc_setup (amd64-tsc.c:28)
   by 0x...: cpucycles_init (wrapper.c:314)
   by 0x...: main (try-anything.c:330)
Illegal instruction (core dumped)

Number of similar (implementation,compiler) pairs: 1, namely:
ImplementationCompiler
opt64_lowsizegcc -march=native -mtune=native -O3 -fwrapv -fPIC -fPIE -gdwarf-4 -Wall (15.2.0)

TIMECOP error (can be valgrind bug)


error 132

Process terminating with default action of signal 4 (SIGILL)
 Illegal opcode at address 0x4005D58
   at 0x...: memset (string_fortified.h:59)
   by 0x...: cpucycles_works (wrapper.c:59)
   by 0x...: supercop_cpucycles_ticks_amd64_tsc_setup (amd64-tsc.c:28)
   by 0x...: cpucycles_init (wrapper.c:314)
   by 0x...: main (try-anything.c:330)
Illegal instruction (core dumped)

Number of similar (implementation,compiler) pairs: 2, namely:
ImplementationCompiler
opt64_lowsizegcc -march=native -mtune=native -O -fwrapv -fPIC -fPIE -gdwarf-4 -Wall (15.2.0)
opt8_lowsizeclang -march=native -O -fwrapv -Qunused-arguments -fPIC -fPIE -gdwarf-4 -Wall (Ubuntu_Clang_21.1.8_(6ubuntu1))

TIMECOP error (can be valgrind bug)


error 132

Process terminating with default action of signal 4 (SIGILL)
 Illegal opcode at address 0x4006958
   at 0x...: memset (string_fortified.h:59)
   by 0x...: cpucycles_works (wrapper.c:59)
   by 0x...: supercop_cpucycles_ticks_amd64_tsc_setup (amd64-tsc.c:28)
   by 0x...: cpucycles_init (wrapper.c:314)
   by 0x...: main (try-anything.c:330)
Illegal instruction (core dumped)

Number of similar (implementation,compiler) pairs: 2, namely:
ImplementationCompiler
opt8clang -march=native -O2 -fwrapv -Qunused-arguments -fPIC -fPIE -gdwarf-4 -Wall (Ubuntu_Clang_21.1.8_(6ubuntu1))
refclang -march=native -Os -fwrapv -Qunused-arguments -fPIC -fPIE -gdwarf-4 -Wall (Ubuntu_Clang_21.1.8_(6ubuntu1))

TIMECOP error (can be valgrind bug)


error 132

Process terminating with default action of signal 4 (SIGILL)
 Illegal opcode at address 0x4006D58
   at 0x...: memset (string_fortified.h:59)
   by 0x...: cpucycles_works (wrapper.c:59)
   by 0x...: supercop_cpucycles_ticks_amd64_tsc_setup (amd64-tsc.c:28)
   by 0x...: cpucycles_init (wrapper.c:314)
   by 0x...: main (try-anything.c:330)
Illegal instruction (core dumped)

Number of similar (implementation,compiler) pairs: 1, namely:
ImplementationCompiler
opt8clang -march=native -O3 -fwrapv -Qunused-arguments -fPIC -fPIE -gdwarf-4 -Wall (Ubuntu_Clang_21.1.8_(6ubuntu1))

TIMECOP error (can be valgrind bug)


error 132

Process terminating with default action of signal 4 (SIGILL)
 Illegal opcode at address 0x4005CD8
   at 0x...: memset (string_fortified.h:59)
   by 0x...: cpucycles_works (wrapper.c:59)
   by 0x...: supercop_cpucycles_ticks_amd64_tsc_setup (amd64-tsc.c:28)
   by 0x...: cpucycles_init (wrapper.c:314)
   by 0x...: main (try-anything.c:330)
Illegal instruction (core dumped)

Number of similar (implementation,compiler) pairs: 2, namely:
ImplementationCompiler
opt8clang -march=native -Os -fwrapv -Qunused-arguments -fPIC -fPIE -gdwarf-4 -Wall (Ubuntu_Clang_21.1.8_(6ubuntu1))
opt8_lowsizeclang -march=native -Os -fwrapv -Qunused-arguments -fPIC -fPIE -gdwarf-4 -Wall (Ubuntu_Clang_21.1.8_(6ubuntu1))

TIMECOP error (can be valgrind bug)


error 132

Process terminating with default action of signal 4 (SIGILL)
 Illegal opcode at address 0x4006258
   at 0x...: memset (string_fortified.h:59)
   by 0x...: cpucycles_works (wrapper.c:59)
   by 0x...: supercop_cpucycles_ticks_amd64_tsc_setup (amd64-tsc.c:28)
   by 0x...: cpucycles_init (wrapper.c:314)
   by 0x...: main (try-anything.c:330)
Illegal instruction (core dumped)

Number of similar (implementation,compiler) pairs: 1, namely:
ImplementationCompiler
opt8gcc -march=native -mtune=native -O2 -fwrapv -fPIC -fPIE -gdwarf-4 -Wall (15.2.0)

TIMECOP error (can be valgrind bug)


error 132

Process terminating with default action of signal 4 (SIGILL)
 Illegal opcode at address 0x4007258
   at 0x...: memset (string_fortified.h:59)
   by 0x...: cpucycles_works (wrapper.c:59)
   by 0x...: supercop_cpucycles_ticks_amd64_tsc_setup (amd64-tsc.c:28)
   by 0x...: cpucycles_init (wrapper.c:314)
   by 0x...: main (try-anything.c:330)
Illegal instruction (core dumped)

Number of similar (implementation,compiler) pairs: 1, namely:
ImplementationCompiler
opt8gcc -march=native -mtune=native -O3 -fwrapv -fPIC -fPIE -gdwarf-4 -Wall (15.2.0)

TIMECOP error (can be valgrind bug)


error 132

Process terminating with default action of signal 4 (SIGILL)
 Illegal opcode at address 0x4006998
   at 0x...: memset (string_fortified.h:59)
   by 0x...: cpucycles_works (wrapper.c:59)
   by 0x...: supercop_cpucycles_ticks_amd64_tsc_setup (amd64-tsc.c:28)
   by 0x...: cpucycles_init (wrapper.c:314)
   by 0x...: main (try-anything.c:330)
Illegal instruction (core dumped)

Number of similar (implementation,compiler) pairs: 2, namely:
ImplementationCompiler
opt8gcc -march=native -mtune=native -O -fwrapv -fPIC -fPIE -gdwarf-4 -Wall (15.2.0)
opt8_lowsizegcc -march=native -mtune=native -O -fwrapv -fPIC -fPIE -gdwarf-4 -Wall (15.2.0)

TIMECOP error (can be valgrind bug)


error 132

Process terminating with default action of signal 4 (SIGILL)
 Illegal opcode at address 0x4006318
   at 0x...: memset (string_fortified.h:59)
   by 0x...: cpucycles_works (wrapper.c:59)
   by 0x...: supercop_cpucycles_ticks_amd64_tsc_setup (amd64-tsc.c:28)
   by 0x...: cpucycles_init (wrapper.c:314)
   by 0x...: main (try-anything.c:330)
Illegal instruction (core dumped)

Number of similar (implementation,compiler) pairs: 1, namely:
ImplementationCompiler
opt8gcc -march=native -mtune=native -Os -fwrapv -fPIC -fPIE -gdwarf-4 -Wall (15.2.0)

TIMECOP error (can be valgrind bug)


error 132

Process terminating with default action of signal 4 (SIGILL)
 Illegal opcode at address 0x4006798
   at 0x...: memset (string_fortified.h:59)
   by 0x...: cpucycles_works (wrapper.c:59)
   by 0x...: supercop_cpucycles_ticks_amd64_tsc_setup (amd64-tsc.c:28)
   by 0x...: cpucycles_init (wrapper.c:314)
   by 0x...: main (try-anything.c:330)
Illegal instruction (core dumped)

Number of similar (implementation,compiler) pairs: 1, namely:
ImplementationCompiler
opt8_lowsizeclang -march=native -O2 -fwrapv -Qunused-arguments -fPIC -fPIE -gdwarf-4 -Wall (Ubuntu_Clang_21.1.8_(6ubuntu1))

TIMECOP error (can be valgrind bug)


error 132

Process terminating with default action of signal 4 (SIGILL)
 Illegal opcode at address 0x40061D8
   at 0x...: memset (string_fortified.h:59)
   by 0x...: cpucycles_works (wrapper.c:59)
   by 0x...: supercop_cpucycles_ticks_amd64_tsc_setup (amd64-tsc.c:28)
   by 0x...: cpucycles_init (wrapper.c:314)
   by 0x...: main (try-anything.c:330)
Illegal instruction (core dumped)

Number of similar (implementation,compiler) pairs: 1, namely:
ImplementationCompiler
opt8_lowsizegcc -march=native -mtune=native -O2 -fwrapv -fPIC -fPIE -gdwarf-4 -Wall (15.2.0)

TIMECOP error (can be valgrind bug)


error 132

Process terminating with default action of signal 4 (SIGILL)
 Illegal opcode at address 0x4006E58
   at 0x...: memset (string_fortified.h:59)
   by 0x...: cpucycles_works (wrapper.c:59)
   by 0x...: supercop_cpucycles_ticks_amd64_tsc_setup (amd64-tsc.c:28)
   by 0x...: cpucycles_init (wrapper.c:314)
   by 0x...: main (try-anything.c:330)
Illegal instruction (core dumped)

Number of similar (implementation,compiler) pairs: 1, namely:
ImplementationCompiler
opt8_lowsizegcc -march=native -mtune=native -O3 -fwrapv -fPIC -fPIE -gdwarf-4 -Wall (15.2.0)

TIMECOP error (can be valgrind bug)


error 132

Process terminating with default action of signal 4 (SIGILL)
 Illegal opcode at address 0x4007098
   at 0x...: memset (string_fortified.h:59)
   by 0x...: cpucycles_works (wrapper.c:59)
   by 0x...: supercop_cpucycles_ticks_amd64_tsc_setup (amd64-tsc.c:28)
   by 0x...: cpucycles_init (wrapper.c:314)
   by 0x...: main (try-anything.c:330)
Illegal instruction (core dumped)

Number of similar (implementation,compiler) pairs: 1, namely:
ImplementationCompiler
refclang -march=native -O3 -fwrapv -Qunused-arguments -fPIC -fPIE -gdwarf-4 -Wall (Ubuntu_Clang_21.1.8_(6ubuntu1))

TIMECOP error (can be valgrind bug)


error 132

Process terminating with default action of signal 4 (SIGILL)
 Illegal opcode at address 0x4008418
   at 0x...: memset (string_fortified.h:59)
   by 0x...: cpucycles_works (wrapper.c:59)
   by 0x...: supercop_cpucycles_ticks_amd64_tsc_setup (amd64-tsc.c:28)
   by 0x...: cpucycles_init (wrapper.c:314)
   by 0x...: main (try-anything.c:330)
Illegal instruction (core dumped)

Number of similar (implementation,compiler) pairs: 1, namely:
ImplementationCompiler
refgcc -march=native -mtune=native -O2 -fwrapv -fPIC -fPIE -gdwarf-4 -Wall (15.2.0)

TIMECOP error (can be valgrind bug)


error 132

Process terminating with default action of signal 4 (SIGILL)
 Illegal opcode at address 0x400A698
   at 0x...: memset (string_fortified.h:59)
   by 0x...: cpucycles_works (wrapper.c:59)
   by 0x...: supercop_cpucycles_ticks_amd64_tsc_setup (amd64-tsc.c:28)
   by 0x...: cpucycles_init (wrapper.c:314)
   by 0x...: main (try-anything.c:330)
Illegal instruction (core dumped)

Number of similar (implementation,compiler) pairs: 1, namely:
ImplementationCompiler
refgcc -march=native -mtune=native -O3 -fwrapv -fPIC -fPIE -gdwarf-4 -Wall (15.2.0)

TIMECOP error (can be valgrind bug)


error 132

Process terminating with default action of signal 4 (SIGILL)
 Illegal opcode at address 0x4005798
   at 0x...: memset (string_fortified.h:59)
   by 0x...: cpucycles_works (wrapper.c:59)
   by 0x...: supercop_cpucycles_ticks_amd64_tsc_setup (amd64-tsc.c:28)
   by 0x...: cpucycles_init (wrapper.c:314)
   by 0x...: main (try-anything.c:330)
Illegal instruction (core dumped)

Number of similar (implementation,compiler) pairs: 1, namely:
ImplementationCompiler
refgcc -march=native -mtune=native -Os -fwrapv -fPIC -fPIE -gdwarf-4 -Wall (15.2.0)