Test results for amd64, hertz, crypto_aead/ascon128bi32v12
[Page version: 20250310 13:41:42]
Measurements for amd64, hertz, crypto_aead
Test results for amd64, hertz, crypto_aead
Test results for crypto_aead/ascon128bi32v12
Computer: hertz
Microarchitecture: amd64; Zen 4 (a60f12)
Architecture: amd64
CPU ID: AuthenticAMD-00a60f12-178bfbff
SUPERCOP version: 20250307
Operation: crypto_aead
Primitive: ascon128bi32v12
Time | Object size | Test size | Implementation | Compiler | Benchmark date | SUPERCOP version |
114853 | 27240 0 0 | 44357 804 1192 | ref | gcc -march=native -mtune=native -O3 -fwrapv -fPIC -fPIE -gdwarf-4 -Wall | 20250308 | 20250307 |
120278 | 8297 0 0 | 27038 828 1096 | ref | clang -march=native -O2 -fwrapv -Qunused-arguments -fPIC -fPIE -gdwarf-4 -Wall | 20250308 | 20250307 |
120419 | 8297 0 0 | 27086 828 1096 | ref | clang -march=native -O3 -fwrapv -Qunused-arguments -fPIC -fPIE -gdwarf-4 -Wall | 20250308 | 20250307 |
120587 | 7674 0 0 | 22696 820 1096 | bi32 | clang -march=native -Os -fwrapv -Qunused-arguments -fPIC -fPIE -gdwarf-4 -Wall | 20250308 | 20250307 |
120743 | 8092 0 0 | 21552 780 1064 | bi32 | gcc -march=native -mtune=native -Os -fwrapv -fPIC -fPIE -gdwarf-4 -Wall | 20250308 | 20250307 |
122144 | 7795 0 0 | 26510 828 1096 | bi32 | clang -march=native -O2 -fwrapv -Qunused-arguments -fPIC -fPIE -gdwarf-4 -Wall | 20250308 | 20250307 |
122199 | 7832 0 0 | 26590 828 1096 | bi32 | clang -march=native -O3 -fwrapv -Qunused-arguments -fPIC -fPIE -gdwarf-4 -Wall | 20250308 | 20250307 |
133414 | 4187 0 0 | 23022 828 1096 | bi32_lowreg | clang -march=native -O3 -fwrapv -Qunused-arguments -fPIC -fPIE -gdwarf-4 -Wall | 20250308 | 20250307 |
133757 | 11270 0 0 | 26296 820 1096 | ref | clang -march=native -Os -fwrapv -Qunused-arguments -fPIC -fPIE -gdwarf-4 -Wall | 20250308 | 20250307 |
134076 | 4187 0 0 | 22974 828 1096 | bi32_lowreg | clang -march=native -O2 -fwrapv -Qunused-arguments -fPIC -fPIE -gdwarf-4 -Wall | 20250308 | 20250307 |
134951 | 4455 0 0 | 18016 780 1064 | bi32_lowreg | gcc -march=native -mtune=native -Os -fwrapv -fPIC -fPIE -gdwarf-4 -Wall | 20250308 | 20250307 |
136920 | 4043 0 0 | 19144 820 1096 | bi32_lowreg | clang -march=native -Os -fwrapv -Qunused-arguments -fPIC -fPIE -gdwarf-4 -Wall | 20250308 | 20250307 |
143473 | 2061 0 0 | 15456 780 1064 | bi32_lowsize | gcc -march=native -mtune=native -Os -fwrapv -fPIC -fPIE -gdwarf-4 -Wall | 20250308 | 20250307 |
143935 | 1897 0 0 | 20662 828 1096 | bi32_lowsize | clang -march=native -O3 -fwrapv -Qunused-arguments -fPIC -fPIE -gdwarf-4 -Wall | 20250308 | 20250307 |
144146 | 1714 0 0 | 20430 828 1096 | bi32_lowsize | clang -march=native -O2 -fwrapv -Qunused-arguments -fPIC -fPIE -gdwarf-4 -Wall | 20250308 | 20250307 |
147572 | 1687 0 0 | 16728 820 1096 | bi32_lowsize | clang -march=native -Os -fwrapv -Qunused-arguments -fPIC -fPIE -gdwarf-4 -Wall | 20250308 | 20250307 |
156318 | 2824 0 0 | 16456 780 1064 | ref | gcc -march=native -mtune=native -Os -fwrapv -fPIC -fPIE -gdwarf-4 -Wall | 20250308 | 20250307 |
161794 | 5177 0 0 | 20429 804 1192 | ref | gcc -march=native -mtune=native -O2 -fwrapv -fPIC -fPIE -gdwarf-4 -Wall | 20250308 | 20250307 |
168928 | 10203 0 0 | 25333 804 1192 | bi32 | gcc -march=native -mtune=native -O2 -fwrapv -fPIC -fPIE -gdwarf-4 -Wall | 20250308 | 20250307 |
170341 | 10203 0 0 | 27157 804 1192 | bi32 | gcc -march=native -mtune=native -O3 -fwrapv -fPIC -fPIE -gdwarf-4 -Wall | 20250308 | 20250307 |
173258 | 2807 0 0 | 19733 804 1192 | bi32_lowsize | gcc -march=native -mtune=native -O3 -fwrapv -fPIC -fPIE -gdwarf-4 -Wall | 20250308 | 20250307 |
174600 | 5588 0 0 | 22613 804 1192 | bi32_lowreg | gcc -march=native -mtune=native -O3 -fwrapv -fPIC -fPIE -gdwarf-4 -Wall | 20250308 | 20250307 |
175974 | 2479 0 0 | 17573 804 1192 | bi32_lowsize | gcc -march=native -mtune=native -O2 -fwrapv -fPIC -fPIE -gdwarf-4 -Wall | 20250308 | 20250307 |
177040 | 5588 0 0 | 20789 804 1192 | bi32_lowreg | gcc -march=native -mtune=native -O2 -fwrapv -fPIC -fPIE -gdwarf-4 -Wall | 20250308 | 20250307 |
Compiler output
try.c: clang: error: no such file or directory: '.../supercop-data/avx/amd64/lib/timecop/cpucycles.o'
Number of similar (implementation,compiler) pairs: 9, namely:
Implementation | Compiler |
bi32 | clang -march=native -O2 -fwrapv -Qunused-arguments -fPIC -fPIE -gdwarf-4 -Wall (Ubuntu_Clang_19.1.1_(1ubuntu1)) |
bi32 | clang -march=native -O3 -fwrapv -Qunused-arguments -fPIC -fPIE -gdwarf-4 -Wall (Ubuntu_Clang_19.1.1_(1ubuntu1)) |
bi32 | clang -march=native -Os -fwrapv -Qunused-arguments -fPIC -fPIE -gdwarf-4 -Wall (Ubuntu_Clang_19.1.1_(1ubuntu1)) |
bi32_lowreg | clang -march=native -O2 -fwrapv -Qunused-arguments -fPIC -fPIE -gdwarf-4 -Wall (Ubuntu_Clang_19.1.1_(1ubuntu1)) |
bi32_lowreg | clang -march=native -O3 -fwrapv -Qunused-arguments -fPIC -fPIE -gdwarf-4 -Wall (Ubuntu_Clang_19.1.1_(1ubuntu1)) |
bi32_lowreg | clang -march=native -Os -fwrapv -Qunused-arguments -fPIC -fPIE -gdwarf-4 -Wall (Ubuntu_Clang_19.1.1_(1ubuntu1)) |
ref | clang -march=native -O2 -fwrapv -Qunused-arguments -fPIC -fPIE -gdwarf-4 -Wall (Ubuntu_Clang_19.1.1_(1ubuntu1)) |
ref | clang -march=native -O3 -fwrapv -Qunused-arguments -fPIC -fPIE -gdwarf-4 -Wall (Ubuntu_Clang_19.1.1_(1ubuntu1)) |
ref | clang -march=native -Os -fwrapv -Qunused-arguments -fPIC -fPIE -gdwarf-4 -Wall (Ubuntu_Clang_19.1.1_(1ubuntu1)) |
Compiler output
aead.c: In file included from round.h:8,
aead.c: from permutations.h:11,
aead.c: from aead.c:4:
aead.c: word.h:55:11: warning: 'crypto_int64_bitmod_01' is static but used in inline function 'NOTZERO' which is not static
aead.c: 55 | return (crypto_int64_bitmod_01(((int)(result & 0xff) - 1),8)) - 1;
aead.c: | ^~~~~~~~~~~~~~~~~~~~~~
permutations.c: In file included from round.h:8,
permutations.c: from permutations.h:11,
permutations.c: from permutations.c:1:
permutations.c: word.h:55:11: warning: 'crypto_int64_bitmod_01' is static but used in inline function 'NOTZERO' which is not static
permutations.c: 55 | return (crypto_int64_bitmod_01(((int)(result & 0xff) - 1),8)) - 1;
permutations.c: | ^~~~~~~~~~~~~~~~~~~~~~
try.c: In file included from try-anything-timecop.c:3:
try.c: try-anything.c:17:10: fatal error: cpucycles.h: No such file or directory
try.c: 17 | #include "cpucycles.h"
try.c: | ^~~~~~~~~~~~~
try.c: compilation terminated.
Number of similar (implementation,compiler) pairs: 6, namely:
Implementation | Compiler |
bi32 | gcc -march=native -mtune=native -O2 -fwrapv -fPIC -fPIE -gdwarf-4 -Wall (14.2.0) |
bi32 | gcc -march=native -mtune=native -O3 -fwrapv -fPIC -fPIE -gdwarf-4 -Wall (14.2.0) |
bi32 | gcc -march=native -mtune=native -Os -fwrapv -fPIC -fPIE -gdwarf-4 -Wall (14.2.0) |
bi32_lowreg | gcc -march=native -mtune=native -O2 -fwrapv -fPIC -fPIE -gdwarf-4 -Wall (14.2.0) |
bi32_lowreg | gcc -march=native -mtune=native -O3 -fwrapv -fPIC -fPIE -gdwarf-4 -Wall (14.2.0) |
bi32_lowreg | gcc -march=native -mtune=native -Os -fwrapv -fPIC -fPIE -gdwarf-4 -Wall (14.2.0) |
Compiler output
update.c: update.c:21:13: warning: unused variable 'rate' [-Wunused-variable]
update.c: 21 | const int rate = ASCON_AEAD_RATE;
update.c: | ^~~~
update.c: 1 warning generated.
try.c: clang: error: no such file or directory: '.../supercop-data/avx/amd64/lib/timecop/cpucycles.o'
Number of similar (implementation,compiler) pairs: 3, namely:
Implementation | Compiler |
bi32_lowsize | clang -march=native -O2 -fwrapv -Qunused-arguments -fPIC -fPIE -gdwarf-4 -Wall (Ubuntu_Clang_19.1.1_(1ubuntu1)) |
bi32_lowsize | clang -march=native -O3 -fwrapv -Qunused-arguments -fPIC -fPIE -gdwarf-4 -Wall (Ubuntu_Clang_19.1.1_(1ubuntu1)) |
bi32_lowsize | clang -march=native -Os -fwrapv -Qunused-arguments -fPIC -fPIE -gdwarf-4 -Wall (Ubuntu_Clang_19.1.1_(1ubuntu1)) |
Compiler output
aead.c: In file included from round.h:8,
aead.c: from permutations.h:11,
aead.c: from aead.c:3:
aead.c: word.h:55:11: warning: 'crypto_int64_bitmod_01' is static but used in inline function 'NOTZERO' which is not static
aead.c: 55 | return (crypto_int64_bitmod_01(((int)(result & 0xff) - 1),8)) - 1;
aead.c: | ^~~~~~~~~~~~~~~~~~~~~~
crypto_aead.c: In file included from round.h:8,
crypto_aead.c: from permutations.h:11,
crypto_aead.c: from crypto_aead.c:8:
crypto_aead.c: word.h:55:11: warning: 'crypto_int64_bitmod_01' is static but used in inline function 'NOTZERO' which is not static
crypto_aead.c: 55 | return (crypto_int64_bitmod_01(((int)(result & 0xff) - 1),8)) - 1;
crypto_aead.c: | ^~~~~~~~~~~~~~~~~~~~~~
permutations.c: In file included from round.h:8,
permutations.c: from permutations.h:11,
permutations.c: from permutations.c:1:
permutations.c: word.h:55:11: warning: 'crypto_int64_bitmod_01' is static but used in inline function 'NOTZERO' which is not static
permutations.c: 55 | return (crypto_int64_bitmod_01(((int)(result & 0xff) - 1),8)) - 1;
permutations.c: | ^~~~~~~~~~~~~~~~~~~~~~
update.c: update.c: In function 'ascon_update':
update.c: update.c:21:13: warning: unused variable 'rate' [-Wunused-variable]
update.c: 21 | const int rate = ASCON_AEAD_RATE;
update.c: | ^~~~
update.c: In file included from round.h:8,
update.c: from permutations.h:11,
update.c: from update.c:3:
update.c: word.h: At top level:
update.c: word.h:55:11: warning: 'crypto_int64_bitmod_01' is static but used in inline function 'NOTZERO' which is not static
update.c: 55 | return (crypto_int64_bitmod_01(((int)(result & 0xff) - 1),8)) - 1;
update.c: | ^~~~~~~~~~~~~~~~~~~~~~
try.c: In file included from try-anything-timecop.c:3:
try.c: try-anything.c:17:10: fatal error: cpucycles.h: No such file or directory
try.c: 17 | #include "cpucycles.h"
try.c: | ^~~~~~~~~~~~~
try.c: compilation terminated.
Number of similar (implementation,compiler) pairs: 3, namely:
Implementation | Compiler |
bi32_lowsize | gcc -march=native -mtune=native -O2 -fwrapv -fPIC -fPIE -gdwarf-4 -Wall (14.2.0) |
bi32_lowsize | gcc -march=native -mtune=native -O3 -fwrapv -fPIC -fPIE -gdwarf-4 -Wall (14.2.0) |
bi32_lowsize | gcc -march=native -mtune=native -Os -fwrapv -fPIC -fPIE -gdwarf-4 -Wall (14.2.0) |
Compiler output
try.c: In file included from try-anything-timecop.c:3:
try.c: try-anything.c:17:10: fatal error: cpucycles.h: No such file or directory
try.c: 17 | #include "cpucycles.h"
try.c: | ^~~~~~~~~~~~~
try.c: compilation terminated.
Number of similar (implementation,compiler) pairs: 3, namely:
Implementation | Compiler |
ref | gcc -march=native -mtune=native -O2 -fwrapv -fPIC -fPIE -gdwarf-4 -Wall (14.2.0) |
ref | gcc -march=native -mtune=native -O3 -fwrapv -fPIC -fPIE -gdwarf-4 -Wall (14.2.0) |
ref | gcc -march=native -mtune=native -Os -fwrapv -fPIC -fPIE -gdwarf-4 -Wall (14.2.0) |
Namespace violations
constants.o constants R
permutations.o P12 T
permutations.o P6 T
Number of similar (implementation,compiler) pairs: 6, namely:
Implementation | Compiler |
bi32 | clang -march=native -O2 -fwrapv -Qunused-arguments -fPIC -fPIE -gdwarf-4 -Wall (Ubuntu_Clang_19.1.1_(1ubuntu1)) |
bi32 | clang -march=native -O3 -fwrapv -Qunused-arguments -fPIC -fPIE -gdwarf-4 -Wall (Ubuntu_Clang_19.1.1_(1ubuntu1)) |
bi32 | clang -march=native -Os -fwrapv -Qunused-arguments -fPIC -fPIE -gdwarf-4 -Wall (Ubuntu_Clang_19.1.1_(1ubuntu1)) |
bi32 | gcc -march=native -mtune=native -O2 -fwrapv -fPIC -fPIE -gdwarf-4 -Wall (14.2.0) |
bi32 | gcc -march=native -mtune=native -O3 -fwrapv -fPIC -fPIE -gdwarf-4 -Wall (14.2.0) |
bi32 | gcc -march=native -mtune=native -Os -fwrapv -fPIC -fPIE -gdwarf-4 -Wall (14.2.0) |
Namespace violations
aead.o ascon_adata T
aead.o ascon_decrypt T
aead.o ascon_encrypt T
aead.o ascon_final T
aead.o ascon_initaead T
aead.o ascon_loadkey T
constants.o constants R
Number of similar (implementation,compiler) pairs: 6, namely:
Implementation | Compiler |
bi32_lowreg | clang -march=native -O2 -fwrapv -Qunused-arguments -fPIC -fPIE -gdwarf-4 -Wall (Ubuntu_Clang_19.1.1_(1ubuntu1)) |
bi32_lowreg | clang -march=native -O3 -fwrapv -Qunused-arguments -fPIC -fPIE -gdwarf-4 -Wall (Ubuntu_Clang_19.1.1_(1ubuntu1)) |
bi32_lowreg | clang -march=native -Os -fwrapv -Qunused-arguments -fPIC -fPIE -gdwarf-4 -Wall (Ubuntu_Clang_19.1.1_(1ubuntu1)) |
bi32_lowreg | gcc -march=native -mtune=native -O2 -fwrapv -fPIC -fPIE -gdwarf-4 -Wall (14.2.0) |
bi32_lowreg | gcc -march=native -mtune=native -O3 -fwrapv -fPIC -fPIE -gdwarf-4 -Wall (14.2.0) |
bi32_lowreg | gcc -march=native -mtune=native -Os -fwrapv -fPIC -fPIE -gdwarf-4 -Wall (14.2.0) |
Namespace violations
aead.o ascon_aead T
constants.o constants R
permutations.o P T
update.o ascon_update T
Number of similar (implementation,compiler) pairs: 6, namely:
Implementation | Compiler |
bi32_lowsize | clang -march=native -O2 -fwrapv -Qunused-arguments -fPIC -fPIE -gdwarf-4 -Wall (Ubuntu_Clang_19.1.1_(1ubuntu1)) |
bi32_lowsize | clang -march=native -O3 -fwrapv -Qunused-arguments -fPIC -fPIE -gdwarf-4 -Wall (Ubuntu_Clang_19.1.1_(1ubuntu1)) |
bi32_lowsize | clang -march=native -Os -fwrapv -Qunused-arguments -fPIC -fPIE -gdwarf-4 -Wall (Ubuntu_Clang_19.1.1_(1ubuntu1)) |
bi32_lowsize | gcc -march=native -mtune=native -O2 -fwrapv -fPIC -fPIE -gdwarf-4 -Wall (14.2.0) |
bi32_lowsize | gcc -march=native -mtune=native -O3 -fwrapv -fPIC -fPIE -gdwarf-4 -Wall (14.2.0) |
bi32_lowsize | gcc -march=native -mtune=native -Os -fwrapv -fPIC -fPIE -gdwarf-4 -Wall (14.2.0) |
TIMECOP error (can be valgrind bug)
error 127
timeout: failed to run command 'valgrind': No such file or directory
Number of similar (implementation,compiler) pairs: 24, namely:
Implementation | Compiler |
bi32 | clang -march=native -O2 -fwrapv -Qunused-arguments -fPIC -fPIE -gdwarf-4 -Wall (Ubuntu_Clang_19.1.1_(1ubuntu1)) |
bi32 | clang -march=native -O3 -fwrapv -Qunused-arguments -fPIC -fPIE -gdwarf-4 -Wall (Ubuntu_Clang_19.1.1_(1ubuntu1)) |
bi32 | clang -march=native -Os -fwrapv -Qunused-arguments -fPIC -fPIE -gdwarf-4 -Wall (Ubuntu_Clang_19.1.1_(1ubuntu1)) |
bi32 | gcc -march=native -mtune=native -O2 -fwrapv -fPIC -fPIE -gdwarf-4 -Wall (14.2.0) |
bi32 | gcc -march=native -mtune=native -O3 -fwrapv -fPIC -fPIE -gdwarf-4 -Wall (14.2.0) |
bi32 | gcc -march=native -mtune=native -Os -fwrapv -fPIC -fPIE -gdwarf-4 -Wall (14.2.0) |
bi32_lowreg | clang -march=native -O2 -fwrapv -Qunused-arguments -fPIC -fPIE -gdwarf-4 -Wall (Ubuntu_Clang_19.1.1_(1ubuntu1)) |
bi32_lowreg | clang -march=native -O3 -fwrapv -Qunused-arguments -fPIC -fPIE -gdwarf-4 -Wall (Ubuntu_Clang_19.1.1_(1ubuntu1)) |
bi32_lowreg | clang -march=native -Os -fwrapv -Qunused-arguments -fPIC -fPIE -gdwarf-4 -Wall (Ubuntu_Clang_19.1.1_(1ubuntu1)) |
bi32_lowreg | gcc -march=native -mtune=native -O2 -fwrapv -fPIC -fPIE -gdwarf-4 -Wall (14.2.0) |
bi32_lowreg | gcc -march=native -mtune=native -O3 -fwrapv -fPIC -fPIE -gdwarf-4 -Wall (14.2.0) |
bi32_lowreg | gcc -march=native -mtune=native -Os -fwrapv -fPIC -fPIE -gdwarf-4 -Wall (14.2.0) |
bi32_lowsize | clang -march=native -O2 -fwrapv -Qunused-arguments -fPIC -fPIE -gdwarf-4 -Wall (Ubuntu_Clang_19.1.1_(1ubuntu1)) |
bi32_lowsize | clang -march=native -O3 -fwrapv -Qunused-arguments -fPIC -fPIE -gdwarf-4 -Wall (Ubuntu_Clang_19.1.1_(1ubuntu1)) |
bi32_lowsize | clang -march=native -Os -fwrapv -Qunused-arguments -fPIC -fPIE -gdwarf-4 -Wall (Ubuntu_Clang_19.1.1_(1ubuntu1)) |
bi32_lowsize | gcc -march=native -mtune=native -O2 -fwrapv -fPIC -fPIE -gdwarf-4 -Wall (14.2.0) |
bi32_lowsize | gcc -march=native -mtune=native -O3 -fwrapv -fPIC -fPIE -gdwarf-4 -Wall (14.2.0) |
bi32_lowsize | gcc -march=native -mtune=native -Os -fwrapv -fPIC -fPIE -gdwarf-4 -Wall (14.2.0) |
ref | clang -march=native -O2 -fwrapv -Qunused-arguments -fPIC -fPIE -gdwarf-4 -Wall (Ubuntu_Clang_19.1.1_(1ubuntu1)) |
ref | clang -march=native -O3 -fwrapv -Qunused-arguments -fPIC -fPIE -gdwarf-4 -Wall (Ubuntu_Clang_19.1.1_(1ubuntu1)) |
ref | clang -march=native -Os -fwrapv -Qunused-arguments -fPIC -fPIE -gdwarf-4 -Wall (Ubuntu_Clang_19.1.1_(1ubuntu1)) |
ref | gcc -march=native -mtune=native -O2 -fwrapv -fPIC -fPIE -gdwarf-4 -Wall (14.2.0) |
ref | gcc -march=native -mtune=native -O3 -fwrapv -fPIC -fPIE -gdwarf-4 -Wall (14.2.0) |
ref | gcc -march=native -mtune=native -Os -fwrapv -fPIC -fPIE -gdwarf-4 -Wall (14.2.0) |