Implementation notes: amd64, h8bobcat, crypto_hash/luffa256

Computer: h8bobcat
Microarchitecture: amd64; Bobcat (500f10)
Architecture: amd64
CPU ID: AuthenticAMD-00500f20-178bfbff
SUPERCOP version: 20240425
Operation: crypto_hash
Primitive: luffa256
TimeObject sizeTest sizeImplementationCompilerBenchmark dateSUPERCOP version
6575025765 0 036726 776 800T:sphlibgcc_-march=native_-mtune=native_-O_-fomit-frame-pointer_-fwrapv_-fPIC_-fPIE2024043020240425
658543008 0 9614076 816 832T:thomaz/basicclang_-march=native_-O2_-fomit-frame-pointer_-fwrapv_-Qunused-arguments_-fPIC_-fPIE2024043020240425
6681927224 0 040046 776 800T:sphlibgcc_-march=native_-mtune=native_-O3_-fomit-frame-pointer_-fwrapv_-fPIC_-fPIE2024043020240425
6730324783 0 034382 808 728T:sphlibclang_-march=native_-Os_-fomit-frame-pointer_-fwrapv_-Qunused-arguments_-fPIC_-fPIE2024043020240425
749939890 0 54420796 816 1280T:sse2clang_-march=native_-O2_-fomit-frame-pointer_-fwrapv_-Qunused-arguments_-fPIC_-fPIE2024043020240425
7744910099 0 54421366 776 1344T:sse2gcc_-march=native_-mtune=native_-O2_-fomit-frame-pointer_-fwrapv_-fPIC_-fPIE2024043020240425
776018551 0 54418329 752 1312T:sse2gcc_-march=native_-mtune=native_-Os_-fomit-frame-pointer_-fwrapv_-fPIC_-fPIE2024043020240425
8182910499 320 021838 1104 800T:opt32gcc_-march=native_-mtune=native_-O2_-fomit-frame-pointer_-fwrapv_-fPIC_-fPIE2024043020240425
8595110473 320 021333 1096 800T:opt32gcc_-march=native_-mtune=native_-O_-fomit-frame-pointer_-fwrapv_-fPIC_-fPIE2024043020240425
10400615643 320 026740 1144 728T:opt32clang_-march=native_-O2_-fomit-frame-pointer_-fwrapv_-Qunused-arguments_-fPIC_-fPIE2024043020240425
10453326912 0 038262 776 800T:sphlibgcc_-march=native_-mtune=native_-O2_-fomit-frame-pointer_-fwrapv_-fPIC_-fPIE2024043020240425
1049473077 0 9615516 816 832T:thomaz/basicclang_-mcpu=native_-O3_-fomit-frame-pointer_-fwrapv_-Qunused-arguments_-fPIC_-fPIE2024043020240425
1053743008 0 9615220 816 832T:thomaz/basicclang_-march=native_-O3_-fomit-frame-pointer_-fwrapv_-Qunused-arguments_-fPIC_-fPIE2024043020240425
10688019235 320 031612 1144 728T:opt32clang_-mcpu=native_-O3_-fomit-frame-pointer_-fwrapv_-Qunused-arguments_-fPIC_-fPIE2024043020240425
10729825681 0 035908 816 728T:sphlibclang_-march=native_-O_-fomit-frame-pointer_-fwrapv_-Qunused-arguments_-fPIC_-fPIE2024043020240425
10731225493 0 036684 816 728T:sphlibclang_-march=native_-O2_-fomit-frame-pointer_-fwrapv_-Qunused-arguments_-fPIC_-fPIE2024043020240425
10735925541 0 037876 816 728T:sphlibclang_-march=native_-O3_-fomit-frame-pointer_-fwrapv_-Qunused-arguments_-fPIC_-fPIE2024043020240425
10745516795 320 028860 1144 728T:opt32clang_-march=native_-O3_-fomit-frame-pointer_-fwrapv_-Qunused-arguments_-fPIC_-fPIE2024043020240425
1108412123 0 9612252 816 832T:thomaz/basicclang_-march=native_-O_-fomit-frame-pointer_-fwrapv_-Qunused-arguments_-fPIC_-fPIE2024043020240425
11118825840 0 038388 816 728T:sphlibclang_-mcpu=native_-O3_-fomit-frame-pointer_-fwrapv_-Qunused-arguments_-fPIC_-fPIE2024043020240425
11384811296 0 54423580 816 1280T:sse2clang_-mcpu=native_-O3_-fomit-frame-pointer_-fwrapv_-Qunused-arguments_-fPIC_-fPIE2024043020240425
11909711038 0 54423782 776 1344T:sse2gcc_-march=native_-mtune=native_-O3_-fomit-frame-pointer_-fwrapv_-fPIC_-fPIE2024043020240425
1191919194 320 018718 1136 728T:opt32clang_-march=native_-Os_-fomit-frame-pointer_-fwrapv_-Qunused-arguments_-fPIC_-fPIE2024043020240425
1199289986 0 54422044 816 1280T:sse2clang_-march=native_-O3_-fomit-frame-pointer_-fwrapv_-Qunused-arguments_-fPIC_-fPIE2024043020240425
12121121979 0 031833 752 768T:sphlibgcc_-march=native_-mtune=native_-Os_-fomit-frame-pointer_-fwrapv_-fPIC_-fPIE2024043020240425
12286811177 320 021412 1144 728T:opt32clang_-march=native_-O_-fomit-frame-pointer_-fwrapv_-Qunused-arguments_-fPIC_-fPIE2024043020240425
12670719175 320 031982 1104 800T:opt32gcc_-march=native_-mtune=native_-O3_-fomit-frame-pointer_-fwrapv_-fPIC_-fPIE2024043020240425
1277288781 0 54418270 808 1280T:sse2clang_-march=native_-Os_-fomit-frame-pointer_-fwrapv_-Qunused-arguments_-fPIC_-fPIE2024043020240425
1314379914 0 54420060 816 1280T:sse2clang_-march=native_-O_-fomit-frame-pointer_-fwrapv_-Qunused-arguments_-fPIC_-fPIE2024043020240425
13411610758 0 54421549 768 1344T:sse2gcc_-march=native_-mtune=native_-O_-fomit-frame-pointer_-fwrapv_-fPIC_-fPIE2024043020240425
1554209198 320 019049 1080 768T:opt32gcc_-march=native_-mtune=native_-Os_-fomit-frame-pointer_-fwrapv_-fPIC_-fPIE2024043020240425
2747783389 0 9616126 776 896T:thomaz/basicgcc_-march=native_-mtune=native_-O3_-fomit-frame-pointer_-fwrapv_-fPIC_-fPIE2024043020240425
3515532008 0 9611518 808 832T:thomaz/basicclang_-march=native_-Os_-fomit-frame-pointer_-fwrapv_-Qunused-arguments_-fPIC_-fPIE2024043020240425
3565692381 0 9613638 776 896T:thomaz/basicgcc_-march=native_-mtune=native_-O2_-fomit-frame-pointer_-fwrapv_-fPIC_-fPIE2024043020240425
5865961888 0 9611689 752 864T:thomaz/basicgcc_-march=native_-mtune=native_-Os_-fomit-frame-pointer_-fwrapv_-fPIC_-fPIE2024043020240425
5950231988 0 9612813 768 896T:thomaz/basicgcc_-march=native_-mtune=native_-O_-fomit-frame-pointer_-fwrapv_-fPIC_-fPIE2024043020240425

Compiler output

Implementation: T:sse2_x64asm
Security model: timingleaks
Compiler: clang -march=native -O2 -fomit-frame-pointer -fwrapv -Qunused-arguments -fPIC -fPIE
luffa_x64asm.s: luffa_x64asm.s:780:13: error: unknown token in expression
luffa_x64asm.s: movaps %xmm0, [IV ]
luffa_x64asm.s: ^
luffa_x64asm.s: luffa_x64asm.s:781:13: error: unknown token in expression
luffa_x64asm.s: movaps %xmm1, [IV+16]
luffa_x64asm.s: ^
luffa_x64asm.s: luffa_x64asm.s:782:13: error: unknown token in expression
luffa_x64asm.s: movaps %xmm2, [IV+32]
luffa_x64asm.s: ^
luffa_x64asm.s: luffa_x64asm.s:783:13: error: unknown token in expression
luffa_x64asm.s: movaps %xmm3, [IV+48]
luffa_x64asm.s: ^
luffa_x64asm.s: luffa_x64asm.s:784:13: error: unknown token in expression
luffa_x64asm.s: movaps %xmm4, [IV+64]
luffa_x64asm.s: ^
luffa_x64asm.s: luffa_x64asm.s:785:13: error: unknown token in expression
luffa_x64asm.s: movaps %xmm5, [IV+80]
luffa_x64asm.s: ^
luffa_x64asm.s: luffa_x64asm.s:786:14: error: unknown token in expression
luffa_x64asm.s: movups [%rdi ], %xmm0
luffa_x64asm.s: ^
luffa_x64asm.s: luffa_x64asm.s:787:14: error: unknown token in expression
luffa_x64asm.s: movups [%rdi+16], %xmm1
luffa_x64asm.s: ^
luffa_x64asm.s: luffa_x64asm.s:788:14: error: unknown token in expression
luffa_x64asm.s: ...

Number of similar (compiler,implementation) pairs: 10, namely:
CompilerImplementations
clang -march=native -O2 -fomit-frame-pointer -fwrapv -Qunused-arguments -fPIC -fPIE T:sse2_x64asm
clang -march=native -O3 -fomit-frame-pointer -fwrapv -Qunused-arguments -fPIC -fPIE T:sse2_x64asm
clang -march=native -O -fomit-frame-pointer -fwrapv -Qunused-arguments -fPIC -fPIE T:sse2_x64asm
clang -march=native -Os -fomit-frame-pointer -fwrapv -Qunused-arguments -fPIC -fPIE T:sse2_x64asm
clang -mcpu=native -O3 -fomit-frame-pointer -fwrapv -Qunused-arguments -fPIC -fPIE T:sse2_x64asm
clang -march=native -O2 -fomit-frame-pointer -fwrapv -Qunused-arguments -fPIC -fPIE T:ssse3_x64asm
clang -march=native -O3 -fomit-frame-pointer -fwrapv -Qunused-arguments -fPIC -fPIE T:ssse3_x64asm
clang -march=native -O -fomit-frame-pointer -fwrapv -Qunused-arguments -fPIC -fPIE T:ssse3_x64asm
clang -march=native -Os -fomit-frame-pointer -fwrapv -Qunused-arguments -fPIC -fPIE T:ssse3_x64asm
clang -mcpu=native -O3 -fomit-frame-pointer -fwrapv -Qunused-arguments -fPIC -fPIE T:ssse3_x64asm

Compiler output

Implementation: T:sse2_x64asm
Security model: timingleaks
Compiler: gcc -march=native -mtune=native -O2 -fomit-frame-pointer -fwrapv -fPIC -fPIE
try.c: /usr/bin/ld: libcrypto_hash_luffa256.a(luffa_x64asm.o): relocation R_X86_64_32S against symbol `IV' can not be used when making a PIE object; recompile with -fPIE
try.c: /usr/bin/ld: failed to set dynamic section sizes: bad value
try.c: collect2: error: ld returned 1 exit status

Number of similar (compiler,implementation) pairs: 16, namely:
CompilerImplementations
gcc -march=native -mtune=native -O2 -fomit-frame-pointer -fwrapv -fPIC -fPIE T:sse2_x64asm
gcc -march=native -mtune=native -O3 -fomit-frame-pointer -fwrapv -fPIC -fPIE T:sse2_x64asm
gcc -march=native -mtune=native -O -fomit-frame-pointer -fwrapv -fPIC -fPIE T:sse2_x64asm
gcc -march=native -mtune=native -Os -fomit-frame-pointer -fwrapv -fPIC -fPIE T:sse2_x64asm
gcc -march=native -mtune=native -O2 -fomit-frame-pointer -fwrapv -fPIC -fPIE T:sse2_x64asm-2
gcc -march=native -mtune=native -O3 -fomit-frame-pointer -fwrapv -fPIC -fPIE T:sse2_x64asm-2
gcc -march=native -mtune=native -O -fomit-frame-pointer -fwrapv -fPIC -fPIE T:sse2_x64asm-2
gcc -march=native -mtune=native -Os -fomit-frame-pointer -fwrapv -fPIC -fPIE T:sse2_x64asm-2
gcc -march=native -mtune=native -O2 -fomit-frame-pointer -fwrapv -fPIC -fPIE T:ssse3_x64asm
gcc -march=native -mtune=native -O3 -fomit-frame-pointer -fwrapv -fPIC -fPIE T:ssse3_x64asm
gcc -march=native -mtune=native -O -fomit-frame-pointer -fwrapv -fPIC -fPIE T:ssse3_x64asm
gcc -march=native -mtune=native -Os -fomit-frame-pointer -fwrapv -fPIC -fPIE T:ssse3_x64asm
gcc -march=native -mtune=native -O2 -fomit-frame-pointer -fwrapv -fPIC -fPIE T:ssse3_x64asm-2
gcc -march=native -mtune=native -O3 -fomit-frame-pointer -fwrapv -fPIC -fPIE T:ssse3_x64asm-2
gcc -march=native -mtune=native -O -fomit-frame-pointer -fwrapv -fPIC -fPIE T:ssse3_x64asm-2
gcc -march=native -mtune=native -Os -fomit-frame-pointer -fwrapv -fPIC -fPIE T:ssse3_x64asm-2

Compiler output

Implementation: T:sse2_x64asm-2
Security model: timingleaks
Compiler: clang -march=native -O2 -fomit-frame-pointer -fwrapv -Qunused-arguments -fPIC -fPIE
luffa_x64asm.s: luffa_x64asm.s:780:13: error: unknown token in expression
luffa_x64asm.s: movdqa %xmm0, [IV ]
luffa_x64asm.s: ^
luffa_x64asm.s: luffa_x64asm.s:781:13: error: unknown token in expression
luffa_x64asm.s: movdqa %xmm1, [IV+16]
luffa_x64asm.s: ^
luffa_x64asm.s: luffa_x64asm.s:782:13: error: unknown token in expression
luffa_x64asm.s: movdqa %xmm2, [IV+32]
luffa_x64asm.s: ^
luffa_x64asm.s: luffa_x64asm.s:783:13: error: unknown token in expression
luffa_x64asm.s: movdqa %xmm3, [IV+48]
luffa_x64asm.s: ^
luffa_x64asm.s: luffa_x64asm.s:784:13: error: unknown token in expression
luffa_x64asm.s: movdqa %xmm4, [IV+64]
luffa_x64asm.s: ^
luffa_x64asm.s: luffa_x64asm.s:785:13: error: unknown token in expression
luffa_x64asm.s: movdqa %xmm5, [IV+80]
luffa_x64asm.s: ^
luffa_x64asm.s: luffa_x64asm.s:786:14: error: unknown token in expression
luffa_x64asm.s: movups [%rdi ], %xmm0
luffa_x64asm.s: ^
luffa_x64asm.s: luffa_x64asm.s:787:14: error: unknown token in expression
luffa_x64asm.s: movups [%rdi+16], %xmm1
luffa_x64asm.s: ^
luffa_x64asm.s: luffa_x64asm.s:788:14: error: unknown token in expression
luffa_x64asm.s: ...

Number of similar (compiler,implementation) pairs: 10, namely:
CompilerImplementations
clang -march=native -O2 -fomit-frame-pointer -fwrapv -Qunused-arguments -fPIC -fPIE T:sse2_x64asm-2
clang -march=native -O3 -fomit-frame-pointer -fwrapv -Qunused-arguments -fPIC -fPIE T:sse2_x64asm-2
clang -march=native -O -fomit-frame-pointer -fwrapv -Qunused-arguments -fPIC -fPIE T:sse2_x64asm-2
clang -march=native -Os -fomit-frame-pointer -fwrapv -Qunused-arguments -fPIC -fPIE T:sse2_x64asm-2
clang -mcpu=native -O3 -fomit-frame-pointer -fwrapv -Qunused-arguments -fPIC -fPIE T:sse2_x64asm-2
clang -march=native -O2 -fomit-frame-pointer -fwrapv -Qunused-arguments -fPIC -fPIE T:ssse3_x64asm-2
clang -march=native -O3 -fomit-frame-pointer -fwrapv -Qunused-arguments -fPIC -fPIE T:ssse3_x64asm-2
clang -march=native -O -fomit-frame-pointer -fwrapv -Qunused-arguments -fPIC -fPIE T:ssse3_x64asm-2
clang -march=native -Os -fomit-frame-pointer -fwrapv -Qunused-arguments -fPIC -fPIE T:ssse3_x64asm-2
clang -mcpu=native -O3 -fomit-frame-pointer -fwrapv -Qunused-arguments -fPIC -fPIE T:ssse3_x64asm-2

Compiler output

Implementation: T:ssse3_x64asm-PS
Security model: timingleaks
Compiler: clang -march=native -O2 -fomit-frame-pointer -fwrapv -Qunused-arguments -fPIC -fPIE
luffa256_x64asm.s: luffa256_x64asm.s:297:9: error: unknown token in expression
luffa256_x64asm.s: movaps %xmm0, [IV ]
luffa256_x64asm.s: ^
luffa256_x64asm.s: luffa256_x64asm.s:298:9: error: unknown token in expression
luffa256_x64asm.s: movaps %xmm1, [IV+16]
luffa256_x64asm.s: ^
luffa256_x64asm.s: luffa256_x64asm.s:299:9: error: unknown token in expression
luffa256_x64asm.s: movaps %xmm2, [IV+32]
luffa256_x64asm.s: ^
luffa256_x64asm.s: luffa256_x64asm.s:300:9: error: unknown token in expression
luffa256_x64asm.s: movaps %xmm3, [IV+48]
luffa256_x64asm.s: ^
luffa256_x64asm.s: luffa256_x64asm.s:301:9: error: unknown token in expression
luffa256_x64asm.s: movaps %xmm4, [IV+64]
luffa256_x64asm.s: ^
luffa256_x64asm.s: luffa256_x64asm.s:302:9: error: unknown token in expression
luffa256_x64asm.s: movaps %xmm5, [IV+80]
luffa256_x64asm.s: ^
luffa256_x64asm.s: luffa256_x64asm.s:303:10: error: unknown token in expression
luffa256_x64asm.s: movups [%rdi ], %xmm0
luffa256_x64asm.s: ^
luffa256_x64asm.s: luffa256_x64asm.s:304:10: error: unknown token in expression
luffa256_x64asm.s: movups [%rdi+16], %xmm1
luffa256_x64asm.s: ^
luffa256_x64asm.s: luffa256_x64asm.s:305:10: error: unknown token in expression
luffa256_x64asm.s: ...

Number of similar (compiler,implementation) pairs: 5, namely:
CompilerImplementations
clang -march=native -O2 -fomit-frame-pointer -fwrapv -Qunused-arguments -fPIC -fPIE T:ssse3_x64asm-PS
clang -march=native -O3 -fomit-frame-pointer -fwrapv -Qunused-arguments -fPIC -fPIE T:ssse3_x64asm-PS
clang -march=native -O -fomit-frame-pointer -fwrapv -Qunused-arguments -fPIC -fPIE T:ssse3_x64asm-PS
clang -march=native -Os -fomit-frame-pointer -fwrapv -Qunused-arguments -fPIC -fPIE T:ssse3_x64asm-PS
clang -mcpu=native -O3 -fomit-frame-pointer -fwrapv -Qunused-arguments -fPIC -fPIE T:ssse3_x64asm-PS

Compiler output

Implementation: T:ssse3_x64asm-PS
Security model: timingleaks
Compiler: gcc -march=native -mtune=native -O2 -fomit-frame-pointer -fwrapv -fPIC -fPIE
try.c: /usr/bin/ld: libcrypto_hash_luffa256.a(luffa256_x64asm.o): relocation R_X86_64_32S against `.rodata' can not be used when making a PIE object; recompile with -fPIE
try.c: /usr/bin/ld: failed to set dynamic section sizes: bad value
try.c: collect2: error: ld returned 1 exit status

Number of similar (compiler,implementation) pairs: 8, namely:
CompilerImplementations
gcc -march=native -mtune=native -O2 -fomit-frame-pointer -fwrapv -fPIC -fPIE T:ssse3_x64asm-PS
gcc -march=native -mtune=native -O3 -fomit-frame-pointer -fwrapv -fPIC -fPIE T:ssse3_x64asm-PS
gcc -march=native -mtune=native -O -fomit-frame-pointer -fwrapv -fPIC -fPIE T:ssse3_x64asm-PS
gcc -march=native -mtune=native -Os -fomit-frame-pointer -fwrapv -fPIC -fPIE T:ssse3_x64asm-PS
gcc -march=native -mtune=native -O2 -fomit-frame-pointer -fwrapv -fPIC -fPIE T:ssse3_x64asm-PS-2
gcc -march=native -mtune=native -O3 -fomit-frame-pointer -fwrapv -fPIC -fPIE T:ssse3_x64asm-PS-2
gcc -march=native -mtune=native -O -fomit-frame-pointer -fwrapv -fPIC -fPIE T:ssse3_x64asm-PS-2
gcc -march=native -mtune=native -Os -fomit-frame-pointer -fwrapv -fPIC -fPIE T:ssse3_x64asm-PS-2

Compiler output

Implementation: T:ssse3_x64asm-PS-2
Security model: timingleaks
Compiler: clang -march=native -O2 -fomit-frame-pointer -fwrapv -Qunused-arguments -fPIC -fPIE
luffa256_x64asm.s: luffa256_x64asm.s:297:9: error: unknown token in expression
luffa256_x64asm.s: movdqa %xmm0, [IV ]
luffa256_x64asm.s: ^
luffa256_x64asm.s: luffa256_x64asm.s:298:9: error: unknown token in expression
luffa256_x64asm.s: movdqa %xmm1, [IV+16]
luffa256_x64asm.s: ^
luffa256_x64asm.s: luffa256_x64asm.s:299:9: error: unknown token in expression
luffa256_x64asm.s: movdqa %xmm2, [IV+32]
luffa256_x64asm.s: ^
luffa256_x64asm.s: luffa256_x64asm.s:300:9: error: unknown token in expression
luffa256_x64asm.s: movdqa %xmm3, [IV+48]
luffa256_x64asm.s: ^
luffa256_x64asm.s: luffa256_x64asm.s:301:9: error: unknown token in expression
luffa256_x64asm.s: movdqa %xmm4, [IV+64]
luffa256_x64asm.s: ^
luffa256_x64asm.s: luffa256_x64asm.s:302:9: error: unknown token in expression
luffa256_x64asm.s: movdqa %xmm5, [IV+80]
luffa256_x64asm.s: ^
luffa256_x64asm.s: luffa256_x64asm.s:303:10: error: unknown token in expression
luffa256_x64asm.s: movdqu [%rdi ], %xmm0
luffa256_x64asm.s: ^
luffa256_x64asm.s: luffa256_x64asm.s:304:10: error: unknown token in expression
luffa256_x64asm.s: movdqu [%rdi+16], %xmm1
luffa256_x64asm.s: ^
luffa256_x64asm.s: luffa256_x64asm.s:305:10: error: unknown token in expression
luffa256_x64asm.s: ...

Number of similar (compiler,implementation) pairs: 5, namely:
CompilerImplementations
clang -march=native -O2 -fomit-frame-pointer -fwrapv -Qunused-arguments -fPIC -fPIE T:ssse3_x64asm-PS-2
clang -march=native -O3 -fomit-frame-pointer -fwrapv -Qunused-arguments -fPIC -fPIE T:ssse3_x64asm-PS-2
clang -march=native -O -fomit-frame-pointer -fwrapv -Qunused-arguments -fPIC -fPIE T:ssse3_x64asm-PS-2
clang -march=native -Os -fomit-frame-pointer -fwrapv -Qunused-arguments -fPIC -fPIE T:ssse3_x64asm-PS-2
clang -mcpu=native -O3 -fomit-frame-pointer -fwrapv -Qunused-arguments -fPIC -fPIE T:ssse3_x64asm-PS-2

Compiler output

Implementation: T:thomaz/asm-PS
Security model: timingleaks
Compiler: clang -march=native -O2 -fomit-frame-pointer -fwrapv -Qunused-arguments -fPIC -fPIE
hash.c: hash.c:32:12: warning: passing 'const unsigned char *' to parameter of type 'unsigned char *' discards qualifiers [-Wincompatible-pointer-types-discards-qualifiers]
hash.c: fLuffa256(in, out, inlen);
hash.c: ^~
hash.c: hash.c:29:31: note: passing argument to parameter 'input' here
hash.c: void fLuffa256(unsigned char *input, unsigned char *output, int len);
hash.c: ^
hash.c: 1 warning generated.
luffa_256.s: <instantiation>:1:8: error: unknown token in expression
luffa_256.s: pshufb %xmm6, %xmm12
luffa_256.s: ^
luffa_256.s: <instantiation>:1:1: note: while in macro instantiation
luffa_256.s: mPSSTEPI %xmm6, %xmm7, %xmm12
luffa_256.s: ^
luffa_256.s: luffa_256.s:232:2: note: while in macro instantiation
luffa_256.s: mPS %xmm6, %xmm7, %xmm8, %xmm9, %xmm10, %xmm11
luffa_256.s: ^
luffa_256.s: <instantiation>:2:9: error: unknown token in expression
luffa_256.s: pshufb %xmm7, %xmm12
luffa_256.s: ^
luffa_256.s: <instantiation>:1:1: note: while in macro instantiation
luffa_256.s: mPSSTEPI %xmm6, %xmm7, %xmm12
luffa_256.s: ^
luffa_256.s: luffa_256.s:232:2: note: while in macro instantiation
luffa_256.s: mPS %xmm6, %xmm7, %xmm8, %xmm9, %xmm10, %xmm11
luffa_256.s: ^
luffa_256.s: <instantiation>:1:8: error: unknown token in expression
luffa_256.s: movaps %xmm8, %xmm6
luffa_256.s: ^
luffa_256.s: <instantiation>:2:2: note: while in macro instantiation
luffa_256.s: mPSSTEPII %xmm6, %xmm7, %xmm8, %xmm9, %xmm10, %xmm11
luffa_256.s: ^
luffa_256.s: luffa_256.s:232:2: note: while in macro instantiation
luffa_256.s: ...

Number of similar (compiler,implementation) pairs: 10, namely:
CompilerImplementations
clang -march=native -O2 -fomit-frame-pointer -fwrapv -Qunused-arguments -fPIC -fPIE T:thomaz/asm-PS
clang -march=native -O3 -fomit-frame-pointer -fwrapv -Qunused-arguments -fPIC -fPIE T:thomaz/asm-PS
clang -march=native -O -fomit-frame-pointer -fwrapv -Qunused-arguments -fPIC -fPIE T:thomaz/asm-PS
clang -march=native -Os -fomit-frame-pointer -fwrapv -Qunused-arguments -fPIC -fPIE T:thomaz/asm-PS
clang -mcpu=native -O3 -fomit-frame-pointer -fwrapv -Qunused-arguments -fPIC -fPIE T:thomaz/asm-PS
clang -march=native -O2 -fomit-frame-pointer -fwrapv -Qunused-arguments -fPIC -fPIE T:thomaz/asm-PS-v2-FP
clang -march=native -O3 -fomit-frame-pointer -fwrapv -Qunused-arguments -fPIC -fPIE T:thomaz/asm-PS-v2-FP
clang -march=native -O -fomit-frame-pointer -fwrapv -Qunused-arguments -fPIC -fPIE T:thomaz/asm-PS-v2-FP
clang -march=native -Os -fomit-frame-pointer -fwrapv -Qunused-arguments -fPIC -fPIE T:thomaz/asm-PS-v2-FP
clang -mcpu=native -O3 -fomit-frame-pointer -fwrapv -Qunused-arguments -fPIC -fPIE T:thomaz/asm-PS-v2-FP

Compiler output

Implementation: T:thomaz/asm-PS
Security model: timingleaks
Compiler: gcc -march=native -mtune=native -O2 -fomit-frame-pointer -fwrapv -fPIC -fPIE
hash.c: hash.c: In function 'crypto_hash_luffa256_thomaz_asm_PS_timingleaks':
hash.c: hash.c:32:19: warning: passing argument 1 of 'fLuffa256' discards 'const' qualifier from pointer target type [-Wdiscarded-qualifiers]
hash.c: 32 | fLuffa256(in, out, inlen);
hash.c: | ^~
hash.c: hash.c:29:31: note: expected 'unsigned char *' but argument is of type 'const unsigned char *'
hash.c: 29 | void fLuffa256(unsigned char *input, unsigned char *output, int len);
hash.c: | ~~~~~~~~~~~~~~~^~~~~
try.c: /usr/bin/ld: libcrypto_hash_luffa256.a(luffa_256.o): relocation R_X86_64_32S against `.rodata' can not be used when making a PIE object; recompile with -fPIE
try.c: /usr/bin/ld: failed to set dynamic section sizes: bad value
try.c: collect2: error: ld returned 1 exit status

Number of similar (compiler,implementation) pairs: 4, namely:
CompilerImplementations
gcc -march=native -mtune=native -O2 -fomit-frame-pointer -fwrapv -fPIC -fPIE T:thomaz/asm-PS
gcc -march=native -mtune=native -O3 -fomit-frame-pointer -fwrapv -fPIC -fPIE T:thomaz/asm-PS
gcc -march=native -mtune=native -O -fomit-frame-pointer -fwrapv -fPIC -fPIE T:thomaz/asm-PS
gcc -march=native -mtune=native -Os -fomit-frame-pointer -fwrapv -fPIC -fPIE T:thomaz/asm-PS

Compiler output

Implementation: T:thomaz/asm-PS-v2-FP
Security model: timingleaks
Compiler: gcc -march=native -mtune=native -O2 -fomit-frame-pointer -fwrapv -fPIC -fPIE
hash.c: hash.c: In function 'crypto_hash_luffa256_thomaz_asm_PS_v2_FP_timingleaks':
hash.c: hash.c:32:19: warning: passing argument 1 of 'fLuffa256' discards 'const' qualifier from pointer target type [-Wdiscarded-qualifiers]
hash.c: 32 | fLuffa256(in, out, inlen);
hash.c: | ^~
hash.c: hash.c:29:31: note: expected 'unsigned char *' but argument is of type 'const unsigned char *'
hash.c: 29 | void fLuffa256(unsigned char *input, unsigned char *output, int len);
hash.c: | ~~~~~~~~~~~~~~~^~~~~
try.c: /usr/bin/ld: libcrypto_hash_luffa256.a(luffa_256.o): relocation R_X86_64_32S against `.rodata' can not be used when making a PIE object; recompile with -fPIE
try.c: /usr/bin/ld: failed to set dynamic section sizes: bad value
try.c: collect2: error: ld returned 1 exit status

Number of similar (compiler,implementation) pairs: 4, namely:
CompilerImplementations
gcc -march=native -mtune=native -O2 -fomit-frame-pointer -fwrapv -fPIC -fPIE T:thomaz/asm-PS-v2-FP
gcc -march=native -mtune=native -O3 -fomit-frame-pointer -fwrapv -fPIC -fPIE T:thomaz/asm-PS-v2-FP
gcc -march=native -mtune=native -O -fomit-frame-pointer -fwrapv -fPIC -fPIE T:thomaz/asm-PS-v2-FP
gcc -march=native -mtune=native -Os -fomit-frame-pointer -fwrapv -fPIC -fPIE T:thomaz/asm-PS-v2-FP

Compiler output

Implementation: T:thomaz/asm-PS-v2-INT
Security model: timingleaks
Compiler: clang -march=native -O2 -fomit-frame-pointer -fwrapv -Qunused-arguments -fPIC -fPIE
hash.c: hash.c:32:12: warning: passing 'const unsigned char *' to parameter of type 'unsigned char *' discards qualifiers [-Wincompatible-pointer-types-discards-qualifiers]
hash.c: fLuffa256(in, out, inlen);
hash.c: ^~
hash.c: hash.c:29:31: note: passing argument to parameter 'input' here
hash.c: void fLuffa256(unsigned char *input, unsigned char *output, int len);
hash.c: ^
hash.c: 1 warning generated.
luffa_256.s: <instantiation>:1:8: error: unknown token in expression
luffa_256.s: pshufb %xmm6, %xmm12
luffa_256.s: ^
luffa_256.s: <instantiation>:1:1: note: while in macro instantiation
luffa_256.s: mPSSTEPI %xmm6, %xmm7, %xmm12
luffa_256.s: ^
luffa_256.s: luffa_256.s:232:2: note: while in macro instantiation
luffa_256.s: mPS %xmm6, %xmm7, %xmm8, %xmm9, %xmm10, %xmm11
luffa_256.s: ^
luffa_256.s: <instantiation>:2:9: error: unknown token in expression
luffa_256.s: pshufb %xmm7, %xmm12
luffa_256.s: ^
luffa_256.s: <instantiation>:1:1: note: while in macro instantiation
luffa_256.s: mPSSTEPI %xmm6, %xmm7, %xmm12
luffa_256.s: ^
luffa_256.s: luffa_256.s:232:2: note: while in macro instantiation
luffa_256.s: mPS %xmm6, %xmm7, %xmm8, %xmm9, %xmm10, %xmm11
luffa_256.s: ^
luffa_256.s: <instantiation>:1:8: error: unknown token in expression
luffa_256.s: movdqa %xmm8, %xmm6
luffa_256.s: ^
luffa_256.s: <instantiation>:2:2: note: while in macro instantiation
luffa_256.s: mPSSTEPII %xmm6, %xmm7, %xmm8, %xmm9, %xmm10, %xmm11
luffa_256.s: ^
luffa_256.s: luffa_256.s:232:2: note: while in macro instantiation
luffa_256.s: ...

Number of similar (compiler,implementation) pairs: 5, namely:
CompilerImplementations
clang -march=native -O2 -fomit-frame-pointer -fwrapv -Qunused-arguments -fPIC -fPIE T:thomaz/asm-PS-v2-INT
clang -march=native -O3 -fomit-frame-pointer -fwrapv -Qunused-arguments -fPIC -fPIE T:thomaz/asm-PS-v2-INT
clang -march=native -O -fomit-frame-pointer -fwrapv -Qunused-arguments -fPIC -fPIE T:thomaz/asm-PS-v2-INT
clang -march=native -Os -fomit-frame-pointer -fwrapv -Qunused-arguments -fPIC -fPIE T:thomaz/asm-PS-v2-INT
clang -mcpu=native -O3 -fomit-frame-pointer -fwrapv -Qunused-arguments -fPIC -fPIE T:thomaz/asm-PS-v2-INT

Compiler output

Implementation: T:thomaz/asm-PS-v2-INT
Security model: timingleaks
Compiler: gcc -march=native -mtune=native -O2 -fomit-frame-pointer -fwrapv -fPIC -fPIE
hash.c: hash.c: In function 'crypto_hash_luffa256_thomaz_asm_PS_v2_INT_timingleaks':
hash.c: hash.c:32:19: warning: passing argument 1 of 'fLuffa256' discards 'const' qualifier from pointer target type [-Wdiscarded-qualifiers]
hash.c: 32 | fLuffa256(in, out, inlen);
hash.c: | ^~
hash.c: hash.c:29:31: note: expected 'unsigned char *' but argument is of type 'const unsigned char *'
hash.c: 29 | void fLuffa256(unsigned char *input, unsigned char *output, int len);
hash.c: | ~~~~~~~~~~~~~~~^~~~~
try.c: /usr/bin/ld: libcrypto_hash_luffa256.a(luffa_256.o): relocation R_X86_64_32S against `.rodata' can not be used when making a PIE object; recompile with -fPIE
try.c: /usr/bin/ld: failed to set dynamic section sizes: bad value
try.c: collect2: error: ld returned 1 exit status

Number of similar (compiler,implementation) pairs: 4, namely:
CompilerImplementations
gcc -march=native -mtune=native -O2 -fomit-frame-pointer -fwrapv -fPIC -fPIE T:thomaz/asm-PS-v2-INT
gcc -march=native -mtune=native -O3 -fomit-frame-pointer -fwrapv -fPIC -fPIE T:thomaz/asm-PS-v2-INT
gcc -march=native -mtune=native -O -fomit-frame-pointer -fwrapv -fPIC -fPIE T:thomaz/asm-PS-v2-INT
gcc -march=native -mtune=native -Os -fomit-frame-pointer -fwrapv -fPIC -fPIE T:thomaz/asm-PS-v2-INT

Compiler output

Implementation: T:thomaz/asm-PSPar-v2-FP
Security model: timingleaks
Compiler: clang -march=native -O2 -fomit-frame-pointer -fwrapv -Qunused-arguments -fPIC -fPIE
hash.c: hash.c:32:12: warning: passing 'const unsigned char *' to parameter of type 'unsigned char *' discards qualifiers [-Wincompatible-pointer-types-discards-qualifiers]
hash.c: fLuffa256(in, out, inlen);
hash.c: ^~
hash.c: hash.c:29:31: note: passing argument to parameter 'input' here
hash.c: void fLuffa256(unsigned char *input, unsigned char *output, int len);
hash.c: ^
hash.c: 1 warning generated.
luffa256.s: <instantiation>:1:8: error: unknown token in expression
luffa256.s: pshufb %xmm6, maskShufLittleEndian
luffa256.s: ^
luffa256.s: <instantiation>:1:1: note: while in macro instantiation
luffa256.s: mPSSTEPI %xmm6, %xmm7, maskShufLittleEndian
luffa256.s: ^
luffa256.s: luffa256.s:445:2: note: while in macro instantiation
luffa256.s: mPS %xmm6, %xmm7, %xmm8, %xmm9, %xmm10, %xmm11
luffa256.s: ^
luffa256.s: <instantiation>:2:9: error: unknown token in expression
luffa256.s: pshufb %xmm7, maskShufLittleEndian
luffa256.s: ^
luffa256.s: <instantiation>:1:1: note: while in macro instantiation
luffa256.s: mPSSTEPI %xmm6, %xmm7, maskShufLittleEndian
luffa256.s: ^
luffa256.s: luffa256.s:445:2: note: while in macro instantiation
luffa256.s: mPS %xmm6, %xmm7, %xmm8, %xmm9, %xmm10, %xmm11
luffa256.s: ^
luffa256.s: <instantiation>:1:8: error: unknown token in expression
luffa256.s: movaps %xmm8, %xmm6
luffa256.s: ^
luffa256.s: <instantiation>:2:2: note: while in macro instantiation
luffa256.s: mPSSTEPII %xmm6, %xmm7, %xmm8, %xmm9, %xmm10, %xmm11
luffa256.s: ^
luffa256.s: luffa256.s:445:2: note: while in macro instantiation
luffa256.s: ...

Number of similar (compiler,implementation) pairs: 5, namely:
CompilerImplementations
clang -march=native -O2 -fomit-frame-pointer -fwrapv -Qunused-arguments -fPIC -fPIE T:thomaz/asm-PSPar-v2-FP
clang -march=native -O3 -fomit-frame-pointer -fwrapv -Qunused-arguments -fPIC -fPIE T:thomaz/asm-PSPar-v2-FP
clang -march=native -O -fomit-frame-pointer -fwrapv -Qunused-arguments -fPIC -fPIE T:thomaz/asm-PSPar-v2-FP
clang -march=native -Os -fomit-frame-pointer -fwrapv -Qunused-arguments -fPIC -fPIE T:thomaz/asm-PSPar-v2-FP
clang -mcpu=native -O3 -fomit-frame-pointer -fwrapv -Qunused-arguments -fPIC -fPIE T:thomaz/asm-PSPar-v2-FP

Compiler output

Implementation: T:thomaz/asm-PSPar-v2-FP
Security model: timingleaks
Compiler: gcc -march=native -mtune=native -O2 -fomit-frame-pointer -fwrapv -fPIC -fPIE
hash.c: hash.c: In function 'crypto_hash_luffa256_thomaz_asm_PSPar_v2_FP_timingleaks':
hash.c: hash.c:32:19: warning: passing argument 1 of 'fLuffa256' discards 'const' qualifier from pointer target type [-Wdiscarded-qualifiers]
hash.c: 32 | fLuffa256(in, out, inlen);
hash.c: | ^~
hash.c: hash.c:29:31: note: expected 'unsigned char *' but argument is of type 'const unsigned char *'
hash.c: 29 | void fLuffa256(unsigned char *input, unsigned char *output, int len);
hash.c: | ~~~~~~~~~~~~~~~^~~~~
try.c: /usr/bin/ld: libcrypto_hash_luffa256.a(luffa256.o): relocation R_X86_64_32S against `.rodata' can not be used when making a PIE object; recompile with -fPIE
try.c: /usr/bin/ld: failed to set dynamic section sizes: bad value
try.c: collect2: error: ld returned 1 exit status

Number of similar (compiler,implementation) pairs: 4, namely:
CompilerImplementations
gcc -march=native -mtune=native -O2 -fomit-frame-pointer -fwrapv -fPIC -fPIE T:thomaz/asm-PSPar-v2-FP
gcc -march=native -mtune=native -O3 -fomit-frame-pointer -fwrapv -fPIC -fPIE T:thomaz/asm-PSPar-v2-FP
gcc -march=native -mtune=native -O -fomit-frame-pointer -fwrapv -fPIC -fPIE T:thomaz/asm-PSPar-v2-FP
gcc -march=native -mtune=native -Os -fomit-frame-pointer -fwrapv -fPIC -fPIE T:thomaz/asm-PSPar-v2-FP

Compiler output

Implementation: T:thomaz/asm-PSPar-v2-INT
Security model: timingleaks
Compiler: clang -march=native -O2 -fomit-frame-pointer -fwrapv -Qunused-arguments -fPIC -fPIE
hash.c: hash.c:32:12: warning: passing 'const unsigned char *' to parameter of type 'unsigned char *' discards qualifiers [-Wincompatible-pointer-types-discards-qualifiers]
hash.c: fLuffa256(in, out, inlen);
hash.c: ^~
hash.c: hash.c:29:31: note: passing argument to parameter 'input' here
hash.c: void fLuffa256(unsigned char *input, unsigned char *output, int len);
hash.c: ^
hash.c: 1 warning generated.
luffa256.s: <instantiation>:1:8: error: unknown token in expression
luffa256.s: pshufb %xmm6, maskShufLittleEndian
luffa256.s: ^
luffa256.s: <instantiation>:1:1: note: while in macro instantiation
luffa256.s: mPSSTEPI %xmm6, %xmm7, maskShufLittleEndian
luffa256.s: ^
luffa256.s: luffa256.s:445:2: note: while in macro instantiation
luffa256.s: mPS %xmm6, %xmm7, %xmm8, %xmm9, %xmm10, %xmm11
luffa256.s: ^
luffa256.s: <instantiation>:2:9: error: unknown token in expression
luffa256.s: pshufb %xmm7, maskShufLittleEndian
luffa256.s: ^
luffa256.s: <instantiation>:1:1: note: while in macro instantiation
luffa256.s: mPSSTEPI %xmm6, %xmm7, maskShufLittleEndian
luffa256.s: ^
luffa256.s: luffa256.s:445:2: note: while in macro instantiation
luffa256.s: mPS %xmm6, %xmm7, %xmm8, %xmm9, %xmm10, %xmm11
luffa256.s: ^
luffa256.s: <instantiation>:1:8: error: unknown token in expression
luffa256.s: movdqa %xmm8, %xmm6
luffa256.s: ^
luffa256.s: <instantiation>:2:2: note: while in macro instantiation
luffa256.s: mPSSTEPII %xmm6, %xmm7, %xmm8, %xmm9, %xmm10, %xmm11
luffa256.s: ^
luffa256.s: luffa256.s:445:2: note: while in macro instantiation
luffa256.s: ...

Number of similar (compiler,implementation) pairs: 5, namely:
CompilerImplementations
clang -march=native -O2 -fomit-frame-pointer -fwrapv -Qunused-arguments -fPIC -fPIE T:thomaz/asm-PSPar-v2-INT
clang -march=native -O3 -fomit-frame-pointer -fwrapv -Qunused-arguments -fPIC -fPIE T:thomaz/asm-PSPar-v2-INT
clang -march=native -O -fomit-frame-pointer -fwrapv -Qunused-arguments -fPIC -fPIE T:thomaz/asm-PSPar-v2-INT
clang -march=native -Os -fomit-frame-pointer -fwrapv -Qunused-arguments -fPIC -fPIE T:thomaz/asm-PSPar-v2-INT
clang -mcpu=native -O3 -fomit-frame-pointer -fwrapv -Qunused-arguments -fPIC -fPIE T:thomaz/asm-PSPar-v2-INT

Compiler output

Implementation: T:thomaz/asm-PSPar-v2-INT
Security model: timingleaks
Compiler: gcc -march=native -mtune=native -O2 -fomit-frame-pointer -fwrapv -fPIC -fPIE
hash.c: hash.c: In function 'crypto_hash_luffa256_thomaz_asm_PSPar_v2_INT_timingleaks':
hash.c: hash.c:32:19: warning: passing argument 1 of 'fLuffa256' discards 'const' qualifier from pointer target type [-Wdiscarded-qualifiers]
hash.c: 32 | fLuffa256(in, out, inlen);
hash.c: | ^~
hash.c: hash.c:29:31: note: expected 'unsigned char *' but argument is of type 'const unsigned char *'
hash.c: 29 | void fLuffa256(unsigned char *input, unsigned char *output, int len);
hash.c: | ~~~~~~~~~~~~~~~^~~~~
try.c: /usr/bin/ld: libcrypto_hash_luffa256.a(luffa256.o): relocation R_X86_64_32S against `.rodata' can not be used when making a PIE object; recompile with -fPIE
try.c: /usr/bin/ld: failed to set dynamic section sizes: bad value
try.c: collect2: error: ld returned 1 exit status

Number of similar (compiler,implementation) pairs: 4, namely:
CompilerImplementations
gcc -march=native -mtune=native -O2 -fomit-frame-pointer -fwrapv -fPIC -fPIE T:thomaz/asm-PSPar-v2-INT
gcc -march=native -mtune=native -O3 -fomit-frame-pointer -fwrapv -fPIC -fPIE T:thomaz/asm-PSPar-v2-INT
gcc -march=native -mtune=native -O -fomit-frame-pointer -fwrapv -fPIC -fPIE T:thomaz/asm-PSPar-v2-INT
gcc -march=native -mtune=native -Os -fomit-frame-pointer -fwrapv -fPIC -fPIE T:thomaz/asm-PSPar-v2-INT