Implementation notes: amd64, h8bobcat, crypto_aead/paeq128

Computer: h8bobcat
Architecture: amd64
CPU ID: AuthenticAMD-00500f20-178bfbff
SUPERCOP version: 20171218
Operation: crypto_aead
Primitive: paeq128
TimeObject sizeTest sizeImplementationCompilerBenchmark dateSUPERCOP version
6337996? ? ?? ? ?refclang++_-O3_-fwrapv_-march=native_-fomit-frame-pointer_-Qunused-arguments2017081420170718
6350845? ? ?? ? ?refclang++_-mcpu=native_-mfpu=neon_-O3_-fomit-frame-pointer_-fwrapv_-Qunused-arguments2017081420170718
6353434? ? ?? ? ?refclang++_-O3_-fomit-frame-pointer_-Qunused-arguments2017081420170718
6353880? ? ?? ? ?refclang++_-mcpu=cortex-a9_-mfpu=neon_-O3_-fomit-frame-pointer_-fwrapv_-Qunused-arguments2017081420170718
6435513? ? ?? ? ?refclang++_-march=native_-O3_-fomit-frame-pointer_-fwrapv_-Qunused-arguments2017081420170718
6561821? ? ?? ? ?refclang++_-mcpu=cortex-a8_-mfpu=neon_-O3_-fomit-frame-pointer_-fwrapv_-Qunused-arguments2017081420170718
7769551? ? ?? ? ?refg++_-funroll-loops_-fno-schedule-insns_-O2_-fomit-frame-pointer2017081420170718
7846630? ? ?? ? ?refg++_-funroll-loops_-fno-schedule-insns_-O3_-fomit-frame-pointer2017081420170718
7874166? ? ?? ? ?refg++_-march=k8_-O3_-fomit-frame-pointer2017081420170718
7883913? ? ?? ? ?refg++_-m64_-march=nocona_-O3_-fomit-frame-pointer2017081420170718
7889750? ? ?? ? ?refg++_-march=nocona_-O3_-fomit-frame-pointer2017081420170718
7890956? ? ?? ? ?refg++_-march=barcelona_-O3_-fomit-frame-pointer2017081420170718
7891104? ? ?? ? ?refg++_-march=native_-mtune=native_-O3_-fomit-frame-pointer_-fwrapv2017081420170718
7891940? ? ?? ? ?refg++_-m64_-march=k8_-O3_-fomit-frame-pointer2017081420170718
7898300? ? ?? ? ?refg++_-m64_-march=native_-mtune=native_-O3_-fomit-frame-pointer2017081420170718
7904461? ? ?? ? ?refg++_-m64_-march=barcelona_-O3_-fomit-frame-pointer2017081420170718
7911044? ? ?? ? ?refg++_-m64_-march=core2_-O3_-fomit-frame-pointer2017081420170718
7953818? ? ?? ? ?refg++_-fno-schedule-insns_-O3_-fomit-frame-pointer2017081420170718
7960986? ? ?? ? ?refg++_-O3_-fomit-frame-pointer2017081420170718
8011378? ? ?? ? ?refg++_-m64_-O3_-fomit-frame-pointer2017081420170718
12133272? ? ?? ? ?refg++_-funroll-loops_-fno-schedule-insns_-O_-fomit-frame-pointer2017081420170718
16745940? ? ?? ? ?refg++_-march=k8_-O2_-fomit-frame-pointer2017081420170718
16749887? ? ?? ? ?refg++_-march=barcelona_-O2_-fomit-frame-pointer2017081420170718
16771775? ? ?? ? ?refg++_-march=native_-mtune=native_-O2_-fomit-frame-pointer_-fwrapv2017081420170718
16778135? ? ?? ? ?refg++_-m64_-march=native_-mtune=native_-O2_-fomit-frame-pointer2017081420170718
16872969? ? ?? ? ?refg++_-m64_-march=k8_-O2_-fomit-frame-pointer2017081420170718
16884612? ? ?? ? ?refg++_-m64_-march=barcelona_-O2_-fomit-frame-pointer2017081420170718
16889508? ? ?? ? ?refg++_-march=nocona_-Os_-fomit-frame-pointer2017081420170718
16985079? ? ?? ? ?refg++_-m64_-march=core2_-msse4_-O2_-fomit-frame-pointer2017081420170718
16985273? ? ?? ? ?refg++_-m64_-march=core2_-O2_-fomit-frame-pointer2017081420170718
16992113? ? ?? ? ?refg++_-fno-schedule-insns_-O2_-fomit-frame-pointer2017081420170718
17004340? ? ?? ? ?refg++_-m64_-march=corei7_-O2_-fomit-frame-pointer2017081420170718
17009536? ? ?? ? ?refg++_-O2_-fomit-frame-pointer2017081420170718
17034203? ? ?? ? ?refg++_-m64_-march=core2_-msse4.1_-O2_-fomit-frame-pointer2017081420170718
17034649? ? ?? ? ?refg++_-m64_-march=nocona_-Os_-fomit-frame-pointer2017081420170718
17034920? ? ?? ? ?refg++_-m64_-O2_-fomit-frame-pointer2017081420170718
17308302? ? ?? ? ?refg++_-march=nocona_-O2_-fomit-frame-pointer2017081420170718
17310957? ? ?? ? ?refg++_-m64_-march=nocona_-O2_-fomit-frame-pointer2017081420170718
17493058? ? ?? ? ?refg++_-m64_-march=barcelona_-Os_-fomit-frame-pointer2017081420170718
17528754? ? ?? ? ?refg++_-funroll-loops_-fno-schedule-insns_-Os_-fomit-frame-pointer2017081420170718
17710328? ? ?? ? ?refg++_-march=barcelona_-Os_-fomit-frame-pointer2017081420170718
17719842? ? ?? ? ?refg++_-march=k8_-Os_-fomit-frame-pointer2017081420170718
17723224? ? ?? ? ?refg++_-fno-schedule-insns_-Os_-fomit-frame-pointer2017081420170718
17723922? ? ?? ? ?refg++_-Os_-fomit-frame-pointer2017081420170718
17725404? ? ?? ? ?refg++_-m64_-Os_-fomit-frame-pointer2017081420170718
17727460? ? ?? ? ?refg++_-m64_-march=native_-mtune=native_-Os_-fomit-frame-pointer2017081420170718
17728529? ? ?? ? ?refg++_-m64_-march=core2_-Os_-fomit-frame-pointer2017081420170718
17728553? ? ?? ? ?refg++_-m64_-march=corei7_-Os_-fomit-frame-pointer2017081420170718
17732495? ? ?? ? ?refg++_-m64_-march=k8_-Os_-fomit-frame-pointer2017081420170718
17733132? ? ?? ? ?refg++_-march=native_-mtune=native_-Os_-fomit-frame-pointer_-fwrapv2017081420170718
17735816? ? ?? ? ?refg++_-m64_-march=core2_-msse4.1_-Os_-fomit-frame-pointer2017081420170718
17826489? ? ?? ? ?refg++_-m64_-march=core2_-msse4_-Os_-fomit-frame-pointer2017081420170718
18312608? ? ?? ? ?refg++_-m64_-march=nocona_-O_-fomit-frame-pointer2017081420170718
18341883? ? ?? ? ?refg++_-m64_-march=core2_-O_-fomit-frame-pointer2017081420170718
18344210? ? ?? ? ?refg++_-m64_-march=corei7_-O_-fomit-frame-pointer2017081420170718
18353701? ? ?? ? ?refg++_-march=nocona_-O_-fomit-frame-pointer2017081420170718
18367077? ? ?? ? ?refg++_-m64_-march=core2_-msse4.1_-O_-fomit-frame-pointer2017081420170718
18406792? ? ?? ? ?refg++_-m64_-march=core2_-msse4_-O_-fomit-frame-pointer2017081420170718
18425938? ? ?? ? ?refg++_-march=k8_-O_-fomit-frame-pointer2017081420170718
18432280? ? ?? ? ?refg++_-m64_-march=k8_-O_-fomit-frame-pointer2017081420170718
18561579? ? ?? ? ?refg++_-O_-fomit-frame-pointer2017081420170718
18566724? ? ?? ? ?refg++_-m64_-O_-fomit-frame-pointer2017081420170718
18643470? ? ?? ? ?refg++_-fno-schedule-insns_-O_-fomit-frame-pointer2017081420170718
18757222? ? ?? ? ?refg++_-m64_-march=barcelona_-O_-fomit-frame-pointer2017081420170718
18767094? ? ?? ? ?refg++_-march=barcelona_-O_-fomit-frame-pointer2017081420170718
18767896? ? ?? ? ?refg++_-march=native_-mtune=native_-O_-fomit-frame-pointer_-fwrapv2017081420170718
18872686? ? ?? ? ?refg++_-m64_-march=native_-mtune=native_-O_-fomit-frame-pointer2017081420170718
68686725? ? ?? ? ?refg++2017081420170718

Compiler output

Implementation: crypto_aead/paeq128/opt-win-aes
Compiler: clang++ -O3 -fomit-frame-pointer -Qunused-arguments
encrypt.cpp: In file included from encrypt.cpp:8:
encrypt.cpp: In file included from /usr/bin/../lib/gcc/x86_64-linux-gnu/5.4.0/../../../../include/c++/5.4.0/cstdint:35:
encrypt.cpp: /usr/bin/../lib/gcc/x86_64-linux-gnu/5.4.0/../../../../include/c++/5.4.0/bits/c++0x_warning.h:32:2: error: This file requires compiler and library support for the ISO C++ 2011 standard. This support must be enabled with the -std=c++11 or -std=gnu++11 compiler options.
encrypt.cpp: #error This file requires compiler and library support \
encrypt.cpp: ^
encrypt.cpp: encrypt.cpp:13:10: fatal error: 'intrin.h' file not found
encrypt.cpp: #include <intrin.h>
encrypt.cpp: ^
encrypt.cpp: 2 errors generated.

Number of similar (compiler,implementation) pairs: 6, namely:
CompilerImplementations
clang++ -O3 -fomit-frame-pointer -Qunused-arguments opt-win-aes
clang++ -O3 -fwrapv -march=native -fomit-frame-pointer -Qunused-arguments opt-win-aes
clang++ -march=native -O3 -fomit-frame-pointer -fwrapv -Qunused-arguments opt-win-aes
clang++ -mcpu=cortex-a8 -mfpu=neon -O3 -fomit-frame-pointer -fwrapv -Qunused-arguments opt-win-aes
clang++ -mcpu=cortex-a9 -mfpu=neon -O3 -fomit-frame-pointer -fwrapv -Qunused-arguments opt-win-aes
clang++ -mcpu=native -mfpu=neon -O3 -fomit-frame-pointer -fwrapv -Qunused-arguments opt-win-aes

Compiler output

Implementation: crypto_aead/paeq128/aesni
Compiler: clang++ -O3 -fomit-frame-pointer -Qunused-arguments
encrypt.cpp: encrypt.cpp:167:11: error: always_inline function '_mm_aesenc_si128' requires target feature 'aes', but would be inlined into function 'DoubleFPermAsm' that is compiled without support for 'aes'
encrypt.cpp: acc0 = _mm_aesenc_si128(acc0, roundkey0);
encrypt.cpp: ^
encrypt.cpp: encrypt.cpp:168:11: error: always_inline function '_mm_aesenc_si128' requires target feature 'aes', but would be inlined into function 'DoubleFPermAsm' that is compiled without support for 'aes'
encrypt.cpp: acc1 = _mm_aesenc_si128(acc1, roundkey1);
encrypt.cpp: ^
encrypt.cpp: encrypt.cpp:169:11: error: always_inline function '_mm_aesenc_si128' requires target feature 'aes', but would be inlined into function 'DoubleFPermAsm' that is compiled without support for 'aes'
encrypt.cpp: acc2 = _mm_aesenc_si128(acc2, roundkey2);
encrypt.cpp: ^
encrypt.cpp: encrypt.cpp:170:11: error: always_inline function '_mm_aesenc_si128' requires target feature 'aes', but would be inlined into function 'DoubleFPermAsm' that is compiled without support for 'aes'
encrypt.cpp: acc3 = _mm_aesenc_si128(acc3, roundkey3);
encrypt.cpp: ^
encrypt.cpp: encrypt.cpp:172:11: error: always_inline function '_mm_aesenc_si128' requires target feature 'aes', but would be inlined into function 'DoubleFPermAsm' that is compiled without support for 'aes'
encrypt.cpp: acc4 = _mm_aesenc_si128(acc4, roundkey0);
encrypt.cpp: ^
encrypt.cpp: encrypt.cpp:173:11: error: always_inline function '_mm_aesenc_si128' requires target feature 'aes', but would be inlined into function 'DoubleFPermAsm' that is compiled without support for 'aes'
encrypt.cpp: acc5 = _mm_aesenc_si128(acc5, roundkey1);
encrypt.cpp: ^
encrypt.cpp: encrypt.cpp:174:11: error: always_inline function '_mm_aesenc_si128' requires target feature 'aes', but would be inlined into function 'DoubleFPermAsm' that is compiled without support for 'aes'
encrypt.cpp: acc6 = _mm_aesenc_si128(acc6, roundkey2);
encrypt.cpp: ^
encrypt.cpp: encrypt.cpp:175:11: error: always_inline function '_mm_aesenc_si128' requires target feature 'aes', but would be inlined into function 'DoubleFPermAsm' that is compiled without support for 'aes'
encrypt.cpp: acc7 = _mm_aesenc_si128(acc7, roundkey3);
encrypt.cpp: ^
encrypt.cpp: 8 errors generated.

Number of similar (compiler,implementation) pairs: 6, namely:
CompilerImplementations
clang++ -O3 -fomit-frame-pointer -Qunused-arguments aesni
clang++ -O3 -fwrapv -march=native -fomit-frame-pointer -Qunused-arguments aesni
clang++ -march=native -O3 -fomit-frame-pointer -fwrapv -Qunused-arguments aesni
clang++ -mcpu=cortex-a8 -mfpu=neon -O3 -fomit-frame-pointer -fwrapv -Qunused-arguments aesni
clang++ -mcpu=cortex-a9 -mfpu=neon -O3 -fomit-frame-pointer -fwrapv -Qunused-arguments aesni
clang++ -mcpu=native -mfpu=neon -O3 -fomit-frame-pointer -fwrapv -Qunused-arguments aesni

Compiler output

Implementation: crypto_aead/paeq128/opt-win-aes
Compiler: g++
encrypt.cpp: In file included from /usr/include/c++/5/cstdint:35:0,
encrypt.cpp: from encrypt.cpp:8:
encrypt.cpp: /usr/include/c++/5/bits/c++0x_warning.h:32:2: error: #error This file requires compiler and library support for the ISO C++ 2011 standard. This support must be enabled with the -std=c++11 or -std=gnu++11 compiler options.
encrypt.cpp: #error This file requires compiler and library support \
encrypt.cpp: ^
encrypt.cpp: encrypt.cpp:13:20: fatal error: intrin.h: No such file or directory
encrypt.cpp: #include <intrin.h>
encrypt.cpp: ^
encrypt.cpp: compilation terminated.

Number of similar (compiler,implementation) pairs: 58, namely:
CompilerImplementations
g++ opt-win-aes
g++ -O2 -fomit-frame-pointer opt-win-aes
g++ -O3 -fomit-frame-pointer opt-win-aes
g++ -O -fomit-frame-pointer opt-win-aes
g++ -Os -fomit-frame-pointer opt-win-aes
g++ -fno-schedule-insns -O2 -fomit-frame-pointer opt-win-aes
g++ -fno-schedule-insns -O3 -fomit-frame-pointer opt-win-aes
g++ -fno-schedule-insns -O -fomit-frame-pointer opt-win-aes
g++ -fno-schedule-insns -Os -fomit-frame-pointer opt-win-aes
g++ -funroll-loops -fno-schedule-insns -O2 -fomit-frame-pointer opt-win-aes
g++ -funroll-loops -fno-schedule-insns -O3 -fomit-frame-pointer opt-win-aes
g++ -funroll-loops -fno-schedule-insns -O -fomit-frame-pointer opt-win-aes
g++ -funroll-loops -fno-schedule-insns -Os -fomit-frame-pointer opt-win-aes
g++ -m64 -O2 -fomit-frame-pointer opt-win-aes
g++ -m64 -O3 -fomit-frame-pointer opt-win-aes
g++ -m64 -O -fomit-frame-pointer opt-win-aes
g++ -m64 -Os -fomit-frame-pointer opt-win-aes
g++ -m64 -march=core2 -O2 -fomit-frame-pointer opt-win-aes
g++ -m64 -march=core2 -O3 -fomit-frame-pointer opt-win-aes
g++ -m64 -march=core2 -O -fomit-frame-pointer opt-win-aes
g++ -m64 -march=core2 -Os -fomit-frame-pointer opt-win-aes
g++ -m64 -march=core2 -msse4.1 -O2 -fomit-frame-pointer opt-win-aes
g++ -m64 -march=core2 -msse4.1 -O -fomit-frame-pointer opt-win-aes
g++ -m64 -march=core2 -msse4.1 -Os -fomit-frame-pointer opt-win-aes
g++ -m64 -march=core2 -msse4 -O2 -fomit-frame-pointer opt-win-aes
g++ -m64 -march=core2 -msse4 -O -fomit-frame-pointer opt-win-aes
g++ -m64 -march=core2 -msse4 -Os -fomit-frame-pointer opt-win-aes
g++ -m64 -march=corei7 -O2 -fomit-frame-pointer opt-win-aes
g++ -m64 -march=corei7 -O -fomit-frame-pointer opt-win-aes
g++ -m64 -march=corei7 -Os -fomit-frame-pointer opt-win-aes
g++ -m64 -march=k8 -O2 -fomit-frame-pointer opt-win-aes
g++ -m64 -march=k8 -O3 -fomit-frame-pointer opt-win-aes
g++ -m64 -march=k8 -O -fomit-frame-pointer opt-win-aes
g++ -m64 -march=k8 -Os -fomit-frame-pointer opt-win-aes
g++ -m64 -march=native -mtune=native -O2 -fomit-frame-pointer opt-win-aes
g++ -m64 -march=native -mtune=native -O3 -fomit-frame-pointer opt-win-aes
g++ -m64 -march=native -mtune=native -O -fomit-frame-pointer opt-win-aes
g++ -m64 -march=native -mtune=native -Os -fomit-frame-pointer opt-win-aes
g++ -m64 -march=nocona -O2 -fomit-frame-pointer opt-win-aes
g++ -m64 -march=nocona -O3 -fomit-frame-pointer opt-win-aes
g++ -m64 -march=nocona -O -fomit-frame-pointer opt-win-aes
g++ -m64 -march=nocona -Os -fomit-frame-pointer opt-win-aes
g++ -march=barcelona -O2 -fomit-frame-pointer opt-win-aes
g++ -march=barcelona -O3 -fomit-frame-pointer opt-win-aes
g++ -march=barcelona -O -fomit-frame-pointer opt-win-aes
g++ -march=barcelona -Os -fomit-frame-pointer opt-win-aes
g++ -march=k8 -O2 -fomit-frame-pointer opt-win-aes
g++ -march=k8 -O3 -fomit-frame-pointer opt-win-aes
g++ -march=k8 -O -fomit-frame-pointer opt-win-aes
g++ -march=k8 -Os -fomit-frame-pointer opt-win-aes
g++ -march=native -mtune=native -O2 -fomit-frame-pointer -fwrapv opt-win-aes
g++ -march=native -mtune=native -O3 -fomit-frame-pointer -fwrapv opt-win-aes
g++ -march=native -mtune=native -O -fomit-frame-pointer -fwrapv opt-win-aes
g++ -march=native -mtune=native -Os -fomit-frame-pointer -fwrapv opt-win-aes
g++ -march=nocona -O2 -fomit-frame-pointer opt-win-aes
g++ -march=nocona -O3 -fomit-frame-pointer opt-win-aes
g++ -march=nocona -O -fomit-frame-pointer opt-win-aes
g++ -march=nocona -Os -fomit-frame-pointer opt-win-aes

Compiler output

Implementation: crypto_aead/paeq128/aesni
Compiler: g++
encrypt.cpp: In file included from encrypt.cpp:13:0:
encrypt.cpp: /usr/lib/gcc/x86_64-linux-gnu/5/include/wmmintrin.h: In function 'void DoubleFPermAsm(const __m128i*, const __m128i*, __m128i*, __m128i*)':
encrypt.cpp: /usr/lib/gcc/x86_64-linux-gnu/5/include/wmmintrin.h:61:1: error: inlining failed in call to always_inline '__m128i _mm_aesenc_si128(__m128i, __m128i)': target specific option mismatch
encrypt.cpp: _mm_aesenc_si128 (__m128i __X, __m128i __Y)
encrypt.cpp: ^
encrypt.cpp: encrypt.cpp:175:44: error: called from here
encrypt.cpp: acc7 = _mm_aesenc_si128(acc7, roundkey3);
encrypt.cpp: ^
encrypt.cpp: In file included from encrypt.cpp:13:0:
encrypt.cpp: /usr/lib/gcc/x86_64-linux-gnu/5/include/wmmintrin.h:61:1: error: inlining failed in call to always_inline '__m128i _mm_aesenc_si128(__m128i, __m128i)': target specific option mismatch
encrypt.cpp: _mm_aesenc_si128 (__m128i __X, __m128i __Y)
encrypt.cpp: ^
encrypt.cpp: encrypt.cpp:174:44: error: called from here
encrypt.cpp: acc6 = _mm_aesenc_si128(acc6, roundkey2);
encrypt.cpp: ^
encrypt.cpp: In file included from encrypt.cpp:13:0:
encrypt.cpp: /usr/lib/gcc/x86_64-linux-gnu/5/include/wmmintrin.h:61:1: error: inlining failed in call to always_inline '__m128i _mm_aesenc_si128(__m128i, __m128i)': target specific option mismatch
encrypt.cpp: _mm_aesenc_si128 (__m128i __X, __m128i __Y)
encrypt.cpp: ^
encrypt.cpp: encrypt.cpp:173:44: error: called from here
encrypt.cpp: acc5 = _mm_aesenc_si128(acc5, roundkey1);
encrypt.cpp: ^
encrypt.cpp: In file included from encrypt.cpp:13:0:
encrypt.cpp: /usr/lib/gcc/x86_64-linux-gnu/5/include/wmmintrin.h:61:1: error: inlining failed in call to always_inline '__m128i _mm_aesenc_si128(__m128i, __m128i)': target specific option mismatch
encrypt.cpp: _mm_aesenc_si128 (__m128i __X, __m128i __Y)
encrypt.cpp: ...

Number of similar (compiler,implementation) pairs: 58, namely:
CompilerImplementations
g++ aesni
g++ -O2 -fomit-frame-pointer aesni
g++ -O3 -fomit-frame-pointer aesni
g++ -O -fomit-frame-pointer aesni
g++ -Os -fomit-frame-pointer aesni
g++ -fno-schedule-insns -O2 -fomit-frame-pointer aesni
g++ -fno-schedule-insns -O3 -fomit-frame-pointer aesni
g++ -fno-schedule-insns -O -fomit-frame-pointer aesni
g++ -fno-schedule-insns -Os -fomit-frame-pointer aesni
g++ -funroll-loops -fno-schedule-insns -O2 -fomit-frame-pointer aesni
g++ -funroll-loops -fno-schedule-insns -O3 -fomit-frame-pointer aesni
g++ -funroll-loops -fno-schedule-insns -O -fomit-frame-pointer aesni
g++ -funroll-loops -fno-schedule-insns -Os -fomit-frame-pointer aesni
g++ -m64 -O2 -fomit-frame-pointer aesni
g++ -m64 -O3 -fomit-frame-pointer aesni
g++ -m64 -O -fomit-frame-pointer aesni
g++ -m64 -Os -fomit-frame-pointer aesni
g++ -m64 -march=core2 -O2 -fomit-frame-pointer aesni
g++ -m64 -march=core2 -O3 -fomit-frame-pointer aesni
g++ -m64 -march=core2 -O -fomit-frame-pointer aesni
g++ -m64 -march=core2 -Os -fomit-frame-pointer aesni
g++ -m64 -march=core2 -msse4.1 -O2 -fomit-frame-pointer aesni
g++ -m64 -march=core2 -msse4.1 -O -fomit-frame-pointer aesni
g++ -m64 -march=core2 -msse4.1 -Os -fomit-frame-pointer aesni
g++ -m64 -march=core2 -msse4 -O2 -fomit-frame-pointer aesni
g++ -m64 -march=core2 -msse4 -O -fomit-frame-pointer aesni
g++ -m64 -march=core2 -msse4 -Os -fomit-frame-pointer aesni
g++ -m64 -march=corei7 -O2 -fomit-frame-pointer aesni
g++ -m64 -march=corei7 -O -fomit-frame-pointer aesni
g++ -m64 -march=corei7 -Os -fomit-frame-pointer aesni
g++ -m64 -march=k8 -O2 -fomit-frame-pointer aesni
g++ -m64 -march=k8 -O3 -fomit-frame-pointer aesni
g++ -m64 -march=k8 -O -fomit-frame-pointer aesni
g++ -m64 -march=k8 -Os -fomit-frame-pointer aesni
g++ -m64 -march=native -mtune=native -O2 -fomit-frame-pointer aesni
g++ -m64 -march=native -mtune=native -O3 -fomit-frame-pointer aesni
g++ -m64 -march=native -mtune=native -O -fomit-frame-pointer aesni
g++ -m64 -march=native -mtune=native -Os -fomit-frame-pointer aesni
g++ -m64 -march=nocona -O2 -fomit-frame-pointer aesni
g++ -m64 -march=nocona -O3 -fomit-frame-pointer aesni
g++ -m64 -march=nocona -O -fomit-frame-pointer aesni
g++ -m64 -march=nocona -Os -fomit-frame-pointer aesni
g++ -march=barcelona -O2 -fomit-frame-pointer aesni
g++ -march=barcelona -O3 -fomit-frame-pointer aesni
g++ -march=barcelona -O -fomit-frame-pointer aesni
g++ -march=barcelona -Os -fomit-frame-pointer aesni
g++ -march=k8 -O2 -fomit-frame-pointer aesni
g++ -march=k8 -O3 -fomit-frame-pointer aesni
g++ -march=k8 -O -fomit-frame-pointer aesni
g++ -march=k8 -Os -fomit-frame-pointer aesni
g++ -march=native -mtune=native -O2 -fomit-frame-pointer -fwrapv aesni
g++ -march=native -mtune=native -O3 -fomit-frame-pointer -fwrapv aesni
g++ -march=native -mtune=native -O -fomit-frame-pointer -fwrapv aesni
g++ -march=native -mtune=native -Os -fomit-frame-pointer -fwrapv aesni
g++ -march=nocona -O2 -fomit-frame-pointer aesni
g++ -march=nocona -O3 -fomit-frame-pointer aesni
g++ -march=nocona -O -fomit-frame-pointer aesni
g++ -march=nocona -Os -fomit-frame-pointer aesni

Compiler output

Implementation: crypto_aead/paeq128/opt-win-aes
Compiler: g++ -m64 -march=barcelona -O2 -fomit-frame-pointer
encrypt.cpp: In file included from /usr/include/c++/5/cstdint:35:0,
encrypt.cpp: from encrypt.cpp:8:
encrypt.cpp: /usr/include/c++/5/bits/c++0x_warning.h:32:2: error: #error This file requires compiler and library support for the ISO C++ 2011 standard. This support must be enabled with the -std=c++11 or -std=gnu++11 compiler options.
encrypt.cpp: #error This file requires compiler and library support \
encrypt.cpp: ^
encrypt.cpp: encrypt.cpp:13:20: fatal error: intrin.h: No such file or directory
encrypt.cpp: #include <intrin.h>
encrypt.cpp: ^
encrypt.cpp: compilation terminated.
encrypt.cpp: In file included from /usr/include/c++/5/cstdint:35:0,
encrypt.cpp: from encrypt.cpp:8:
encrypt.cpp: /usr/include/c++/5/bits/c++0x_warning.h:32:2: error: #error This file requires compiler and library support for the ISO C++ 2011 standard. This support must be enabled with the -std=c++11 or -std=gnu++11 compiler options.
encrypt.cpp: #error This file requires compiler and library support \
encrypt.cpp: ^
encrypt.cpp: encrypt.cpp:13:20: fatal error: intrin.h: No such file or directory
encrypt.cpp: #include <intrin.h>
encrypt.cpp: ^
encrypt.cpp: compilation terminated.

Number of similar (compiler,implementation) pairs: 4, namely:
CompilerImplementations
g++ -m64 -march=barcelona -O2 -fomit-frame-pointer opt-win-aes
g++ -m64 -march=barcelona -O3 -fomit-frame-pointer opt-win-aes
g++ -m64 -march=barcelona -O -fomit-frame-pointer opt-win-aes
g++ -m64 -march=barcelona -Os -fomit-frame-pointer opt-win-aes

Compiler output

Implementation: crypto_aead/paeq128/aesni
Compiler: g++ -m64 -march=barcelona -O2 -fomit-frame-pointer
encrypt.cpp: In file included from encrypt.cpp:13:0:
encrypt.cpp: /usr/lib/gcc/x86_64-linux-gnu/5/include/wmmintrin.h: In function 'void DoubleFPermAsm(const __m128i*, const __m128i*, __m128i*, __m128i*)':
encrypt.cpp: /usr/lib/gcc/x86_64-linux-gnu/5/include/wmmintrin.h:61:1: error: inlining failed in call to always_inline '__m128i _mm_aesenc_si128(__m128i, __m128i)': target specific option mismatch
encrypt.cpp: _mm_aesenc_si128 (__m128i __X, __m128i __Y)
encrypt.cpp: ^
encrypt.cpp: encrypt.cpp:175:44: error: called from here
encrypt.cpp: acc7 = _mm_aesenc_si128(acc7, roundkey3);
encrypt.cpp: ^
encrypt.cpp: In file included from encrypt.cpp:13:0:
encrypt.cpp: /usr/lib/gcc/x86_64-linux-gnu/5/include/wmmintrin.h:61:1: error: inlining failed in call to always_inline '__m128i _mm_aesenc_si128(__m128i, __m128i)': target specific option mismatch
encrypt.cpp: _mm_aesenc_si128 (__m128i __X, __m128i __Y)
encrypt.cpp: ^
encrypt.cpp: encrypt.cpp:174:44: error: called from here
encrypt.cpp: acc6 = _mm_aesenc_si128(acc6, roundkey2);
encrypt.cpp: ^
encrypt.cpp: In file included from encrypt.cpp:13:0:
encrypt.cpp: /usr/lib/gcc/x86_64-linux-gnu/5/include/wmmintrin.h:61:1: error: inlining failed in call to always_inline '__m128i _mm_aesenc_si128(__m128i, __m128i)': target specific option mismatch
encrypt.cpp: _mm_aesenc_si128 (__m128i __X, __m128i __Y)
encrypt.cpp: ^
encrypt.cpp: encrypt.cpp:173:44: error: called from here
encrypt.cpp: acc5 = _mm_aesenc_si128(acc5, roundkey1);
encrypt.cpp: ^
encrypt.cpp: In file included from encrypt.cpp:13:0:
encrypt.cpp: /usr/lib/gcc/x86_64-linux-gnu/5/include/wmmintrin.h:61:1: error: inlining failed in call to always_inline '__m128i _mm_aesenc_si128(__m128i, __m128i)': target specific option mismatch
encrypt.cpp: _mm_aesenc_si128 (__m128i __X, __m128i __Y)
encrypt.cpp: ...
encrypt.cpp: In file included from encrypt.cpp:13:0:
encrypt.cpp: /usr/lib/gcc/x86_64-linux-gnu/5/include/wmmintrin.h: In function 'void DoubleFPermAsm(const __m128i*, const __m128i*, __m128i*, __m128i*)':
encrypt.cpp: /usr/lib/gcc/x86_64-linux-gnu/5/include/wmmintrin.h:61:1: error: inlining failed in call to always_inline '__m128i _mm_aesenc_si128(__m128i, __m128i)': target specific option mismatch
encrypt.cpp: _mm_aesenc_si128 (__m128i __X, __m128i __Y)
encrypt.cpp: ^
encrypt.cpp: encrypt.cpp:175:44: error: called from here
encrypt.cpp: acc7 = _mm_aesenc_si128(acc7, roundkey3);
encrypt.cpp: ^
encrypt.cpp: In file included from encrypt.cpp:13:0:
encrypt.cpp: /usr/lib/gcc/x86_64-linux-gnu/5/include/wmmintrin.h:61:1: error: inlining failed in call to always_inline '__m128i _mm_aesenc_si128(__m128i, __m128i)': target specific option mismatch
encrypt.cpp: _mm_aesenc_si128 (__m128i __X, __m128i __Y)
encrypt.cpp: ^
encrypt.cpp: encrypt.cpp:174:44: error: called from here
encrypt.cpp: acc6 = _mm_aesenc_si128(acc6, roundkey2);
encrypt.cpp: ^
encrypt.cpp: In file included from encrypt.cpp:13:0:
encrypt.cpp: /usr/lib/gcc/x86_64-linux-gnu/5/include/wmmintrin.h:61:1: error: inlining failed in call to always_inline '__m128i _mm_aesenc_si128(__m128i, __m128i)': target specific option mismatch
encrypt.cpp: _mm_aesenc_si128 (__m128i __X, __m128i __Y)
encrypt.cpp: ^
encrypt.cpp: encrypt.cpp:173:44: error: called from here
encrypt.cpp: acc5 = _mm_aesenc_si128(acc5, roundkey1);
encrypt.cpp: ^
encrypt.cpp: In file included from encrypt.cpp:13:0:
encrypt.cpp: /usr/lib/gcc/x86_64-linux-gnu/5/include/wmmintrin.h:61:1: error: inlining failed in call to always_inline '__m128i _mm_aesenc_si128(__m128i, __m128i)': target specific option mismatch
encrypt.cpp: _mm_aesenc_si128 (__m128i __X, __m128i __Y)
encrypt.cpp: ...

Number of similar (compiler,implementation) pairs: 4, namely:
CompilerImplementations
g++ -m64 -march=barcelona -O2 -fomit-frame-pointer aesni
g++ -m64 -march=barcelona -O3 -fomit-frame-pointer aesni
g++ -m64 -march=barcelona -O -fomit-frame-pointer aesni
g++ -m64 -march=barcelona -Os -fomit-frame-pointer aesni