Implementation notes: amd64, h8atom, crypto_hash/echosp256

Computer: h8atom
Architecture: amd64
CPU ID: GenuineIntel-00030661-bfebfbff
SUPERCOP version: 20200618
Operation: crypto_hash
Primitive: echosp256
TimeObject sizeTest sizeImplementationCompilerBenchmark dateSUPERCOP version
16014620140 0 030414 776 816generic/opt64gcc_-march=native_-mtune=native_-O2_-fomit-frame-pointer_-fwrapv_-fPIC_-fPIE2020041020200409
16134326804 0 039318 776 816generic/opt64gcc_-march=native_-mtune=native_-O3_-fomit-frame-pointer_-fwrapv_-fPIC_-fPIE2020041020200409
17126219126 0 028624 776 792generic/opt32gcc_-march=native_-mtune=native_-Os_-fomit-frame-pointer_-fwrapv_-fPIC_-fPIE2020041020200409
17733120109 0 030342 776 816generic/opt64gcc_-march=native_-mtune=native_-O_-fomit-frame-pointer_-fwrapv_-fPIC_-fPIE2020041020200409
17881525333 0 038085 800 824generic/opt32gcc_-march=native_-mtune=native_-O3_-fomit-frame-pointer_-fwrapv_-fPIC_-fPIE2020041020200409
17927733780 0 046373 784 824powerpc/pp32cv2gcc_-march=native_-mtune=native_-O3_-fomit-frame-pointer_-fwrapv_-fPIC_-fPIE2020041020200409
18127920461 0 030941 800 824generic/opt32gcc_-march=native_-mtune=native_-O2_-fomit-frame-pointer_-fwrapv_-fPIC_-fPIE2020041020200409
18449219931 0 029217 752 784generic/opt64gcc_-march=native_-mtune=native_-Os_-fomit-frame-pointer_-fwrapv_-fPIC_-fPIE2020041020200409
18798529388 0 039741 784 824powerpc/pp32cv2gcc_-march=native_-mtune=native_-O2_-fomit-frame-pointer_-fwrapv_-fPIC_-fPIE2020041020200409
18976325976 0 035344 760 792powerpc/pp32cv2gcc_-march=native_-mtune=native_-Os_-fomit-frame-pointer_-fwrapv_-fPIC_-fPIE2020041020200409
19798822889 0 034977 776 752powerpc/pp32cv1clang_-mcpu=native_-O3_-fomit-frame-pointer_-fwrapv_-Qunused-arguments_-fPIC_-fPIE2020041020200409
19799521761 0 032625 776 752powerpc/pp32cv1clang_-march=native_-O2_-fomit-frame-pointer_-fwrapv_-Qunused-arguments_-fPIC_-fPIE2020041020200409
20047321761 0 032625 776 752powerpc/pp32cv1clang_-march=native_-O_-fomit-frame-pointer_-fwrapv_-Qunused-arguments_-fPIC_-fPIE2020041020200409
20051521832 0 034033 776 752powerpc/pp32cv1clang_-march=native_-O3_-fomit-frame-pointer_-fwrapv_-Qunused-arguments_-fPIC_-fPIE2020041020200409
20210420146 0 030589 800 824generic/opt32gcc_-march=native_-mtune=native_-O_-fomit-frame-pointer_-fwrapv_-fPIC_-fPIE2020041020200409
20890123162 0 034202 792 752generic/opt32clang_-march=native_-O_-fomit-frame-pointer_-fwrapv_-Qunused-arguments_-fPIC_-fPIE2020041020200409
20942623162 0 034202 792 752generic/opt32clang_-march=native_-O2_-fomit-frame-pointer_-fwrapv_-Qunused-arguments_-fPIC_-fPIE2020041020200409
21026623273 0 035650 792 752generic/opt32clang_-march=native_-O3_-fomit-frame-pointer_-fwrapv_-Qunused-arguments_-fPIC_-fPIE2020041020200409
21255524410 0 036674 792 752generic/opt32clang_-mcpu=native_-O3_-fomit-frame-pointer_-fwrapv_-Qunused-arguments_-fPIC_-fPIE2020041020200409
21999628059 0 040257 776 744generic/opt64clang_-march=native_-O3_-fomit-frame-pointer_-fwrapv_-Qunused-arguments_-fPIC_-fPIE2020041020200409
22062628118 0 038977 776 744generic/opt64clang_-march=native_-O2_-fomit-frame-pointer_-fwrapv_-Qunused-arguments_-fPIC_-fPIE2020041020200409
22344728118 0 038977 776 744generic/opt64clang_-march=native_-O_-fomit-frame-pointer_-fwrapv_-Qunused-arguments_-fPIC_-fPIE2020041020200409
22362229211 0 041281 776 744generic/opt64clang_-mcpu=native_-O3_-fomit-frame-pointer_-fwrapv_-Qunused-arguments_-fPIC_-fPIE2020041020200409
22656930599 0 039463 768 744generic/opt64clang_-march=native_-Os_-fomit-frame-pointer_-fwrapv_-Qunused-arguments_-fPIC_-fPIE2020041020200409
23375123284 0 035877 784 824powerpc/pp32cv1gcc_-march=native_-mtune=native_-O3_-fomit-frame-pointer_-fwrapv_-fPIC_-fPIE2020041020200409
23482221462 0 030270 776 752generic/opt32clang_-march=native_-Os_-fomit-frame-pointer_-fwrapv_-Qunused-arguments_-fPIC_-fPIE2020041020200409
23642530697 0 042785 776 752powerpc/pp32cv2clang_-mcpu=native_-O3_-fomit-frame-pointer_-fwrapv_-Qunused-arguments_-fPIC_-fPIE2020041020200409
23666329393 0 040257 776 752powerpc/pp32cv2clang_-march=native_-O_-fomit-frame-pointer_-fwrapv_-Qunused-arguments_-fPIC_-fPIE2020041020200409
23668429480 0 041681 776 752powerpc/pp32cv2clang_-march=native_-O3_-fomit-frame-pointer_-fwrapv_-Qunused-arguments_-fPIC_-fPIE2020041020200409
23915529393 0 040257 776 752powerpc/pp32cv2clang_-march=native_-O2_-fomit-frame-pointer_-fwrapv_-Qunused-arguments_-fPIC_-fPIE2020041020200409
24021228491 0 038813 784 824powerpc/pp32cv2gcc_-march=native_-mtune=native_-O_-fomit-frame-pointer_-fwrapv_-fPIC_-fPIE2020041020200409
24409718556 0 028909 784 824powerpc/pp32cv1gcc_-march=native_-mtune=native_-O2_-fomit-frame-pointer_-fwrapv_-fPIC_-fPIE2020041020200409
25252517037 0 026416 760 792powerpc/pp32cv1gcc_-march=native_-mtune=native_-Os_-fomit-frame-pointer_-fwrapv_-fPIC_-fPIE2020041020200409
29502218357 0 028685 784 824powerpc/pp32cv1gcc_-march=native_-mtune=native_-O_-fomit-frame-pointer_-fwrapv_-fPIC_-fPIE2020041020200409
31253620406 0 029119 768 752powerpc/pp32cv1clang_-march=native_-Os_-fomit-frame-pointer_-fwrapv_-Qunused-arguments_-fPIC_-fPIE2020041020200409
36173928298 0 037007 768 752powerpc/pp32cv2clang_-march=native_-Os_-fomit-frame-pointer_-fwrapv_-Qunused-arguments_-fPIC_-fPIE2020041020200409

Compiler output

Implementation: aes/aes64
Security model: unknown
Compiler: clang -march=native -O2 -fomit-frame-pointer -fwrapv -Qunused-arguments -fPIC -fPIE
echo64.s: echo64.c:636:2: error: '.att_syntax noprefix' is not supported: registers must have a '%' prefix in .att_syntax
echo64.s: .att_syntax noprefix
echo64.s: ^
echo64.s: echo64.s:1053:10: error: unknown token in expression
echo64.s: movabsq $-9187201950435737472, %rax
echo64.s: ^
echo64.s: echo64.s:1054:10: error: unknown token in expression
echo64.s: movabsq $-9187201950435737472, %r11
echo64.s: ^
echo64.s: echo64.s:1055:10: error: unknown token in expression
echo64.s: movabsq $7599940337074203, %r10
echo64.s: ^
echo64.s: echo64.s:1056:7: error: unknown token in expression
echo64.s: movq %rax, MEM_CST+16(%rip)
echo64.s: ^
echo64.s: echo64.s:1057:10: error: unknown token in expression
echo64.s: movabsq $7599940337074203, %r9
echo64.s: ^
echo64.s: echo64.s:1058:10: error: unknown token in expression
echo64.s: movabsq $-72340172838076674, %rax
echo64.s: ^
echo64.s: echo64.s:1059:10: error: unknown token in expression
echo64.s: movabsq $72340172838076673, %r8
echo64.s: ^
echo64.s: echo64.s:1060:10: error: unknown token in expression
echo64.s: ...

Number of similar (compiler,implementation) pairs: 5, namely:
CompilerImplementations
clang -march=native -O2 -fomit-frame-pointer -fwrapv -Qunused-arguments -fPIC -fPIE aes/aes64
clang -march=native -O3 -fomit-frame-pointer -fwrapv -Qunused-arguments -fPIC -fPIE aes/aes64
clang -march=native -O -fomit-frame-pointer -fwrapv -Qunused-arguments -fPIC -fPIE aes/aes64
clang -march=native -Os -fomit-frame-pointer -fwrapv -Qunused-arguments -fPIC -fPIE aes/aes64
clang -mcpu=native -O3 -fomit-frame-pointer -fwrapv -Qunused-arguments -fPIC -fPIE aes/aes64

Compiler output

Implementation: aes/aes64
Security model: unknown
Compiler: gcc -march=native -mtune=native -O2 -fomit-frame-pointer -fwrapv -fPIC -fPIE
try.c: /usr/bin/ld: crypto_hash_echosp256.a(echo64.o): relocation R_X86_64_32S against undefined symbol `OLDCV' can not be used when making a PIE object; recompile with -fPIC
try.c: /usr/bin/ld: final link failed: Nonrepresentable section on output
try.c: collect2: error: ld returned 1 exit status

Number of similar (compiler,implementation) pairs: 4, namely:
CompilerImplementations
gcc -march=native -mtune=native -O2 -fomit-frame-pointer -fwrapv -fPIC -fPIE aes/aes64
gcc -march=native -mtune=native -O3 -fomit-frame-pointer -fwrapv -fPIC -fPIE aes/aes64
gcc -march=native -mtune=native -O -fomit-frame-pointer -fwrapv -fPIC -fPIE aes/aes64
gcc -march=native -mtune=native -Os -fomit-frame-pointer -fwrapv -fPIC -fPIE aes/aes64

Compiler output

Implementation: athlon/athlon64
Security model: unknown
Compiler: clang -march=native -O2 -fomit-frame-pointer -fwrapv -Qunused-arguments -fPIC -fPIE
echo64.s: echo64.c:729:2: error: invalid instruction mnemonic 'movzbl'
echo64.s: movzbl ebp, ah
echo64.s: ^~~~~~
echo64.s: echo64.c:729:2: error: invalid instruction mnemonic 'movzbl'
echo64.s: movzbl esi, al
echo64.s: ^~~~~~
echo64.s: echo64.c:729:2: error: invalid instruction mnemonic 'movzbl'
echo64.s: movzbl ebp, bl
echo64.s: ^~~~~~
echo64.s: echo64.c:729:2: error: invalid instruction mnemonic 'movzbl'
echo64.s: movzbl esi, bh
echo64.s: ^~~~~~
echo64.s: echo64.c:729:2: error: invalid instruction mnemonic 'movzbl'
echo64.s: movzbl ebp, al
echo64.s: ^~~~~~
echo64.s: echo64.c:729:2: error: invalid instruction mnemonic 'movzbl'
echo64.s: movzbl esi, ah
echo64.s: ^~~~~~
echo64.s: echo64.c:729:2: error: invalid instruction mnemonic 'movzbl'
echo64.s: movzbl ebp, bh
echo64.s: ^~~~~~
echo64.s: echo64.c:729:2: error: invalid instruction mnemonic 'movzbl'
echo64.s: movzbl esi, bl
echo64.s: ^~~~~~
echo64.s: echo64.c:729:2: error: invalid instruction mnemonic 'movzbl'
echo64.s: ...

Number of similar (compiler,implementation) pairs: 5, namely:
CompilerImplementations
clang -march=native -O2 -fomit-frame-pointer -fwrapv -Qunused-arguments -fPIC -fPIE athlon/athlon64
clang -march=native -O3 -fomit-frame-pointer -fwrapv -Qunused-arguments -fPIC -fPIE athlon/athlon64
clang -march=native -O -fomit-frame-pointer -fwrapv -Qunused-arguments -fPIC -fPIE athlon/athlon64
clang -march=native -Os -fomit-frame-pointer -fwrapv -Qunused-arguments -fPIC -fPIE athlon/athlon64
clang -mcpu=native -O3 -fomit-frame-pointer -fwrapv -Qunused-arguments -fPIC -fPIE athlon/athlon64

Compiler output

Implementation: athlon/athlon64
Security model: unknown
Compiler: gcc -march=native -mtune=native -O2 -fomit-frame-pointer -fwrapv -fPIC -fPIE
echo64.s: echo64.c: Assembler messages:
echo64.s: echo64.c:729: Error: no such instruction: `movzbl ebp,ah'
echo64.s: echo64.c:729: Error: no such instruction: `movzbl esi,al'
echo64.s: echo64.c:729: Error: no such instruction: `movzbl ebp,bl'
echo64.s: echo64.c:729: Error: no such instruction: `movzbl esi,bh'
echo64.s: echo64.c:729: Error: no such instruction: `movzbl ebp,al'
echo64.s: echo64.c:729: Error: no such instruction: `movzbl esi,ah'
echo64.s: echo64.c:729: Error: no such instruction: `movzbl ebp,bh'
echo64.s: echo64.c:729: Error: no such instruction: `movzbl esi,bl'
echo64.s: echo64.c:729: Error: no such instruction: `movzbl ebp,ah'
echo64.s: echo64.c:729: Error: no such instruction: `movzbl esi,al'
echo64.s: echo64.c:729: Error: no such instruction: `movzbl ebp,bl'
echo64.s: echo64.c:729: Error: no such instruction: `movzbl esi,bh'
echo64.s: echo64.c:729: Error: no such instruction: `movzbl ebp,al'
echo64.s: echo64.c:729: Error: no such instruction: `movzbl esi,ah'
echo64.s: echo64.c:729: Error: no such instruction: `movzbl ebp,bl'
echo64.s: echo64.c:729: Error: no such instruction: `movzbl esi,bh'
echo64.s: echo64.c:729: Error: no such instruction: `movzbl ebp,dl'
echo64.s: echo64.c:729: Error: no such instruction: `movzbl esi,dh'
echo64.s: echo64.c:729: Error: no such instruction: `movzbl ebp,ch'
echo64.s: echo64.c:729: Error: no such instruction: `movzbl esi,cl'
echo64.s: echo64.c:729: Error: no such instruction: `movzbl ebp,cl'
echo64.s: echo64.c:729: Error: no such instruction: `movzbl esi,ch'
echo64.s: echo64.c:729: Error: no such instruction: `movzbl ebp,dh'
echo64.s: echo64.c:729: Error: no such instruction: `movzbl esi,dl'
echo64.s: ...

Number of similar (compiler,implementation) pairs: 4, namely:
CompilerImplementations
gcc -march=native -mtune=native -O2 -fomit-frame-pointer -fwrapv -fPIC -fPIE athlon/athlon64
gcc -march=native -mtune=native -O3 -fomit-frame-pointer -fwrapv -fPIC -fPIE athlon/athlon64
gcc -march=native -mtune=native -O -fomit-frame-pointer -fwrapv -fPIC -fPIE athlon/athlon64
gcc -march=native -mtune=native -Os -fomit-frame-pointer -fwrapv -fPIC -fPIE athlon/athlon64

Compiler output

Implementation: core2/core2v64
Security model: unknown
Compiler: clang -march=native -O2 -fomit-frame-pointer -fwrapv -Qunused-arguments -fPIC -fPIE
echo64.s: echo64.c:635:2: error: invalid instruction mnemonic 'movzbl'
echo64.s: movzbl ebp, ah
echo64.s: ^~~~~~
echo64.s: echo64.c:635:2: error: invalid instruction mnemonic 'movzbl'
echo64.s: movzbl esi, al
echo64.s: ^~~~~~
echo64.s: echo64.c:635:2: error: invalid instruction mnemonic 'movzbl'
echo64.s: movzbl ebp, bl
echo64.s: ^~~~~~
echo64.s: echo64.c:635:2: error: invalid instruction mnemonic 'movzbl'
echo64.s: movzbl esi, bh
echo64.s: ^~~~~~
echo64.s: echo64.c:635:2: error: invalid instruction mnemonic 'movzbl'
echo64.s: movzbl ebp, al
echo64.s: ^~~~~~
echo64.s: echo64.c:635:2: error: invalid instruction mnemonic 'movzbl'
echo64.s: movzbl esi, ah
echo64.s: ^~~~~~
echo64.s: echo64.c:635:2: error: invalid instruction mnemonic 'movzbl'
echo64.s: movzbl ebp, bh
echo64.s: ^~~~~~
echo64.s: echo64.c:635:2: error: invalid instruction mnemonic 'movzbl'
echo64.s: movzbl esi, bl
echo64.s: ^~~~~~
echo64.s: echo64.c:635:2: error: invalid instruction mnemonic 'movzbl'
echo64.s: ...

Number of similar (compiler,implementation) pairs: 5, namely:
CompilerImplementations
clang -march=native -O2 -fomit-frame-pointer -fwrapv -Qunused-arguments -fPIC -fPIE core2/core2v64
clang -march=native -O3 -fomit-frame-pointer -fwrapv -Qunused-arguments -fPIC -fPIE core2/core2v64
clang -march=native -O -fomit-frame-pointer -fwrapv -Qunused-arguments -fPIC -fPIE core2/core2v64
clang -march=native -Os -fomit-frame-pointer -fwrapv -Qunused-arguments -fPIC -fPIE core2/core2v64
clang -mcpu=native -O3 -fomit-frame-pointer -fwrapv -Qunused-arguments -fPIC -fPIE core2/core2v64

Compiler output

Implementation: core2/core2v64
Security model: unknown
Compiler: gcc -march=native -mtune=native -O2 -fomit-frame-pointer -fwrapv -fPIC -fPIE
echo64.s: echo64.c: Assembler messages:
echo64.s: echo64.c:635: Error: no such instruction: `movzbl ebp,ah'
echo64.s: echo64.c:635: Error: no such instruction: `movzbl esi,al'
echo64.s: echo64.c:635: Error: no such instruction: `movzbl ebp,bl'
echo64.s: echo64.c:635: Error: no such instruction: `movzbl esi,bh'
echo64.s: echo64.c:635: Error: no such instruction: `movzbl ebp,al'
echo64.s: echo64.c:635: Error: no such instruction: `movzbl esi,ah'
echo64.s: echo64.c:635: Error: no such instruction: `movzbl ebp,bh'
echo64.s: echo64.c:635: Error: no such instruction: `movzbl esi,bl'
echo64.s: echo64.c:635: Error: no such instruction: `movzbl ebp,ah'
echo64.s: echo64.c:635: Error: no such instruction: `movzbl esi,al'
echo64.s: echo64.c:635: Error: no such instruction: `movzbl ebp,bl'
echo64.s: echo64.c:635: Error: no such instruction: `movzbl esi,bh'
echo64.s: echo64.c:635: Error: no such instruction: `movzbl ebp,al'
echo64.s: echo64.c:635: Error: no such instruction: `movzbl esi,ah'
echo64.s: echo64.c:635: Error: no such instruction: `movzbl ebp,bl'
echo64.s: echo64.c:635: Error: no such instruction: `movzbl esi,bh'
echo64.s: echo64.c:635: Error: no such instruction: `movzbl ebp,dl'
echo64.s: echo64.c:635: Error: no such instruction: `movzbl esi,dh'
echo64.s: echo64.c:635: Error: no such instruction: `movzbl ebp,ch'
echo64.s: echo64.c:635: Error: no such instruction: `movzbl esi,cl'
echo64.s: echo64.c:635: Error: no such instruction: `movzbl ebp,cl'
echo64.s: echo64.c:635: Error: no such instruction: `movzbl esi,ch'
echo64.s: echo64.c:635: Error: no such instruction: `movzbl ebp,dh'
echo64.s: echo64.c:635: Error: no such instruction: `movzbl esi,dl'
echo64.s: ...

Number of similar (compiler,implementation) pairs: 4, namely:
CompilerImplementations
gcc -march=native -mtune=native -O2 -fomit-frame-pointer -fwrapv -fPIC -fPIE core2/core2v64
gcc -march=native -mtune=native -O3 -fomit-frame-pointer -fwrapv -fPIC -fPIE core2/core2v64
gcc -march=native -mtune=native -O -fomit-frame-pointer -fwrapv -fPIC -fPIE core2/core2v64
gcc -march=native -mtune=native -Os -fomit-frame-pointer -fwrapv -fPIC -fPIE core2/core2v64

Compiler output

Implementation: generic/opt32
Security model: unknown
Compiler: clang -march=native -O2 -fomit-frame-pointer -fwrapv -Qunused-arguments -fPIC -fPIE
echo32.c: echo32.c:37:4: warning: implicitly declaring library function 'printf' with type 'int (const char *, ...)' [-Wimplicit-function-declaration]
echo32.c: printf ("row %d,col %d :",i,j);
echo32.c: ^
echo32.c: echo32.c:37:4: note: include the header <stdio.h> or explicitly provide a declaration for 'printf'
echo32.c: 1 warning generated.

Number of similar (compiler,implementation) pairs: 5, namely:
CompilerImplementations
clang -march=native -O2 -fomit-frame-pointer -fwrapv -Qunused-arguments -fPIC -fPIE generic/opt32
clang -march=native -O3 -fomit-frame-pointer -fwrapv -Qunused-arguments -fPIC -fPIE generic/opt32
clang -march=native -O -fomit-frame-pointer -fwrapv -Qunused-arguments -fPIC -fPIE generic/opt32
clang -march=native -Os -fomit-frame-pointer -fwrapv -Qunused-arguments -fPIC -fPIE generic/opt32
clang -mcpu=native -O3 -fomit-frame-pointer -fwrapv -Qunused-arguments -fPIC -fPIE generic/opt32

Compiler output

Implementation: generic/opt32
Security model: unknown
Compiler: gcc -march=native -mtune=native -O2 -fomit-frame-pointer -fwrapv -fPIC -fPIE
echo32.c: echo32.c: In function 'PrintState':
echo32.c: echo32.c:37:4: warning: implicit declaration of function 'printf' [-Wimplicit-function-declaration]
echo32.c: printf ("row %d,col %d :",i,j);
echo32.c: ^~~~~~
echo32.c: echo32.c:37:4: warning: incompatible implicit declaration of built-in function 'printf'
echo32.c: echo32.c:37:4: note: include '<stdio.h>' or provide a declaration of 'printf'
echo32.c: echo32.c:47:2: warning: incompatible implicit declaration of built-in function 'printf'
echo32.c: printf("-----------------------------------\n");
echo32.c: ^~~~~~
echo32.c: echo32.c:47:2: note: include '<stdio.h>' or provide a declaration of 'printf'

Number of similar (compiler,implementation) pairs: 4, namely:
CompilerImplementations
gcc -march=native -mtune=native -O2 -fomit-frame-pointer -fwrapv -fPIC -fPIE generic/opt32
gcc -march=native -mtune=native -O3 -fomit-frame-pointer -fwrapv -fPIC -fPIE generic/opt32
gcc -march=native -mtune=native -O -fomit-frame-pointer -fwrapv -fPIC -fPIE generic/opt32
gcc -march=native -mtune=native -Os -fomit-frame-pointer -fwrapv -fPIC -fPIE generic/opt32

Compiler output

Implementation: generic/opt64
Security model: unknown
Compiler: clang -march=native -O2 -fomit-frame-pointer -fwrapv -Qunused-arguments -fPIC -fPIE
echo64.c: echo64.c:555:29: warning: passing 'const unsigned char *' to parameter of type 'BitSequence *' (aka 'unsigned char *') discards qualifiers [-Wincompatible-pointer-types-discards-qualifiers]
echo64.c: if (Hash(CRYPTO_BYTES * 8,in,inlen * 8,out) == SUCCESS) return 0;
echo64.c: ^~
echo64.c: echo64.c:542:46: note: passing argument to parameter 'data' here
echo64.c: HashReturn Hash(int hashbitlen, BitSequence *data, DataLength databitlen, BitSequence *hashval)
echo64.c: ^
echo64.c: 1 warning generated.

Number of similar (compiler,implementation) pairs: 5, namely:
CompilerImplementations
clang -march=native -O2 -fomit-frame-pointer -fwrapv -Qunused-arguments -fPIC -fPIE generic/opt64
clang -march=native -O3 -fomit-frame-pointer -fwrapv -Qunused-arguments -fPIC -fPIE generic/opt64
clang -march=native -O -fomit-frame-pointer -fwrapv -Qunused-arguments -fPIC -fPIE generic/opt64
clang -march=native -Os -fomit-frame-pointer -fwrapv -Qunused-arguments -fPIC -fPIE generic/opt64
clang -mcpu=native -O3 -fomit-frame-pointer -fwrapv -Qunused-arguments -fPIC -fPIE generic/opt64

Compiler output

Implementation: generic/opt64
Security model: unknown
Compiler: gcc -march=native -mtune=native -O2 -fomit-frame-pointer -fwrapv -fPIC -fPIE
echo64.c: echo64.c: In function 'crypto_hash_echosp256_generic_opt64':
echo64.c: echo64.c:555:29: warning: passing argument 2 of 'Hash' discards 'const' qualifier from pointer target type [-Wdiscarded-qualifiers]
echo64.c: if (Hash(CRYPTO_BYTES * 8,in,inlen * 8,out) == SUCCESS) return 0;
echo64.c: ^~
echo64.c: echo64.c:542:12: note: expected 'BitSequence * {aka unsigned char *}' but argument is of type 'const unsigned char *'
echo64.c: HashReturn Hash(int hashbitlen, BitSequence *data, DataLength databitlen, BitSequence *hashval)
echo64.c: ^~~~

Number of similar (compiler,implementation) pairs: 4, namely:
CompilerImplementations
gcc -march=native -mtune=native -O2 -fomit-frame-pointer -fwrapv -fPIC -fPIE generic/opt64
gcc -march=native -mtune=native -O3 -fomit-frame-pointer -fwrapv -fPIC -fPIE generic/opt64
gcc -march=native -mtune=native -O -fomit-frame-pointer -fwrapv -fPIC -fPIE generic/opt64
gcc -march=native -mtune=native -Os -fomit-frame-pointer -fwrapv -fPIC -fPIE generic/opt64

Compiler output

Implementation: pentium/pentium4v64v1
Security model: unknown
Compiler: clang -march=native -O2 -fomit-frame-pointer -fwrapv -Qunused-arguments -fPIC -fPIE
echo32.s: echo32.c:656:2: error: invalid instruction mnemonic 'addd'
echo32.s: addd [SHA3_CNT], 1
echo32.s: ^~~~
echo32.s: echo32.c:656:2: error: invalid instruction mnemonic 'addd'
echo32.s: addd [SHA3_CNT], 1
echo32.s: ^~~~
echo32.s: echo32.c:656:2: error: invalid instruction mnemonic 'addd'
echo32.s: addd [SHA3_CNT], 1
echo32.s: ^~~~
echo32.s: echo32.c:656:2: error: invalid instruction mnemonic 'addd'
echo32.s: addd [SHA3_CNT], 1
echo32.s: ^~~~
echo32.s: echo32.c:657:2: error: invalid instruction mnemonic 'addd'
echo32.s: addd [SHA3_CNT], 1
echo32.s: ^~~~
echo32.s: echo32.c:657:2: error: invalid instruction mnemonic 'addd'
echo32.s: addd [SHA3_CNT], 1
echo32.s: ^~~~
echo32.s: echo32.c:657:2: error: invalid instruction mnemonic 'addd'
echo32.s: addd [SHA3_CNT], 1
echo32.s: ^~~~
echo32.s: echo32.c:657:2: error: invalid instruction mnemonic 'addd'
echo32.s: addd [SHA3_CNT], 1
echo32.s: ^~~~
echo32.s: echo32.c:658:2: error: invalid instruction mnemonic 'addd'
echo32.s: ...

Number of similar (compiler,implementation) pairs: 5, namely:
CompilerImplementations
clang -march=native -O2 -fomit-frame-pointer -fwrapv -Qunused-arguments -fPIC -fPIE pentium/pentium4v64v1
clang -march=native -O3 -fomit-frame-pointer -fwrapv -Qunused-arguments -fPIC -fPIE pentium/pentium4v64v1
clang -march=native -O -fomit-frame-pointer -fwrapv -Qunused-arguments -fPIC -fPIE pentium/pentium4v64v1
clang -march=native -Os -fomit-frame-pointer -fwrapv -Qunused-arguments -fPIC -fPIE pentium/pentium4v64v1
clang -mcpu=native -O3 -fomit-frame-pointer -fwrapv -Qunused-arguments -fPIC -fPIE pentium/pentium4v64v1

Compiler output

Implementation: pentium/pentium4v64v1
Security model: unknown
Compiler: gcc -march=native -mtune=native -O2 -fomit-frame-pointer -fwrapv -fPIC -fPIE
try.c: /usr/bin/ld: crypto_hash_echosp256.a(echo32.o): relocation R_X86_64_32S against undefined symbol `SHA3_R' can not be used when making a PIE object; recompile with -fPIC
try.c: /usr/bin/ld: final link failed: Nonrepresentable section on output
try.c: collect2: error: ld returned 1 exit status

Number of similar (compiler,implementation) pairs: 4, namely:
CompilerImplementations
gcc -march=native -mtune=native -O2 -fomit-frame-pointer -fwrapv -fPIC -fPIE pentium/pentium4v64v1
gcc -march=native -mtune=native -O3 -fomit-frame-pointer -fwrapv -fPIC -fPIE pentium/pentium4v64v1
gcc -march=native -mtune=native -O -fomit-frame-pointer -fwrapv -fPIC -fPIE pentium/pentium4v64v1
gcc -march=native -mtune=native -Os -fomit-frame-pointer -fwrapv -fPIC -fPIE pentium/pentium4v64v1

Compiler output

Implementation: pentium/pentium4v64v2
Security model: unknown
Compiler: clang -march=native -O2 -fomit-frame-pointer -fwrapv -Qunused-arguments -fPIC -fPIE
echo64.s: echo64.c:735:2: error: invalid instruction mnemonic 'addd'
echo64.s: addd [SHA3_CNT], 1
echo64.s: ^~~~
echo64.s: echo64.c:735:2: error: invalid instruction mnemonic 'addd'
echo64.s: addd [SHA3_CNT], 1
echo64.s: ^~~~
echo64.s: echo64.c:735:2: error: invalid instruction mnemonic 'addd'
echo64.s: addd [SHA3_CNT], 1
echo64.s: ^~~~
echo64.s: echo64.c:735:2: error: invalid instruction mnemonic 'addd'
echo64.s: addd [SHA3_CNT], 1
echo64.s: ^~~~
echo64.s: echo64.c:736:2: error: invalid instruction mnemonic 'addd'
echo64.s: addd [SHA3_CNT], 1
echo64.s: ^~~~
echo64.s: echo64.c:736:2: error: invalid instruction mnemonic 'addd'
echo64.s: addd [SHA3_CNT], 1
echo64.s: ^~~~
echo64.s: echo64.c:736:2: error: invalid instruction mnemonic 'addd'
echo64.s: addd [SHA3_CNT], 1
echo64.s: ^~~~
echo64.s: echo64.c:736:2: error: invalid instruction mnemonic 'addd'
echo64.s: addd [SHA3_CNT], 1
echo64.s: ^~~~
echo64.s: echo64.c:737:2: error: invalid instruction mnemonic 'addd'
echo64.s: ...

Number of similar (compiler,implementation) pairs: 5, namely:
CompilerImplementations
clang -march=native -O2 -fomit-frame-pointer -fwrapv -Qunused-arguments -fPIC -fPIE pentium/pentium4v64v2
clang -march=native -O3 -fomit-frame-pointer -fwrapv -Qunused-arguments -fPIC -fPIE pentium/pentium4v64v2
clang -march=native -O -fomit-frame-pointer -fwrapv -Qunused-arguments -fPIC -fPIE pentium/pentium4v64v2
clang -march=native -Os -fomit-frame-pointer -fwrapv -Qunused-arguments -fPIC -fPIE pentium/pentium4v64v2
clang -mcpu=native -O3 -fomit-frame-pointer -fwrapv -Qunused-arguments -fPIC -fPIE pentium/pentium4v64v2

Compiler output

Implementation: pentium/pentium4v64v2
Security model: unknown
Compiler: gcc -march=native -mtune=native -O2 -fomit-frame-pointer -fwrapv -fPIC -fPIE
try.c: /usr/bin/ld: crypto_hash_echosp256.a(echo64.o): relocation R_X86_64_32S against undefined symbol `SHA3_R' can not be used when making a PIE object; recompile with -fPIC
try.c: /usr/bin/ld: final link failed: Nonrepresentable section on output
try.c: collect2: error: ld returned 1 exit status

Number of similar (compiler,implementation) pairs: 4, namely:
CompilerImplementations
gcc -march=native -mtune=native -O2 -fomit-frame-pointer -fwrapv -fPIC -fPIE pentium/pentium4v64v2
gcc -march=native -mtune=native -O3 -fomit-frame-pointer -fwrapv -fPIC -fPIE pentium/pentium4v64v2
gcc -march=native -mtune=native -O -fomit-frame-pointer -fwrapv -fPIC -fPIE pentium/pentium4v64v2
gcc -march=native -mtune=native -Os -fomit-frame-pointer -fwrapv -fPIC -fPIE pentium/pentium4v64v2

Namespace violations

Implementation: generic/opt32
Security model: unknown
Compiler: clang -march=native -O2 -fomit-frame-pointer -fwrapv -Qunused-arguments -fPIC -fPIE
echo32.o CNT_r C
echo32.o Compress T
echo32.o Endianess T
echo32.o Final T
echo32.o Hash T
echo32.o Init T
echo32.o PrintState T
echo32.o PushString T
echo32.o Update T
echo32.o endian C
echo32.o flip_bits T
echo32.o r C

Number of similar (compiler,implementation) pairs: 9, namely:
CompilerImplementations
clang -march=native -O2 -fomit-frame-pointer -fwrapv -Qunused-arguments -fPIC -fPIE generic/opt32
clang -march=native -O3 -fomit-frame-pointer -fwrapv -Qunused-arguments -fPIC -fPIE generic/opt32
clang -march=native -O -fomit-frame-pointer -fwrapv -Qunused-arguments -fPIC -fPIE generic/opt32
clang -march=native -Os -fomit-frame-pointer -fwrapv -Qunused-arguments -fPIC -fPIE generic/opt32
clang -mcpu=native -O3 -fomit-frame-pointer -fwrapv -Qunused-arguments -fPIC -fPIE generic/opt32
gcc -march=native -mtune=native -O2 -fomit-frame-pointer -fwrapv -fPIC -fPIE generic/opt32
gcc -march=native -mtune=native -O3 -fomit-frame-pointer -fwrapv -fPIC -fPIE generic/opt32
gcc -march=native -mtune=native -O -fomit-frame-pointer -fwrapv -fPIC -fPIE generic/opt32
gcc -march=native -mtune=native -Os -fomit-frame-pointer -fwrapv -fPIC -fPIE generic/opt32

Namespace violations

Implementation: generic/opt64
Security model: unknown
Compiler: clang -march=native -O2 -fomit-frame-pointer -fwrapv -Qunused-arguments -fPIC -fPIE
echo64.o Compress T
echo64.o Endianess T
echo64.o Final T
echo64.o Hash T
echo64.o Init T
echo64.o PushString T
echo64.o Update T
echo64.o endian C

Number of similar (compiler,implementation) pairs: 9, namely:
CompilerImplementations
clang -march=native -O2 -fomit-frame-pointer -fwrapv -Qunused-arguments -fPIC -fPIE generic/opt64
clang -march=native -O3 -fomit-frame-pointer -fwrapv -Qunused-arguments -fPIC -fPIE generic/opt64
clang -march=native -O -fomit-frame-pointer -fwrapv -Qunused-arguments -fPIC -fPIE generic/opt64
clang -march=native -Os -fomit-frame-pointer -fwrapv -Qunused-arguments -fPIC -fPIE generic/opt64
clang -mcpu=native -O3 -fomit-frame-pointer -fwrapv -Qunused-arguments -fPIC -fPIE generic/opt64
gcc -march=native -mtune=native -O2 -fomit-frame-pointer -fwrapv -fPIC -fPIE generic/opt64
gcc -march=native -mtune=native -O3 -fomit-frame-pointer -fwrapv -fPIC -fPIE generic/opt64
gcc -march=native -mtune=native -O -fomit-frame-pointer -fwrapv -fPIC -fPIE generic/opt64
gcc -march=native -mtune=native -Os -fomit-frame-pointer -fwrapv -fPIC -fPIE generic/opt64

Namespace violations

Implementation: powerpc/pp32cv1
Security model: unknown
Compiler: clang -march=native -O2 -fomit-frame-pointer -fwrapv -Qunused-arguments -fPIC -fPIE
echo32.o CNT_r C
echo32.o Compress T
echo32.o Endianess T
echo32.o Final T
echo32.o Hash T
echo32.o Init T
echo32.o PushString T
echo32.o Update T
echo32.o endian C
echo32.o flip_bits T
echo32.o r C

Number of similar (compiler,implementation) pairs: 18, namely:
CompilerImplementations
clang -march=native -O2 -fomit-frame-pointer -fwrapv -Qunused-arguments -fPIC -fPIE powerpc/pp32cv1
clang -march=native -O3 -fomit-frame-pointer -fwrapv -Qunused-arguments -fPIC -fPIE powerpc/pp32cv1
clang -march=native -O -fomit-frame-pointer -fwrapv -Qunused-arguments -fPIC -fPIE powerpc/pp32cv1
clang -march=native -Os -fomit-frame-pointer -fwrapv -Qunused-arguments -fPIC -fPIE powerpc/pp32cv1
clang -mcpu=native -O3 -fomit-frame-pointer -fwrapv -Qunused-arguments -fPIC -fPIE powerpc/pp32cv1
gcc -march=native -mtune=native -O2 -fomit-frame-pointer -fwrapv -fPIC -fPIE powerpc/pp32cv1
gcc -march=native -mtune=native -O3 -fomit-frame-pointer -fwrapv -fPIC -fPIE powerpc/pp32cv1
gcc -march=native -mtune=native -O -fomit-frame-pointer -fwrapv -fPIC -fPIE powerpc/pp32cv1
gcc -march=native -mtune=native -Os -fomit-frame-pointer -fwrapv -fPIC -fPIE powerpc/pp32cv1
clang -march=native -O2 -fomit-frame-pointer -fwrapv -Qunused-arguments -fPIC -fPIE powerpc/pp32cv2
clang -march=native -O3 -fomit-frame-pointer -fwrapv -Qunused-arguments -fPIC -fPIE powerpc/pp32cv2
clang -march=native -O -fomit-frame-pointer -fwrapv -Qunused-arguments -fPIC -fPIE powerpc/pp32cv2
clang -march=native -Os -fomit-frame-pointer -fwrapv -Qunused-arguments -fPIC -fPIE powerpc/pp32cv2
clang -mcpu=native -O3 -fomit-frame-pointer -fwrapv -Qunused-arguments -fPIC -fPIE powerpc/pp32cv2
gcc -march=native -mtune=native -O2 -fomit-frame-pointer -fwrapv -fPIC -fPIE powerpc/pp32cv2
gcc -march=native -mtune=native -O3 -fomit-frame-pointer -fwrapv -fPIC -fPIE powerpc/pp32cv2
gcc -march=native -mtune=native -O -fomit-frame-pointer -fwrapv -fPIC -fPIE powerpc/pp32cv2
gcc -march=native -mtune=native -Os -fomit-frame-pointer -fwrapv -fPIC -fPIE powerpc/pp32cv2