Implementation notes: amd64, h8atom, crypto_aead/lakekeyakv2

Computer: h8atom
Microarchitecture: amd64; Bonnell (30661)
Architecture: amd64
CPU ID: GenuineIntel-00030661-bfebfbff
SUPERCOP version: 20240425
Operation: crypto_aead
Primitive: lakekeyakv2
TimeObject sizeTest sizeImplementationCompilerBenchmark dateSUPERCOP version
72828135090 0 0136476 816 856T:generic64lcclang_-march=native_-O2_-fomit-frame-pointer_-fwrapv_-Qunused-arguments_-fPIC_-fPIE2024042920240425
73304148912 0 0152725 784 928T:Nehalemgcc_-march=native_-mtune=native_-O3_-fomit-frame-pointer_-fwrapv_-fPIC_-fPIE2024042920240425
73528138565 0 0142429 784 928T:Nehalemgcc_-march=native_-mtune=native_-O_-fomit-frame-pointer_-fwrapv_-fPIC_-fPIE2024042920240425
73556132602 0 0136094 808 856T:Nehalemclang_-march=native_-Os_-fomit-frame-pointer_-fwrapv_-Qunused-arguments_-fPIC_-fPIE2024042920240425
73731146499 0 0147356 816 856T:Nehalemclang_-march=native_-O3_-fomit-frame-pointer_-fwrapv_-Qunused-arguments_-fPIC_-fPIE2024042920240425
73934143093 0 0146516 816 856T:Nehalemclang_-march=native_-O_-fomit-frame-pointer_-fwrapv_-Qunused-arguments_-fPIC_-fPIE2024042920240425
74228142872 0 0144300 816 856T:Nehalemclang_-march=native_-O2_-fomit-frame-pointer_-fwrapv_-Qunused-arguments_-fPIC_-fPIE2024042920240425
74235127712 0 0132389 776 896T:Nehalemgcc_-march=native_-mtune=native_-Os_-fomit-frame-pointer_-fwrapv_-fPIC_-fPIE2024042920240425
75670141102 0 0145637 784 928T:Nehalemgcc_-march=native_-mtune=native_-O2_-fomit-frame-pointer_-fwrapv_-fPIC_-fPIE2024042920240425
76321139285 0 0140124 816 856T:generic64lcclang_-march=native_-O3_-fomit-frame-pointer_-fwrapv_-Qunused-arguments_-fPIC_-fPIE2024042920240425
76426137116 0 0138508 816 856T:generic64clang_-march=native_-O2_-fomit-frame-pointer_-fwrapv_-Qunused-arguments_-fPIC_-fPIE2024042920240425
76454123097 0 0126014 808 856T:generic64lcclang_-march=native_-Os_-fomit-frame-pointer_-fwrapv_-Qunused-arguments_-fPIC_-fPIE2024042920240425
76664126483 0 0129398 808 856T:generic64clang_-march=native_-Os_-fomit-frame-pointer_-fwrapv_-Qunused-arguments_-fPIC_-fPIE2024042920240425
77532141295 0 0142140 816 856T:generic64clang_-march=native_-O3_-fomit-frame-pointer_-fwrapv_-Qunused-arguments_-fPIC_-fPIE2024042920240425
79926131882 0 0135877 784 928T:generic64lcgcc_-march=native_-mtune=native_-O2_-fomit-frame-pointer_-fwrapv_-fPIC_-fPIE2024042920240425
80633117314 0 0121336 760 896T:generic64lcgcc_-march=native_-mtune=native_-Os_-fomit-frame-pointer_-fwrapv_-fPIC_-fPIE2024042920240425
80843134785 0 0137708 816 856T:generic64lcclang_-march=native_-O_-fomit-frame-pointer_-fwrapv_-Qunused-arguments_-fPIC_-fPIE2024042920240425
81165139033 0 0142829 784 928T:generic64lcgcc_-march=native_-mtune=native_-O3_-fomit-frame-pointer_-fwrapv_-fPIC_-fPIE2024042920240425
82642135715 0 0139701 784 928T:generic64gcc_-march=native_-mtune=native_-O2_-fomit-frame-pointer_-fwrapv_-fPIC_-fPIE2024042920240425
82866120328 0 0124352 760 896T:generic64gcc_-march=native_-mtune=native_-Os_-fomit-frame-pointer_-fwrapv_-fPIC_-fPIE2024042920240425
85106136130 0 0139052 816 856T:generic64clang_-march=native_-O_-fomit-frame-pointer_-fwrapv_-Qunused-arguments_-fPIC_-fPIE2024042920240425
86219142588 0 0142420 816 856T:generic64lcclang_-mcpu=native_-O3_-fomit-frame-pointer_-fwrapv_-Qunused-arguments_-fPIC_-fPIE2024042920240425
86513142181 0 0145957 784 928T:generic64gcc_-march=native_-mtune=native_-O3_-fomit-frame-pointer_-fwrapv_-fPIC_-fPIE2024042920240425
96789144395 0 0144228 816 856T:generic64clang_-mcpu=native_-O3_-fomit-frame-pointer_-fwrapv_-Qunused-arguments_-fPIC_-fPIE2024042920240425
100940128582 0 0132029 784 928T:generic64lcgcc_-march=native_-mtune=native_-O_-fomit-frame-pointer_-fwrapv_-fPIC_-fPIE2024042920240425
10523869493 0 1267215 832 856T:referenceclang_-march=native_-O3_-fomit-frame-pointer_-fwrapv_-Qunused-arguments_-fPIC_-fPIE2024042920240425
105322132418 0 0135861 784 928T:generic64gcc_-march=native_-mtune=native_-O_-fomit-frame-pointer_-fwrapv_-fPIC_-fPIE2024042920240425
10855664701 0 1263015 832 856T:referenceclang_-march=native_-O2_-fomit-frame-pointer_-fwrapv_-Qunused-arguments_-fPIC_-fPIE2024042920240425
11028559569 0 063204 816 856T:compactclang_-march=native_-O3_-fomit-frame-pointer_-fwrapv_-Qunused-arguments_-fPIC_-fPIE2024042920240425
11655070920 0 1267727 832 856T:referenceclang_-mcpu=native_-O3_-fomit-frame-pointer_-fwrapv_-Qunused-arguments_-fPIC_-fPIE2024042920240425
12594462740 0 065316 816 856T:compactclang_-mcpu=native_-O3_-fomit-frame-pointer_-fwrapv_-Qunused-arguments_-fPIC_-fPIE2024042920240425
21789680224 0 084132 792 928T:generic32gcc_-march=native_-mtune=native_-O3_-fomit-frame-pointer_-fwrapv_-fPIC_-fPIE2024042920240425
22650681300 0 085212 792 928T:generic32lcgcc_-march=native_-mtune=native_-O3_-fomit-frame-pointer_-fwrapv_-fPIC_-fPIE2024042920240425
23012579260 0 080028 816 856T:generic32lcclang_-march=native_-O3_-fomit-frame-pointer_-fwrapv_-Qunused-arguments_-fPIC_-fPIE2024042920240425
23027268995 0 073597 784 928T:compactgcc_-march=native_-mtune=native_-O3_-fomit-frame-pointer_-fwrapv_-fPIC_-fPIE2024042920240425
23324073833 0 075148 816 856T:generic32clang_-march=native_-O2_-fomit-frame-pointer_-fwrapv_-Qunused-arguments_-fPIC_-fPIE2024042920240425
23355578132 0 078900 816 856T:generic32clang_-march=native_-O3_-fomit-frame-pointer_-fwrapv_-Qunused-arguments_-fPIC_-fPIE2024042920240425
23519374961 0 076276 816 856T:generic32lcclang_-march=native_-O2_-fomit-frame-pointer_-fwrapv_-Qunused-arguments_-fPIC_-fPIE2024042920240425
23649561648 0 064590 808 856T:generic32lcclang_-march=native_-Os_-fomit-frame-pointer_-fwrapv_-Qunused-arguments_-fPIC_-fPIE2024042920240425
24069561323 0 064262 808 856T:generic32clang_-march=native_-Os_-fomit-frame-pointer_-fwrapv_-Qunused-arguments_-fPIC_-fPIE2024042920240425
25025068401 0 071340 816 856T:generic32clang_-march=native_-O_-fomit-frame-pointer_-fwrapv_-Qunused-arguments_-fPIC_-fPIE2024042920240425
25102769065 0 072004 816 856T:generic32lcclang_-march=native_-O_-fomit-frame-pointer_-fwrapv_-Qunused-arguments_-fPIC_-fPIE2024042920240425
25262370898 0 075036 792 928T:generic32lcgcc_-march=native_-mtune=native_-O2_-fomit-frame-pointer_-fwrapv_-fPIC_-fPIE2024042920240425
25332370326 0 074460 792 928T:generic32gcc_-march=native_-mtune=native_-O2_-fomit-frame-pointer_-fwrapv_-fPIC_-fPIE2024042920240425
25396056385 0 059988 816 856T:compactclang_-march=native_-O2_-fomit-frame-pointer_-fwrapv_-Qunused-arguments_-fPIC_-fPIE2024042920240425
25446458555 0 062703 768 896T:generic32gcc_-march=native_-mtune=native_-Os_-fomit-frame-pointer_-fwrapv_-fPIC_-fPIE2024042920240425
25951159118 0 063271 768 896T:generic32lcgcc_-march=native_-mtune=native_-Os_-fomit-frame-pointer_-fwrapv_-fPIC_-fPIE2024042920240425
25971481199 0 080764 816 856T:generic32clang_-mcpu=native_-O3_-fomit-frame-pointer_-fwrapv_-Qunused-arguments_-fPIC_-fPIE2024042920240425
26035182663 0 082228 816 856T:generic32lcclang_-mcpu=native_-O3_-fomit-frame-pointer_-fwrapv_-Qunused-arguments_-fPIC_-fPIE2024042920240425
30688765954 0 1666944 800 928T:referencegcc_-march=native_-mtune=native_-O3_-fomit-frame-pointer_-fwrapv_-fPIC_-fPIE2024042920240425
30976467389 0 070980 792 928T:generic32gcc_-march=native_-mtune=native_-O_-fomit-frame-pointer_-fwrapv_-fPIC_-fPIE2024042920240425
31262767963 0 071556 792 928T:generic32lcgcc_-march=native_-mtune=native_-O_-fomit-frame-pointer_-fwrapv_-fPIC_-fPIE2024042920240425
44277844620 0 049806 808 856T:compactclang_-march=native_-Os_-fomit-frame-pointer_-fwrapv_-Qunused-arguments_-fPIC_-fPIE2024042920240425
46410051357 0 056332 816 856T:compactclang_-march=native_-O_-fomit-frame-pointer_-fwrapv_-Qunused-arguments_-fPIC_-fPIE2024042920240425
49249243587 0 048912 760 896T:compactgcc_-march=native_-mtune=native_-Os_-fomit-frame-pointer_-fwrapv_-fPIC_-fPIE2024042920240425
51757354510 0 060197 784 928T:compactgcc_-march=native_-mtune=native_-O2_-fomit-frame-pointer_-fwrapv_-fPIC_-fPIE2024042920240425
58782551389 0 056781 784 928T:compactgcc_-march=native_-mtune=native_-O_-fomit-frame-pointer_-fwrapv_-fPIC_-fPIE2024042920240425
121041259535 0 1259511 832 856T:referenceclang_-march=native_-O_-fomit-frame-pointer_-fwrapv_-Qunused-arguments_-fPIC_-fPIE2024042920240425
140377360407 0 1662240 800 928T:referencegcc_-march=native_-mtune=native_-O2_-fomit-frame-pointer_-fwrapv_-fPIC_-fPIE2024042920240425
227191352597 0 1253454 824 856T:referenceclang_-march=native_-Os_-fomit-frame-pointer_-fwrapv_-Qunused-arguments_-fPIC_-fPIE2024042920240425
271364848604 0 1650784 776 896T:referencegcc_-march=native_-mtune=native_-Os_-fomit-frame-pointer_-fwrapv_-fPIC_-fPIE2024042920240425
322327673838 0 1271615 832 856T:reference32bitsclang_-march=native_-O3_-fomit-frame-pointer_-fwrapv_-Qunused-arguments_-fPIC_-fPIE2024042920240425
330542144573 648 573544 1800 864T:refnewclang++_-march=native_-O3_-fomit-frame-pointer_-fwrapv_-Qunused-arguments_-fPIC_-fPIE2024042920240425
335799836379 552 563892 1704 864T:refclang++_-march=native_-O2_-fomit-frame-pointer_-fwrapv_-Qunused-arguments_-fPIC_-fPIE2024042920240425
336196040909 552 569580 1704 864T:refclang++_-march=native_-O3_-fomit-frame-pointer_-fwrapv_-Qunused-arguments_-fPIC_-fPIE2024042920240425
338583037440 648 565260 1800 864T:refnewclang++_-march=native_-O2_-fomit-frame-pointer_-fwrapv_-Qunused-arguments_-fPIC_-fPIE2024042920240425
341529370339 0 1671464 800 928T:reference32bitsgcc_-march=native_-mtune=native_-O3_-fomit-frame-pointer_-fwrapv_-fPIC_-fPIE2024042920240425
349771875081 0 1271943 832 856T:reference32bitsclang_-mcpu=native_-O3_-fomit-frame-pointer_-fwrapv_-Qunused-arguments_-fPIC_-fPIE2024042920240425
359370958764 0 1659800 800 928T:referencegcc_-march=native_-mtune=native_-O_-fomit-frame-pointer_-fwrapv_-fPIC_-fPIE2024042920240425
385859667070 0 1265439 832 856T:reference32bitsclang_-march=native_-O2_-fomit-frame-pointer_-fwrapv_-Qunused-arguments_-fPIC_-fPIE2024042920240425
399166667696 744 598907 2352 952T:refnewg++_-march=native_-mtune=native_-O3_-fomit-frame-pointer_-fwrapv_-fPIC_-fPIE2024042920240425
407348965234 648 596206 2232 952T:refg++_-march=native_-mtune=native_-O3_-fomit-frame-pointer_-fwrapv_-fPIC_-fPIE2024042920240425
477453235274 648 561855 1808 864T:refnewclang++_-march=native_-O_-fomit-frame-pointer_-fwrapv_-Qunused-arguments_-fPIC_-fPIE2024042920240425
481789034645 552 560919 1712 864T:refclang++_-march=native_-O_-fomit-frame-pointer_-fwrapv_-Qunused-arguments_-fPIC_-fPIE2024042920240425
495723963080 0 1664992 800 928T:reference32bitsgcc_-march=native_-mtune=native_-O2_-fomit-frame-pointer_-fwrapv_-fPIC_-fPIE2024042920240425
501880454730 648 584997 2280 952T:refnewg++_-march=native_-mtune=native_-O2_-fomit-frame-pointer_-fwrapv_-fPIC_-fPIE2024042920240425
502321452630 552 582703 2160 952T:refg++_-march=native_-mtune=native_-O2_-fomit-frame-pointer_-fwrapv_-fPIC_-fPIE2024042920240425
552918863528 0 1263543 832 856T:reference32bitsclang_-march=native_-O_-fomit-frame-pointer_-fwrapv_-Qunused-arguments_-fPIC_-fPIE2024042920240425
611293954457 0 1255366 824 856T:reference32bitsclang_-march=native_-Os_-fomit-frame-pointer_-fwrapv_-Qunused-arguments_-fPIC_-fPIE2024042920240425
621542628614 552 553018 1648 856T:refclang++_-march=native_-Os_-fomit-frame-pointer_-fwrapv_-Qunused-arguments_-fPIC_-fPIE2024042920240425
623726629053 648 553578 1744 856T:refnewclang++_-march=native_-Os_-fomit-frame-pointer_-fwrapv_-Qunused-arguments_-fPIC_-fPIE2024042920240425
667543150702 0 1652960 776 896T:reference32bitsgcc_-march=native_-mtune=native_-Os_-fomit-frame-pointer_-fwrapv_-fPIC_-fPIE2024042920240425
779830861032 0 1662136 800 928T:reference32bitsgcc_-march=native_-mtune=native_-O_-fomit-frame-pointer_-fwrapv_-fPIC_-fPIE2024042920240425
1224102648662 552 577346 2160 952T:refg++_-march=native_-mtune=native_-O_-fomit-frame-pointer_-fwrapv_-fPIC_-fPIE2024042920240425
1224372850106 648 578850 2272 952T:refnewg++_-march=native_-mtune=native_-O_-fomit-frame-pointer_-fwrapv_-fPIC_-fPIE2024042920240425
2047180824907 552 551152 1640 920T:refg++_-march=native_-mtune=native_-Os_-fomit-frame-pointer_-fwrapv_-fPIC_-fPIE2024042920240425
2063351525516 648 551998 1736 920T:refnewg++_-march=native_-mtune=native_-Os_-fomit-frame-pointer_-fwrapv_-fPIC_-fPIE2024042920240425

Test failure

Implementation: T:SandyBridge
Security model: timingleaks
Compiler: clang -march=native -O2 -fomit-frame-pointer -fwrapv -Qunused-arguments -fPIC -fPIE
error 111

Number of similar (compiler,implementation) pairs: 8, namely:
CompilerImplementations
clang -march=native -O2 -fomit-frame-pointer -fwrapv -Qunused-arguments -fPIC -fPIE T:SandyBridge
clang -march=native -O3 -fomit-frame-pointer -fwrapv -Qunused-arguments -fPIC -fPIE T:SandyBridge
clang -march=native -O -fomit-frame-pointer -fwrapv -Qunused-arguments -fPIC -fPIE T:SandyBridge
clang -march=native -Os -fomit-frame-pointer -fwrapv -Qunused-arguments -fPIC -fPIE T:SandyBridge
gcc -march=native -mtune=native -O2 -fomit-frame-pointer -fwrapv -fPIC -fPIE T:SandyBridge
gcc -march=native -mtune=native -O3 -fomit-frame-pointer -fwrapv -fPIC -fPIE T:SandyBridge
gcc -march=native -mtune=native -O -fomit-frame-pointer -fwrapv -fPIC -fPIE T:SandyBridge
gcc -march=native -mtune=native -Os -fomit-frame-pointer -fwrapv -fPIC -fPIE T:SandyBridge

Compiler output

Implementation: T:Bulldozer
Security model: timingleaks
Compiler: clang -march=native -O2 -fomit-frame-pointer -fwrapv -Qunused-arguments -fPIC -fPIE
KeccakP-1600-XOP.c: KeccakP-1600-XOP.c:402:5: error: '__builtin_ia32_vprotqi' needs target feature xop
KeccakP-1600-XOP.c: rounds12
KeccakP-1600-XOP.c: ^
KeccakP-1600-XOP.c: ./KeccakP-1600-unrolling.macros:46:5: note: expanded from macro 'rounds12'
KeccakP-1600-XOP.c: thetaRhoPiChiIotaPrepareTheta(12, A, E) \
KeccakP-1600-XOP.c: ^
KeccakP-1600-XOP.c: KeccakP-1600-XOP.c:200:5: note: expanded from macro 'thetaRhoPiChiIotaPrepareTheta'
KeccakP-1600-XOP.c: computeD \
KeccakP-1600-XOP.c: ^
KeccakP-1600-XOP.c: KeccakP-1600-XOP.c:187:23: note: expanded from macro 'computeD'
KeccakP-1600-XOP.c: Dei = XOR128(Cae, ROL6464same(Cio, 1)); \
KeccakP-1600-XOP.c: ^
KeccakP-1600-XOP.c: KeccakP-1600-XOP.c:60:29: note: expanded from macro 'ROL6464same'
KeccakP-1600-XOP.c: #define ROL6464same(a, o) _mm_roti_epi64(a, o)
KeccakP-1600-XOP.c: ^
KeccakP-1600-XOP.c: /usr/lib/llvm-14/lib/clang/14.0.0/include/xopintrin.h:237:13: note: expanded from macro '_mm_roti_epi64'
KeccakP-1600-XOP.c: ((__m128i)__builtin_ia32_vprotqi((__v2di)(__m128i)(A), (N)))
KeccakP-1600-XOP.c: ^
KeccakP-1600-XOP.c: KeccakP-1600-XOP.c:402:5: error: '__builtin_ia32_vprotqi' needs target feature xop
KeccakP-1600-XOP.c: ./KeccakP-1600-unrolling.macros:46:5: note: expanded from macro 'rounds12'
KeccakP-1600-XOP.c: thetaRhoPiChiIotaPrepareTheta(12, A, E) \
KeccakP-1600-XOP.c: ^
KeccakP-1600-XOP.c: KeccakP-1600-XOP.c:200:5: note: expanded from macro 'thetaRhoPiChiIotaPrepareTheta'
KeccakP-1600-XOP.c: computeD \
KeccakP-1600-XOP.c: ^
KeccakP-1600-XOP.c: ...

Number of similar (compiler,implementation) pairs: 5, namely:
CompilerImplementations
clang -march=native -O2 -fomit-frame-pointer -fwrapv -Qunused-arguments -fPIC -fPIE T:Bulldozer
clang -march=native -O3 -fomit-frame-pointer -fwrapv -Qunused-arguments -fPIC -fPIE T:Bulldozer
clang -march=native -O -fomit-frame-pointer -fwrapv -Qunused-arguments -fPIC -fPIE T:Bulldozer
clang -march=native -Os -fomit-frame-pointer -fwrapv -Qunused-arguments -fPIC -fPIE T:Bulldozer
clang -mcpu=native -O3 -fomit-frame-pointer -fwrapv -Qunused-arguments -fPIC -fPIE T:Bulldozer

Compiler output

Implementation: T:Bulldozer
Security model: timingleaks
Compiler: gcc -march=native -mtune=native -O2 -fomit-frame-pointer -fwrapv -fPIC -fPIE
KeccakP-1600-XOP.c: In file included from /usr/lib/gcc/x86_64-linux-gnu/11/include/immintrin.h:39,
KeccakP-1600-XOP.c: from /usr/lib/gcc/x86_64-linux-gnu/11/include/x86intrin.h:32,
KeccakP-1600-XOP.c: from KeccakP-1600-XOP.c:32:
KeccakP-1600-XOP.c: KeccakP-1600-XOP.c: In function 'KeccakP1600_Permute_12rounds':
KeccakP-1600-XOP.c: /usr/lib/gcc/x86_64-linux-gnu/11/include/smmintrin.h:216:1: error: inlining failed in call to 'always_inline' '_mm_blend_pd': target specific option mismatch
KeccakP-1600-XOP.c: 216 | _mm_blend_pd (__m128d __X, __m128d __Y, const int __M)
KeccakP-1600-XOP.c: | ^~~~~~~~~~~~
KeccakP-1600-XOP.c: KeccakP-1600-XOP.c:55:39: note: called from here
KeccakP-1600-XOP.c: 55 | #define GET64LOHI(a, b) ((__m128i)_mm_blend_pd((__m128d)a, (__m128d)b, 2))
KeccakP-1600-XOP.c: | ^~~~~~~~~~~~~~~~~~~~~~~~~~~~~~~~~~~~~~~
KeccakP-1600-XOP.c: KeccakP-1600-XOP.c:52:47: note: in definition of macro 'SWAP64'
KeccakP-1600-XOP.c: 52 | #define SWAP64(a) _mm_shuffle_epi32(a, 0x4E)
KeccakP-1600-XOP.c: | ^
KeccakP-1600-XOP.c: KeccakP-1600-XOP.c:56:36: note: in expansion of macro 'GET64LOHI'
KeccakP-1600-XOP.c: 56 | #define GET64HILO(a, b) SWAP64(GET64LOHI(b, a))
KeccakP-1600-XOP.c: | ^~~~~~~~~
KeccakP-1600-XOP.c: KeccakP-1600-XOP.c:253:13: note: in expansion of macro 'GET64HILO'
KeccakP-1600-XOP.c: 253 | Bsosu = GET64HILO(Bsiso, Bsusa); \
KeccakP-1600-XOP.c: | ^~~~~~~~~
KeccakP-1600-XOP.c: KeccakP-1600-XOP.c:270:36: note: in expansion of macro 'thetaRhoPiChiIotaPrepareTheta'
KeccakP-1600-XOP.c: 270 | #define thetaRhoPiChiIota(i, A, E) thetaRhoPiChiIotaPrepareTheta(i, A, E)
KeccakP-1600-XOP.c: | ^~~~~~~~~~~~~~~~~~~~~~~~~~~~~
KeccakP-1600-XOP.c: KeccakP-1600-unrolling.macros:57:5: note: in expansion of macro 'thetaRhoPiChiIota'
KeccakP-1600-XOP.c: 57 | thetaRhoPiChiIota(23, E, A) \
KeccakP-1600-XOP.c: | ^~~~~~~~~~~~~~~~~
KeccakP-1600-XOP.c: ...

Number of similar (compiler,implementation) pairs: 4, namely:
CompilerImplementations
gcc -march=native -mtune=native -O2 -fomit-frame-pointer -fwrapv -fPIC -fPIE T:Bulldozer
gcc -march=native -mtune=native -O3 -fomit-frame-pointer -fwrapv -fPIC -fPIE T:Bulldozer
gcc -march=native -mtune=native -O -fomit-frame-pointer -fwrapv -fPIC -fPIE T:Bulldozer
gcc -march=native -mtune=native -Os -fomit-frame-pointer -fwrapv -fPIC -fPIE T:Bulldozer

Compiler output

Implementation: T:Haswell
Security model: timingleaks
Compiler: clang -march=native -O2 -fomit-frame-pointer -fwrapv -Qunused-arguments -fPIC -fPIE
KeccakP-1600-times4-SIMD256.c: KeccakP-1600-times4-SIMD256.c:146:9: error: always_inline function '_mm256_loadu_si256' requires target feature 'avx', but would be inlined into function 'KeccakP1600times4_AddLanesAll' that is compiled without support for 'avx'
KeccakP-1600-times4-SIMD256.c: Xor_In4( 0 );
KeccakP-1600-times4-SIMD256.c: ^
KeccakP-1600-times4-SIMD256.c: KeccakP-1600-times4-SIMD256.c:135:42: note: expanded from macro 'Xor_In4'
KeccakP-1600-times4-SIMD256.c: #define Xor_In4( argIndex ) lanes0 = LOAD256u( curData0[argIndex]),\
KeccakP-1600-times4-SIMD256.c: ^
KeccakP-1600-times4-SIMD256.c: KeccakP-1600-times4-SIMD256.c:44:37: note: expanded from macro 'LOAD256u'
KeccakP-1600-times4-SIMD256.c: #define LOAD256u(a) _mm256_loadu_si256((const V256 *)&(a))
KeccakP-1600-times4-SIMD256.c: ^
KeccakP-1600-times4-SIMD256.c: KeccakP-1600-times4-SIMD256.c:146:9: error: AVX vector return of type '__m256i' (vector of 4 'long long' values) without 'avx' enabled changes the ABI
KeccakP-1600-times4-SIMD256.c: KeccakP-1600-times4-SIMD256.c:135:42: note: expanded from macro 'Xor_In4'
KeccakP-1600-times4-SIMD256.c: #define Xor_In4( argIndex ) lanes0 = LOAD256u( curData0[argIndex]),\
KeccakP-1600-times4-SIMD256.c: ^
KeccakP-1600-times4-SIMD256.c: KeccakP-1600-times4-SIMD256.c:44:37: note: expanded from macro 'LOAD256u'
KeccakP-1600-times4-SIMD256.c: #define LOAD256u(a) _mm256_loadu_si256((const V256 *)&(a))
KeccakP-1600-times4-SIMD256.c: ^
KeccakP-1600-times4-SIMD256.c: KeccakP-1600-times4-SIMD256.c:146:9: error: always_inline function '_mm256_loadu_si256' requires target feature 'avx', but would be inlined into function 'KeccakP1600times4_AddLanesAll' that is compiled without support for 'avx'
KeccakP-1600-times4-SIMD256.c: KeccakP-1600-times4-SIMD256.c:136:42: note: expanded from macro 'Xor_In4'
KeccakP-1600-times4-SIMD256.c: lanes1 = LOAD256u( curData1[argIndex]),\
KeccakP-1600-times4-SIMD256.c: ^
KeccakP-1600-times4-SIMD256.c: KeccakP-1600-times4-SIMD256.c:44:37: note: expanded from macro 'LOAD256u'
KeccakP-1600-times4-SIMD256.c: #define LOAD256u(a) _mm256_loadu_si256((const V256 *)&(a))
KeccakP-1600-times4-SIMD256.c: ^
KeccakP-1600-times4-SIMD256.c: KeccakP-1600-times4-SIMD256.c:146:9: error: AVX vector return of type '__m256i' (vector of 4 'long long' values) without 'avx' enabled changes the ABI
KeccakP-1600-times4-SIMD256.c: KeccakP-1600-times4-SIMD256.c:136:42: note: expanded from macro 'Xor_In4'
KeccakP-1600-times4-SIMD256.c: ...

Number of similar (compiler,implementation) pairs: 4, namely:
CompilerImplementations
clang -march=native -O2 -fomit-frame-pointer -fwrapv -Qunused-arguments -fPIC -fPIE T:Haswell
clang -march=native -O3 -fomit-frame-pointer -fwrapv -Qunused-arguments -fPIC -fPIE T:Haswell
clang -march=native -O -fomit-frame-pointer -fwrapv -Qunused-arguments -fPIC -fPIE T:Haswell
clang -march=native -Os -fomit-frame-pointer -fwrapv -Qunused-arguments -fPIC -fPIE T:Haswell

Compiler output

Implementation: T:Haswell
Security model: timingleaks
Compiler: clang -mcpu=native -O3 -fomit-frame-pointer -fwrapv -Qunused-arguments -fPIC -fPIE
KeccakP-1600-times2-SIMD128.c: KeccakP-1600-times2-SIMD128.c:801:5: error: always_inline function '_mm_shuffle_epi8' requires target feature 'ssse3', but would be inlined into function 'KeccakP1600times2_PermuteAll_24rounds' that is compiled without support for 'ssse3'
KeccakP-1600-times2-SIMD128.c: rounds24
KeccakP-1600-times2-SIMD128.c: ^
KeccakP-1600-times2-SIMD128.c: ./KeccakP-1600-unrolling.macros:157:9: note: expanded from macro 'rounds24'
KeccakP-1600-times2-SIMD128.c: thetaRhoPiChiIotaPrepareTheta(i , A, E) \
KeccakP-1600-times2-SIMD128.c: ^
KeccakP-1600-times2-SIMD128.c: KeccakP-1600-times2-SIMD128.c:532:11: note: expanded from macro 'thetaRhoPiChiIotaPrepareTheta'
KeccakP-1600-times2-SIMD128.c: Bko = ROL64in128_8(A##mu); \
KeccakP-1600-times2-SIMD128.c: ^
KeccakP-1600-times2-SIMD128.c: KeccakP-1600-times2-SIMD128.c:48:37: note: expanded from macro 'ROL64in128_8'
KeccakP-1600-times2-SIMD128.c: #define ROL64in128_8(a) _mm_shuffle_epi8(a, CONST128(rho8))
KeccakP-1600-times2-SIMD128.c: ^
KeccakP-1600-times2-SIMD128.c: KeccakP-1600-times2-SIMD128.c:801:5: error: always_inline function '_mm_shuffle_epi8' requires target feature 'ssse3', but would be inlined into function 'KeccakP1600times2_PermuteAll_24rounds' that is compiled without support for 'ssse3'
KeccakP-1600-times2-SIMD128.c: ./KeccakP-1600-unrolling.macros:157:9: note: expanded from macro 'rounds24'
KeccakP-1600-times2-SIMD128.c: thetaRhoPiChiIotaPrepareTheta(i , A, E) \
KeccakP-1600-times2-SIMD128.c: ^
KeccakP-1600-times2-SIMD128.c: KeccakP-1600-times2-SIMD128.c:557:11: note: expanded from macro 'thetaRhoPiChiIotaPrepareTheta'
KeccakP-1600-times2-SIMD128.c: Bmu = ROL64in128_56(A##so); \
KeccakP-1600-times2-SIMD128.c: ^
KeccakP-1600-times2-SIMD128.c: KeccakP-1600-times2-SIMD128.c:49:37: note: expanded from macro 'ROL64in128_56'
KeccakP-1600-times2-SIMD128.c: #define ROL64in128_56(a) _mm_shuffle_epi8(a, CONST128(rho56))
KeccakP-1600-times2-SIMD128.c: ^
KeccakP-1600-times2-SIMD128.c: KeccakP-1600-times2-SIMD128.c:801:5: error: always_inline function '_mm_shuffle_epi8' requires target feature 'ssse3', but would be inlined into function 'KeccakP1600times2_PermuteAll_24rounds' that is compiled without support for 'ssse3'
KeccakP-1600-times2-SIMD128.c: ./KeccakP-1600-unrolling.macros:158:9: note: expanded from macro 'rounds24'
KeccakP-1600-times2-SIMD128.c: thetaRhoPiChiIotaPrepareTheta(i+1, E, A) \
KeccakP-1600-times2-SIMD128.c: ...

Number of similar (compiler,implementation) pairs: 2, namely:
CompilerImplementations
clang -mcpu=native -O3 -fomit-frame-pointer -fwrapv -Qunused-arguments -fPIC -fPIE T:Haswell T:Nehalem

Compiler output

Implementation: T:Haswell
Security model: timingleaks
Compiler: gcc -march=native -mtune=native -O2 -fomit-frame-pointer -fwrapv -fPIC -fPIE
KeccakP-1600-times4-SIMD256.c: KeccakP-1600-times4-SIMD256.c: In function 'KeccakP1600times4_AddLanesAll':
KeccakP-1600-times4-SIMD256.c: KeccakP-1600-times4-SIMD256.c:135:40: warning: AVX vector return without AVX enabled changes the ABI [-Wpsabi]
KeccakP-1600-times4-SIMD256.c: 135 | #define Xor_In4( argIndex ) lanes0 = LOAD256u( curData0[argIndex]),\
KeccakP-1600-times4-SIMD256.c: | ^
KeccakP-1600-times4-SIMD256.c: KeccakP-1600-times4-SIMD256.c:146:9: note: in expansion of macro 'Xor_In4'
KeccakP-1600-times4-SIMD256.c: 146 | Xor_In4( 0 );
KeccakP-1600-times4-SIMD256.c: | ^~~~~~~
KeccakP-1600-times4-SIMD256.c: In file included from /usr/lib/gcc/x86_64-linux-gnu/11/include/immintrin.h:47,
KeccakP-1600-times4-SIMD256.c: from KeccakP-1600-times4-SIMD256.c:21:
KeccakP-1600-times4-SIMD256.c: /usr/lib/gcc/x86_64-linux-gnu/11/include/avx2intrin.h:913:1: error: inlining failed in call to 'always_inline' '_mm256_xor_si256': target specific option mismatch
KeccakP-1600-times4-SIMD256.c: 913 | _mm256_xor_si256 (__m256i __A, __m256i __B)
KeccakP-1600-times4-SIMD256.c: | ^~~~~~~~~~~~~~~~
KeccakP-1600-times4-SIMD256.c: KeccakP-1600-times4-SIMD256.c:55:41: note: called from here
KeccakP-1600-times4-SIMD256.c: 55 | #define XOReq256(a, b) a = _mm256_xor_si256(a, b)
KeccakP-1600-times4-SIMD256.c: | ^~~~~~~~~~~~~~~~~~~~~~
KeccakP-1600-times4-SIMD256.c: KeccakP-1600-times4-SIMD256.c:143:33: note: in expansion of macro 'XOReq256'
KeccakP-1600-times4-SIMD256.c: 143 | XOReq256( stateAsLanes[argIndex+3], lanes3 )
KeccakP-1600-times4-SIMD256.c: | ^~~~~~~~
KeccakP-1600-times4-SIMD256.c: KeccakP-1600-times4-SIMD256.c:149:9: note: in expansion of macro 'Xor_In4'
KeccakP-1600-times4-SIMD256.c: 149 | Xor_In4( 12 );
KeccakP-1600-times4-SIMD256.c: | ^~~~~~~
KeccakP-1600-times4-SIMD256.c: In file included from /usr/lib/gcc/x86_64-linux-gnu/11/include/immintrin.h:47,
KeccakP-1600-times4-SIMD256.c: from KeccakP-1600-times4-SIMD256.c:21:
KeccakP-1600-times4-SIMD256.c: /usr/lib/gcc/x86_64-linux-gnu/11/include/avx2intrin.h:913:1: error: inlining failed in call to 'always_inline' '_mm256_xor_si256': target specific option mismatch
KeccakP-1600-times4-SIMD256.c: 913 | _mm256_xor_si256 (__m256i __A, __m256i __B)
KeccakP-1600-times4-SIMD256.c: ...

Number of similar (compiler,implementation) pairs: 4, namely:
CompilerImplementations
gcc -march=native -mtune=native -O2 -fomit-frame-pointer -fwrapv -fPIC -fPIE T:Haswell
gcc -march=native -mtune=native -O3 -fomit-frame-pointer -fwrapv -fPIC -fPIE T:Haswell
gcc -march=native -mtune=native -O -fomit-frame-pointer -fwrapv -fPIC -fPIE T:Haswell
gcc -march=native -mtune=native -Os -fomit-frame-pointer -fwrapv -fPIC -fPIE T:Haswell

Compiler output

Implementation: T:KnightsLanding
Security model: timingleaks
Compiler: clang -march=native -O2 -fomit-frame-pointer -fwrapv -Qunused-arguments -fPIC -fPIE
KeccakP-1600-AVX512.c: KeccakP-1600-AVX512.c:476:5: error: always_inline function '_mm512_set_epi64' requires target feature 'avx512f', but would be inlined into function 'KeccakP1600_Permute_12rounds' that is compiled without support for 'avx512f'
KeccakP-1600-AVX512.c: KeccakP_DeclareVars
KeccakP-1600-AVX512.c: ^
KeccakP-1600-AVX512.c: KeccakP-1600-AVX512.c:292:23: note: expanded from macro 'KeccakP_DeclareVars'
KeccakP-1600-AVX512.c: V512 moveThetaPrev = _mm512_setr_epi64(4, 0, 1, 2, 3, 5, 6, 7); \
KeccakP-1600-AVX512.c: ^
KeccakP-1600-AVX512.c: /usr/lib/llvm-14/lib/clang/14.0.0/include/avx512fintrin.h:9250:3: note: expanded from macro '_mm512_setr_epi64'
KeccakP-1600-AVX512.c: _mm512_set_epi64((e7),(e6),(e5),(e4),(e3),(e2),(e1),(e0))
KeccakP-1600-AVX512.c: ^
KeccakP-1600-AVX512.c: KeccakP-1600-AVX512.c:476:5: error: AVX vector return of type '__m512i' (vector of 8 'long long' values) without 'avx512f' enabled changes the ABI
KeccakP-1600-AVX512.c: KeccakP-1600-AVX512.c:292:23: note: expanded from macro 'KeccakP_DeclareVars'
KeccakP-1600-AVX512.c: V512 moveThetaPrev = _mm512_setr_epi64(4, 0, 1, 2, 3, 5, 6, 7); \
KeccakP-1600-AVX512.c: ^
KeccakP-1600-AVX512.c: /usr/lib/llvm-14/lib/clang/14.0.0/include/avx512fintrin.h:9250:3: note: expanded from macro '_mm512_setr_epi64'
KeccakP-1600-AVX512.c: _mm512_set_epi64((e7),(e6),(e5),(e4),(e3),(e2),(e1),(e0))
KeccakP-1600-AVX512.c: ^
KeccakP-1600-AVX512.c: KeccakP-1600-AVX512.c:476:5: error: always_inline function '_mm512_set_epi64' requires target feature 'avx512f', but would be inlined into function 'KeccakP1600_Permute_12rounds' that is compiled without support for 'avx512f'
KeccakP-1600-AVX512.c: KeccakP-1600-AVX512.c:293:23: note: expanded from macro 'KeccakP_DeclareVars'
KeccakP-1600-AVX512.c: V512 moveThetaNext = _mm512_setr_epi64(1, 2, 3, 4, 0, 5, 6, 7); \
KeccakP-1600-AVX512.c: ^
KeccakP-1600-AVX512.c: /usr/lib/llvm-14/lib/clang/14.0.0/include/avx512fintrin.h:9250:3: note: expanded from macro '_mm512_setr_epi64'
KeccakP-1600-AVX512.c: _mm512_set_epi64((e7),(e6),(e5),(e4),(e3),(e2),(e1),(e0))
KeccakP-1600-AVX512.c: ^
KeccakP-1600-AVX512.c: KeccakP-1600-AVX512.c:476:5: error: AVX vector return of type '__m512i' (vector of 8 'long long' values) without 'avx512f' enabled changes the ABI
KeccakP-1600-AVX512.c: KeccakP-1600-AVX512.c:293:23: note: expanded from macro 'KeccakP_DeclareVars'
KeccakP-1600-AVX512.c: ...

Number of similar (compiler,implementation) pairs: 5, namely:
CompilerImplementations
clang -march=native -O2 -fomit-frame-pointer -fwrapv -Qunused-arguments -fPIC -fPIE T:KnightsLanding
clang -march=native -O3 -fomit-frame-pointer -fwrapv -Qunused-arguments -fPIC -fPIE T:KnightsLanding
clang -march=native -O -fomit-frame-pointer -fwrapv -Qunused-arguments -fPIC -fPIE T:KnightsLanding
clang -march=native -Os -fomit-frame-pointer -fwrapv -Qunused-arguments -fPIC -fPIE T:KnightsLanding
clang -mcpu=native -O3 -fomit-frame-pointer -fwrapv -Qunused-arguments -fPIC -fPIE T:KnightsLanding

Compiler output

Implementation: T:KnightsLanding
Security model: timingleaks
Compiler: gcc -march=native -mtune=native -O2 -fomit-frame-pointer -fwrapv -fPIC -fPIE
KeccakP-1600-AVX512.c: KeccakP-1600-AVX512.c: In function 'KeccakP1600_Permute_12rounds':
KeccakP-1600-AVX512.c: KeccakP-1600-AVX512.c:292:17: warning: AVX512F vector return without AVX512F enabled changes the ABI [-Wpsabi]
KeccakP-1600-AVX512.c: 292 | V512 moveThetaPrev = _mm512_setr_epi64(4, 0, 1, 2, 3, 5, 6, 7); \
KeccakP-1600-AVX512.c: | ^~~~~~~~~~~~~
KeccakP-1600-AVX512.c: KeccakP-1600-AVX512.c:476:5: note: in expansion of macro 'KeccakP_DeclareVars'
KeccakP-1600-AVX512.c: 476 | KeccakP_DeclareVars
KeccakP-1600-AVX512.c: | ^~~~~~~~~~~~~~~~~~~
KeccakP-1600-AVX512.c: In file included from /usr/lib/gcc/x86_64-linux-gnu/11/include/immintrin.h:49,
KeccakP-1600-AVX512.c: from KeccakP-1600-AVX512.c:26:
KeccakP-1600-AVX512.c: /usr/lib/gcc/x86_64-linux-gnu/11/include/avx512fintrin.h:6440:1: error: inlining failed in call to 'always_inline' '_mm512_mask_storeu_epi64': target specific option mismatch
KeccakP-1600-AVX512.c: 6440 | _mm512_mask_storeu_epi64 (void *__P, __mmask8 __U, __m512i __A)
KeccakP-1600-AVX512.c: | ^~~~~~~~~~~~~~~~~~~~~~~~
KeccakP-1600-AVX512.c: KeccakP-1600-AVX512.c:213:49: note: called from here
KeccakP-1600-AVX512.c: 213 | #define STORE_Plane(a,v) _mm512_mask_storeu_epi64( a, 0x1F, v)
KeccakP-1600-AVX512.c: | ^~~~~~~~~~~~~~~~~~~~~~~~~~~~~~~~~~~~~
KeccakP-1600-AVX512.c: KeccakP-1600-AVX512.c:322:5: note: in expansion of macro 'STORE_Plane'
KeccakP-1600-AVX512.c: 322 | STORE_Plane(pState+20, Saeiou);
KeccakP-1600-AVX512.c: | ^~~~~~~~~~~
KeccakP-1600-AVX512.c: KeccakP-1600-AVX512.c:484:5: note: in expansion of macro 'copyToState'
KeccakP-1600-AVX512.c: 484 | copyToState(stateAsLanes);
KeccakP-1600-AVX512.c: | ^~~~~~~~~~~
KeccakP-1600-AVX512.c: In file included from /usr/lib/gcc/x86_64-linux-gnu/11/include/immintrin.h:49,
KeccakP-1600-AVX512.c: from KeccakP-1600-AVX512.c:26:
KeccakP-1600-AVX512.c: /usr/lib/gcc/x86_64-linux-gnu/11/include/avx512fintrin.h:6440:1: error: inlining failed in call to 'always_inline' '_mm512_mask_storeu_epi64': target specific option mismatch
KeccakP-1600-AVX512.c: 6440 | _mm512_mask_storeu_epi64 (void *__P, __mmask8 __U, __m512i __A)
KeccakP-1600-AVX512.c: ...

Number of similar (compiler,implementation) pairs: 4, namely:
CompilerImplementations
gcc -march=native -mtune=native -O2 -fomit-frame-pointer -fwrapv -fPIC -fPIE T:KnightsLanding
gcc -march=native -mtune=native -O3 -fomit-frame-pointer -fwrapv -fPIC -fPIE T:KnightsLanding
gcc -march=native -mtune=native -O -fomit-frame-pointer -fwrapv -fPIC -fPIE T:KnightsLanding
gcc -march=native -mtune=native -Os -fomit-frame-pointer -fwrapv -fPIC -fPIE T:KnightsLanding

Compiler output

Implementation: T:SandyBridge
Security model: timingleaks
Compiler: clang -mcpu=native -O3 -fomit-frame-pointer -fwrapv -Qunused-arguments -fPIC -fPIE
KeccakP-1600-times2-SIMD128.c: KeccakP-1600-times2-SIMD128.c:801:5: error: always_inline function '_mm_shuffle_epi8' requires target feature 'ssse3', but would be inlined into function 'KeccakP1600times2_PermuteAll_24rounds' that is compiled without support for 'ssse3'
KeccakP-1600-times2-SIMD128.c: rounds24
KeccakP-1600-times2-SIMD128.c: ^
KeccakP-1600-times2-SIMD128.c: ./KeccakP-1600-unrolling.macros:19:5: note: expanded from macro 'rounds24'
KeccakP-1600-times2-SIMD128.c: thetaRhoPiChiIotaPrepareTheta( 0, A, E) \
KeccakP-1600-times2-SIMD128.c: ^
KeccakP-1600-times2-SIMD128.c: KeccakP-1600-times2-SIMD128.c:532:11: note: expanded from macro 'thetaRhoPiChiIotaPrepareTheta'
KeccakP-1600-times2-SIMD128.c: Bko = ROL64in128_8(A##mu); \
KeccakP-1600-times2-SIMD128.c: ^
KeccakP-1600-times2-SIMD128.c: KeccakP-1600-times2-SIMD128.c:48:37: note: expanded from macro 'ROL64in128_8'
KeccakP-1600-times2-SIMD128.c: #define ROL64in128_8(a) _mm_shuffle_epi8(a, CONST128(rho8))
KeccakP-1600-times2-SIMD128.c: ^
KeccakP-1600-times2-SIMD128.c: KeccakP-1600-times2-SIMD128.c:801:5: error: always_inline function '_mm_shuffle_epi8' requires target feature 'ssse3', but would be inlined into function 'KeccakP1600times2_PermuteAll_24rounds' that is compiled without support for 'ssse3'
KeccakP-1600-times2-SIMD128.c: ./KeccakP-1600-unrolling.macros:19:5: note: expanded from macro 'rounds24'
KeccakP-1600-times2-SIMD128.c: thetaRhoPiChiIotaPrepareTheta( 0, A, E) \
KeccakP-1600-times2-SIMD128.c: ^
KeccakP-1600-times2-SIMD128.c: KeccakP-1600-times2-SIMD128.c:557:11: note: expanded from macro 'thetaRhoPiChiIotaPrepareTheta'
KeccakP-1600-times2-SIMD128.c: Bmu = ROL64in128_56(A##so); \
KeccakP-1600-times2-SIMD128.c: ^
KeccakP-1600-times2-SIMD128.c: KeccakP-1600-times2-SIMD128.c:49:37: note: expanded from macro 'ROL64in128_56'
KeccakP-1600-times2-SIMD128.c: #define ROL64in128_56(a) _mm_shuffle_epi8(a, CONST128(rho56))
KeccakP-1600-times2-SIMD128.c: ^
KeccakP-1600-times2-SIMD128.c: KeccakP-1600-times2-SIMD128.c:801:5: error: always_inline function '_mm_shuffle_epi8' requires target feature 'ssse3', but would be inlined into function 'KeccakP1600times2_PermuteAll_24rounds' that is compiled without support for 'ssse3'
KeccakP-1600-times2-SIMD128.c: ./KeccakP-1600-unrolling.macros:20:5: note: expanded from macro 'rounds24'
KeccakP-1600-times2-SIMD128.c: thetaRhoPiChiIotaPrepareTheta( 1, E, A) \
KeccakP-1600-times2-SIMD128.c: ...

Number of similar (compiler,implementation) pairs: 1, namely:
CompilerImplementations
clang -mcpu=native -O3 -fomit-frame-pointer -fwrapv -Qunused-arguments -fPIC -fPIE T:SandyBridge

Compiler output

Implementation: T:asmX86-64
Security model: timingleaks
Compiler: clang -march=native -O2 -fomit-frame-pointer -fwrapv -Qunused-arguments -fPIC -fPIE
try.c: /usr/bin/ld: libcrypto_aead_lakekeyakv2.a(KeccakP-1600-x86-64-gas.o): relocation R_X86_64_32S against `.text' can not be used when making a PIE object; recompile with -fPIE
try.c: /usr/bin/ld: failed to set dynamic section sizes: bad value
try.c: clang: error: linker command failed with exit code 1 (use -v to see invocation)

Number of similar (compiler,implementation) pairs: 5, namely:
CompilerImplementations
clang -march=native -O2 -fomit-frame-pointer -fwrapv -Qunused-arguments -fPIC -fPIE T:asmX86-64
clang -march=native -O3 -fomit-frame-pointer -fwrapv -Qunused-arguments -fPIC -fPIE T:asmX86-64
clang -march=native -O -fomit-frame-pointer -fwrapv -Qunused-arguments -fPIC -fPIE T:asmX86-64
clang -march=native -Os -fomit-frame-pointer -fwrapv -Qunused-arguments -fPIC -fPIE T:asmX86-64
clang -mcpu=native -O3 -fomit-frame-pointer -fwrapv -Qunused-arguments -fPIC -fPIE T:asmX86-64

Compiler output

Implementation: T:asmX86-64
Security model: timingleaks
Compiler: gcc -march=native -mtune=native -O2 -fomit-frame-pointer -fwrapv -fPIC -fPIE
try.c: /usr/bin/ld: libcrypto_aead_lakekeyakv2.a(KeccakP-1600-x86-64-gas.o): relocation R_X86_64_32S against `.text' can not be used when making a PIE object; recompile with -fPIE
try.c: /usr/bin/ld: failed to set dynamic section sizes: bad value
try.c: collect2: error: ld returned 1 exit status

Number of similar (compiler,implementation) pairs: 4, namely:
CompilerImplementations
gcc -march=native -mtune=native -O2 -fomit-frame-pointer -fwrapv -fPIC -fPIE T:asmX86-64
gcc -march=native -mtune=native -O3 -fomit-frame-pointer -fwrapv -fPIC -fPIE T:asmX86-64
gcc -march=native -mtune=native -O -fomit-frame-pointer -fwrapv -fPIC -fPIE T:asmX86-64
gcc -march=native -mtune=native -Os -fomit-frame-pointer -fwrapv -fPIC -fPIE T:asmX86-64

Compiler output

Implementation: T:asmX86-64shld
Security model: timingleaks
Compiler: clang -march=native -O2 -fomit-frame-pointer -fwrapv -Qunused-arguments -fPIC -fPIE
try.c: /usr/bin/ld: libcrypto_aead_lakekeyakv2.a(KeccakP-1600-x86-64-shld-gas.o): relocation R_X86_64_32S against `.text' can not be used when making a PIE object; recompile with -fPIE
try.c: /usr/bin/ld: failed to set dynamic section sizes: bad value
try.c: clang: error: linker command failed with exit code 1 (use -v to see invocation)

Number of similar (compiler,implementation) pairs: 5, namely:
CompilerImplementations
clang -march=native -O2 -fomit-frame-pointer -fwrapv -Qunused-arguments -fPIC -fPIE T:asmX86-64shld
clang -march=native -O3 -fomit-frame-pointer -fwrapv -Qunused-arguments -fPIC -fPIE T:asmX86-64shld
clang -march=native -O -fomit-frame-pointer -fwrapv -Qunused-arguments -fPIC -fPIE T:asmX86-64shld
clang -march=native -Os -fomit-frame-pointer -fwrapv -Qunused-arguments -fPIC -fPIE T:asmX86-64shld
clang -mcpu=native -O3 -fomit-frame-pointer -fwrapv -Qunused-arguments -fPIC -fPIE T:asmX86-64shld

Compiler output

Implementation: T:asmX86-64shld
Security model: timingleaks
Compiler: gcc -march=native -mtune=native -O2 -fomit-frame-pointer -fwrapv -fPIC -fPIE
try.c: /usr/bin/ld: libcrypto_aead_lakekeyakv2.a(KeccakP-1600-x86-64-shld-gas.o): relocation R_X86_64_32S against `.text' can not be used when making a PIE object; recompile with -fPIE
try.c: /usr/bin/ld: failed to set dynamic section sizes: bad value
try.c: collect2: error: ld returned 1 exit status

Number of similar (compiler,implementation) pairs: 4, namely:
CompilerImplementations
gcc -march=native -mtune=native -O2 -fomit-frame-pointer -fwrapv -fPIC -fPIE T:asmX86-64shld
gcc -march=native -mtune=native -O3 -fomit-frame-pointer -fwrapv -fPIC -fPIE T:asmX86-64shld
gcc -march=native -mtune=native -O -fomit-frame-pointer -fwrapv -fPIC -fPIE T:asmX86-64shld
gcc -march=native -mtune=native -Os -fomit-frame-pointer -fwrapv -fPIC -fPIE T:asmX86-64shld

Compiler output

Implementation: T:compact
Security model: timingleaks
Compiler: clang -march=native -O2 -fomit-frame-pointer -fwrapv -Qunused-arguments -fPIC -fPIE
KeccakP-200-compact.c: KeccakP-200-compact.c:20:36: warning: '/*' within block comment [-Wcomment]
KeccakP-200-compact.c: /* #define DIVISION_INSTRUCTION /* comment if no division instruction or more compact when not using division */
KeccakP-200-compact.c: ^
KeccakP-200-compact.c: 1 warning generated.
KeccakP-800-compact.c: KeccakP-800-compact.c:27:36: warning: '/*' within block comment [-Wcomment]
KeccakP-800-compact.c: /* #define DIVISION_INSTRUCTION /* comment if no division instruction or more compact when not using division */
KeccakP-800-compact.c: ^
KeccakP-800-compact.c: 1 warning generated.

Number of similar (compiler,implementation) pairs: 5, namely:
CompilerImplementations
clang -march=native -O2 -fomit-frame-pointer -fwrapv -Qunused-arguments -fPIC -fPIE T:compact
clang -march=native -O3 -fomit-frame-pointer -fwrapv -Qunused-arguments -fPIC -fPIE T:compact
clang -march=native -O -fomit-frame-pointer -fwrapv -Qunused-arguments -fPIC -fPIE T:compact
clang -march=native -Os -fomit-frame-pointer -fwrapv -Qunused-arguments -fPIC -fPIE T:compact
clang -mcpu=native -O3 -fomit-frame-pointer -fwrapv -Qunused-arguments -fPIC -fPIE T:compact

Compiler output

Implementation: T:ref
Security model: timingleaks
Compiler: clang++ -march=native -O2 -fomit-frame-pointer -fwrapv -Qunused-arguments -fPIC -fPIE
Keyakv2.cpp: In file included from Keyakv2.cpp:16:
Keyakv2.cpp: In file included from ./Keyakv2.h:21:
Keyakv2.cpp: ./Motorist.h:31:5: warning: 'auto_ptr<unsigned char>' is deprecated: use 'std::unique_ptr' instead [-Wdeprecated-declarations]
Keyakv2.cpp: auto_ptr<UINT8> state;
Keyakv2.cpp: ^
Keyakv2.cpp: /usr/bin/../lib/gcc/x86_64-linux-gnu/11/../../../../include/c++/11/backward/auto_ptr.h:287:7: note: 'auto_ptr<unsigned char>' has been explicitly marked deprecated here
Keyakv2.cpp: } _GLIBCXX11_DEPRECATED_SUGGEST("std::unique_ptr");
Keyakv2.cpp: ^
Keyakv2.cpp: /usr/bin/../lib/gcc/x86_64-linux-gnu/11/../../../../include/x86_64-linux-gnu/c++/11/bits/c++config.h:102:45: note: expanded from macro '_GLIBCXX11_DEPRECATED_SUGGEST'
Keyakv2.cpp: # define _GLIBCXX11_DEPRECATED_SUGGEST(ALT) _GLIBCXX_DEPRECATED_SUGGEST(ALT)
Keyakv2.cpp: ^
Keyakv2.cpp: /usr/bin/../lib/gcc/x86_64-linux-gnu/11/../../../../include/x86_64-linux-gnu/c++/11/bits/c++config.h:94:19: note: expanded from macro '_GLIBCXX_DEPRECATED_SUGGEST'
Keyakv2.cpp: __attribute__ ((__deprecated__ ("use '" ALT "' instead")))
Keyakv2.cpp: ^
Keyakv2.cpp: 1 warning generated.
Motorist.cpp: In file included from Motorist.cpp:17:
Motorist.cpp: ./Motorist.h:31:5: warning: 'auto_ptr<unsigned char>' is deprecated: use 'std::unique_ptr' instead [-Wdeprecated-declarations]
Motorist.cpp: auto_ptr<UINT8> state;
Motorist.cpp: ^
Motorist.cpp: /usr/bin/../lib/gcc/x86_64-linux-gnu/11/../../../../include/c++/11/backward/auto_ptr.h:287:7: note: 'auto_ptr<unsigned char>' has been explicitly marked deprecated here
Motorist.cpp: } _GLIBCXX11_DEPRECATED_SUGGEST("std::unique_ptr");
Motorist.cpp: ^
Motorist.cpp: /usr/bin/../lib/gcc/x86_64-linux-gnu/11/../../../../include/x86_64-linux-gnu/c++/11/bits/c++config.h:102:45: note: expanded from macro '_GLIBCXX11_DEPRECATED_SUGGEST'
Motorist.cpp: # define _GLIBCXX11_DEPRECATED_SUGGEST(ALT) _GLIBCXX_DEPRECATED_SUGGEST(ALT)
Motorist.cpp: ^
Motorist.cpp: /usr/bin/../lib/gcc/x86_64-linux-gnu/11/../../../../include/x86_64-linux-gnu/c++/11/bits/c++config.h:94:19: note: expanded from macro '_GLIBCXX_DEPRECATED_SUGGEST'
Motorist.cpp: __attribute__ ((__deprecated__ ("use '" ALT "' instead")))
Motorist.cpp: ^
Motorist.cpp: 1 warning generated.
encrypt.cpp: In file included from encrypt.cpp:22:
encrypt.cpp: In file included from ./Keyakv2.h:21:
encrypt.cpp: ./Motorist.h:31:5: warning: 'auto_ptr<unsigned char>' is deprecated: use 'std::unique_ptr' instead [-Wdeprecated-declarations]
encrypt.cpp: auto_ptr<UINT8> state;
encrypt.cpp: ^
encrypt.cpp: /usr/bin/../lib/gcc/x86_64-linux-gnu/11/../../../../include/c++/11/backward/auto_ptr.h:287:7: note: 'auto_ptr<unsigned char>' has been explicitly marked deprecated here
encrypt.cpp: } _GLIBCXX11_DEPRECATED_SUGGEST("std::unique_ptr");
encrypt.cpp: ^
encrypt.cpp: /usr/bin/../lib/gcc/x86_64-linux-gnu/11/../../../../include/x86_64-linux-gnu/c++/11/bits/c++config.h:102:45: note: expanded from macro '_GLIBCXX11_DEPRECATED_SUGGEST'
encrypt.cpp: # define _GLIBCXX11_DEPRECATED_SUGGEST(ALT) _GLIBCXX_DEPRECATED_SUGGEST(ALT)
encrypt.cpp: ^
encrypt.cpp: /usr/bin/../lib/gcc/x86_64-linux-gnu/11/../../../../include/x86_64-linux-gnu/c++/11/bits/c++config.h:94:19: note: expanded from macro '_GLIBCXX_DEPRECATED_SUGGEST'
encrypt.cpp: __attribute__ ((__deprecated__ ("use '" ALT "' instead")))
encrypt.cpp: ^
encrypt.cpp: 1 warning generated.

Number of similar (compiler,implementation) pairs: 8, namely:
CompilerImplementations
clang++ -march=native -O2 -fomit-frame-pointer -fwrapv -Qunused-arguments -fPIC -fPIE T:ref
clang++ -march=native -O3 -fomit-frame-pointer -fwrapv -Qunused-arguments -fPIC -fPIE T:ref
clang++ -march=native -O -fomit-frame-pointer -fwrapv -Qunused-arguments -fPIC -fPIE T:ref
clang++ -march=native -Os -fomit-frame-pointer -fwrapv -Qunused-arguments -fPIC -fPIE T:ref
clang++ -march=native -O2 -fomit-frame-pointer -fwrapv -Qunused-arguments -fPIC -fPIE T:refnew
clang++ -march=native -O3 -fomit-frame-pointer -fwrapv -Qunused-arguments -fPIC -fPIE T:refnew
clang++ -march=native -O -fomit-frame-pointer -fwrapv -Qunused-arguments -fPIC -fPIE T:refnew
clang++ -march=native -Os -fomit-frame-pointer -fwrapv -Qunused-arguments -fPIC -fPIE T:refnew

Compiler output

Implementation: T:ref
Security model: timingleaks
Compiler: g++ -march=native -mtune=native -O2 -fomit-frame-pointer -fwrapv -fPIC -fPIE
Keyakv2.cpp: In file included from Keyakv2.h:21,
Keyakv2.cpp: from Keyakv2.cpp:16:
Keyakv2.cpp: Motorist.h:31:5: warning: 'template<class> class std::auto_ptr' is deprecated: use 'std::unique_ptr' instead [-Wdeprecated-declarations]
Keyakv2.cpp: 31 | auto_ptr<UINT8> state;
Keyakv2.cpp: | ^~~~~~~~
Keyakv2.cpp: In file included from /usr/include/c++/11/memory:76,
Keyakv2.cpp: from Motorist.h:20,
Keyakv2.cpp: from Keyakv2.h:21,
Keyakv2.cpp: from Keyakv2.cpp:16:
Keyakv2.cpp: /usr/include/c++/11/bits/unique_ptr.h:57:28: note: declared here
Keyakv2.cpp: 57 | template<typename> class auto_ptr;
Keyakv2.cpp: | ^~~~~~~~
Motorist.cpp: In file included from Motorist.cpp:17:
Motorist.cpp: Motorist.h:31:5: warning: 'template<class> class std::auto_ptr' is deprecated: use 'std::unique_ptr' instead [-Wdeprecated-declarations]
Motorist.cpp: 31 | auto_ptr<UINT8> state;
Motorist.cpp: | ^~~~~~~~
Motorist.cpp: In file included from /usr/include/c++/11/memory:76,
Motorist.cpp: from Motorist.h:20,
Motorist.cpp: from Motorist.cpp:17:
Motorist.cpp: /usr/include/c++/11/bits/unique_ptr.h:57:28: note: declared here
Motorist.cpp: 57 | template<typename> class auto_ptr;
Motorist.cpp: | ^~~~~~~~
encrypt.cpp: In file included from Keyakv2.h:21,
encrypt.cpp: from encrypt.cpp:22:
encrypt.cpp: Motorist.h:31:5: warning: 'template<class> class std::auto_ptr' is deprecated: use 'std::unique_ptr' instead [-Wdeprecated-declarations]
encrypt.cpp: 31 | auto_ptr<UINT8> state;
encrypt.cpp: | ^~~~~~~~
encrypt.cpp: In file included from /usr/include/c++/11/memory:76,
encrypt.cpp: from Motorist.h:20,
encrypt.cpp: from Keyakv2.h:21,
encrypt.cpp: from encrypt.cpp:22:
encrypt.cpp: /usr/include/c++/11/bits/unique_ptr.h:57:28: note: declared here
encrypt.cpp: 57 | template<typename> class auto_ptr;
encrypt.cpp: | ^~~~~~~~

Number of similar (compiler,implementation) pairs: 8, namely:
CompilerImplementations
g++ -march=native -mtune=native -O2 -fomit-frame-pointer -fwrapv -fPIC -fPIE T:ref
g++ -march=native -mtune=native -O3 -fomit-frame-pointer -fwrapv -fPIC -fPIE T:ref
g++ -march=native -mtune=native -O -fomit-frame-pointer -fwrapv -fPIC -fPIE T:ref
g++ -march=native -mtune=native -Os -fomit-frame-pointer -fwrapv -fPIC -fPIE T:ref
g++ -march=native -mtune=native -O2 -fomit-frame-pointer -fwrapv -fPIC -fPIE T:refnew
g++ -march=native -mtune=native -O3 -fomit-frame-pointer -fwrapv -fPIC -fPIE T:refnew
g++ -march=native -mtune=native -O -fomit-frame-pointer -fwrapv -fPIC -fPIE T:refnew
g++ -march=native -mtune=native -Os -fomit-frame-pointer -fwrapv -fPIC -fPIE T:refnew