Implementation notes: amd64, h8atom, crypto_aead/aegis128

Computer: h8atom
Architecture: amd64
CPU ID: GenuineIntel-00030661-bfebfbff
SUPERCOP version: 20200618
Operation: crypto_aead
Primitive: aegis128
TimeObject sizeTest sizeImplementationCompilerBenchmark dateSUPERCOP version
1632754728 4096 017619 4888 928refgcc_-march=native_-mtune=native_-O2_-fomit-frame-pointer_-fwrapv_-fPIC_-fPIE2020041120200409
1672724594 4096 019820 4896 928refgcc_-march=native_-mtune=native_-O3_-fomit-frame-pointer_-fwrapv_-fPIC_-fPIE2020041120200409
1785144354 4096 017275 4888 928refgcc_-march=native_-mtune=native_-O_-fomit-frame-pointer_-fwrapv_-fPIC_-fPIE2020041120200409
1813564965 4096 019417 4880 856refclang_-mcpu=native_-O3_-fomit-frame-pointer_-fwrapv_-Qunused-arguments_-fPIC_-fPIE2020041120200409
1818463451 4096 014903 4872 856refclang_-march=native_-Os_-fomit-frame-pointer_-fwrapv_-Qunused-arguments_-fPIC_-fPIE2020041120200409
1844154955 4096 019545 4880 856refclang_-march=native_-O3_-fomit-frame-pointer_-fwrapv_-Qunused-arguments_-fPIC_-fPIE2020041120200409
1851153643 4096 016889 4880 856refclang_-march=native_-O_-fomit-frame-pointer_-fwrapv_-Qunused-arguments_-fPIC_-fPIE2020041120200409
1854093643 4096 016889 4880 856refclang_-march=native_-O2_-fomit-frame-pointer_-fwrapv_-Qunused-arguments_-fPIC_-fPIE2020041120200409

Compiler output

Implementation: aesni
Security model: unknown
Compiler: clang -march=native -O2 -fomit-frame-pointer -fwrapv -Qunused-arguments -fPIC -fPIE
encrypt.c: encrypt.c:34:25: error: always_inline function '_mm_aesenc_si128' requires target feature 'aes', but would be inlined into function 'aegis128_initialization' that is compiled without support for 'aes'
encrypt.c: state[4] = _mm_aesenc_si128(state[3], state[4]);
encrypt.c: ^
encrypt.c: encrypt.c:35:25: error: always_inline function '_mm_aesenc_si128' requires target feature 'aes', but would be inlined into function 'aegis128_initialization' that is compiled without support for 'aes'
encrypt.c: state[3] = _mm_aesenc_si128(state[2], state[3]);
encrypt.c: ^
encrypt.c: encrypt.c:36:25: error: always_inline function '_mm_aesenc_si128' requires target feature 'aes', but would be inlined into function 'aegis128_initialization' that is compiled without support for 'aes'
encrypt.c: state[2] = _mm_aesenc_si128(state[1], state[2]);
encrypt.c: ^
encrypt.c: encrypt.c:37:25: error: always_inline function '_mm_aesenc_si128' requires target feature 'aes', but would be inlined into function 'aegis128_initialization' that is compiled without support for 'aes'
encrypt.c: state[1] = _mm_aesenc_si128(state[0], state[1]);
encrypt.c: ^
encrypt.c: encrypt.c:38:25: error: always_inline function '_mm_aesenc_si128' requires target feature 'aes', but would be inlined into function 'aegis128_initialization' that is compiled without support for 'aes'
encrypt.c: state[0] = _mm_aesenc_si128(tmp, state[0]);
encrypt.c: ^
encrypt.c: 5 errors generated.

Number of similar (compiler,implementation) pairs: 5, namely:
CompilerImplementations
clang -march=native -O2 -fomit-frame-pointer -fwrapv -Qunused-arguments -fPIC -fPIE aesni
clang -march=native -O3 -fomit-frame-pointer -fwrapv -Qunused-arguments -fPIC -fPIE aesni
clang -march=native -O -fomit-frame-pointer -fwrapv -Qunused-arguments -fPIC -fPIE aesni
clang -march=native -Os -fomit-frame-pointer -fwrapv -Qunused-arguments -fPIC -fPIE aesni
clang -mcpu=native -O3 -fomit-frame-pointer -fwrapv -Qunused-arguments -fPIC -fPIE aesni

Compiler output

Implementation: aesni
Security model: unknown
Compiler: gcc -march=native -mtune=native -O2 -fomit-frame-pointer -fwrapv -fPIC -fPIE
encrypt.c: In file included from /usr/lib/gcc/x86_64-linux-gnu/7/include/immintrin.h:39:0,
encrypt.c: from encrypt.c:4:
encrypt.c: encrypt.c: In function 'aegis128_enc_aut_step':
encrypt.c: /usr/lib/gcc/x86_64-linux-gnu/7/include/wmmintrin.h:61:1: error: inlining failed in call to always_inline '_mm_aesenc_si128': target specific option mismatch
encrypt.c: _mm_aesenc_si128 (__m128i __X, __m128i __Y)
encrypt.c: ^~~~~~~~~~~~~~~~
encrypt.c: encrypt.c:108:20: note: called from here
encrypt.c: state[0] = _mm_aesenc_si128(tmp,state[0]);
encrypt.c: ^~~~~~~~~~~~~~~~~~~~~~~~~~~~~~
encrypt.c: In file included from /usr/lib/gcc/x86_64-linux-gnu/7/include/immintrin.h:39:0,
encrypt.c: from encrypt.c:4:
encrypt.c: /usr/lib/gcc/x86_64-linux-gnu/7/include/wmmintrin.h:61:1: error: inlining failed in call to always_inline '_mm_aesenc_si128': target specific option mismatch
encrypt.c: _mm_aesenc_si128 (__m128i __X, __m128i __Y)
encrypt.c: ^~~~~~~~~~~~~~~~
encrypt.c: encrypt.c:107:20: note: called from here
encrypt.c: state[1] = _mm_aesenc_si128(state[0],state[1]);
encrypt.c: ^~~~~~~~~~~~~~~~~~~~~~~~~~~~~~~~~~~
encrypt.c: In file included from /usr/lib/gcc/x86_64-linux-gnu/7/include/immintrin.h:39:0,
encrypt.c: from encrypt.c:4:
encrypt.c: /usr/lib/gcc/x86_64-linux-gnu/7/include/wmmintrin.h:61:1: error: inlining failed in call to always_inline '_mm_aesenc_si128': target specific option mismatch
encrypt.c: _mm_aesenc_si128 (__m128i __X, __m128i __Y)
encrypt.c: ^~~~~~~~~~~~~~~~
encrypt.c: encrypt.c:106:20: note: called from here
encrypt.c: state[2] = _mm_aesenc_si128(state[1],state[2]);
encrypt.c: ^~~~~~~~~~~~~~~~~~~~~~~~~~~~~~~~~~~
encrypt.c: ...

Number of similar (compiler,implementation) pairs: 4, namely:
CompilerImplementations
gcc -march=native -mtune=native -O2 -fomit-frame-pointer -fwrapv -fPIC -fPIE aesni
gcc -march=native -mtune=native -O3 -fomit-frame-pointer -fwrapv -fPIC -fPIE aesni
gcc -march=native -mtune=native -O -fomit-frame-pointer -fwrapv -fPIC -fPIE aesni
gcc -march=native -mtune=native -Os -fomit-frame-pointer -fwrapv -fPIC -fPIE aesni

Compiler output

Implementation: ref
Security model: unknown
Compiler: gcc -march=native -mtune=native -Os -fomit-frame-pointer -fwrapv -fPIC -fPIE
try.c: crypto_aead_aegis128.a(encrypt.o): In function `crypto_aead_aegis128_ref_encrypt':
try.c: encrypt.c:(.text+0x...): undefined reference to `aegis128_enc_aut_step'
try.c: encrypt.c:(.text+0x...): undefined reference to `aegis128_enc_aut_step'
try.c: encrypt.c:(.text+0x...): undefined reference to `aegis128_enc_aut_step'
try.c: encrypt.c:(.text+0x...): undefined reference to `aegis128_enc_aut_step'
try.c: crypto_aead_aegis128.a(encrypt.o): In function `crypto_aead_aegis128_ref_decrypt':
try.c: encrypt.c:(.text+0x...): undefined reference to `aegis128_enc_aut_step'
try.c: crypto_aead_aegis128.a(encrypt.o):encrypt.c:(.text+0x...): more undefined references to `aegis128_enc_aut_step' follow
try.c: crypto_aead_aegis128.a(encrypt.o): In function `crypto_aead_aegis128_ref_decrypt':
try.c: encrypt.c:(.text+0x...): undefined reference to `aegis128_dec_aut_step'
try.c: encrypt.c:(.text+0x...): undefined reference to `aegis128_dec_aut_step'
try.c: collect2: error: ld returned 1 exit status

Number of similar (compiler,implementation) pairs: 1, namely:
CompilerImplementations
gcc -march=native -mtune=native -Os -fomit-frame-pointer -fwrapv -fPIC -fPIE ref

Namespace violations

Implementation: ref
Security model: unknown
Compiler: clang -march=native -O2 -fomit-frame-pointer -fwrapv -Qunused-arguments -fPIC -fPIE
aes.o AESROUND T
aes.o TE0 D
aes.o TE1 D
aes.o TE2 D
aes.o TE3 D
encrypt.o aegis128_initialization T
encrypt.o aegis128_tag_generation T

Number of similar (compiler,implementation) pairs: 8, namely:
CompilerImplementations
clang -march=native -O2 -fomit-frame-pointer -fwrapv -Qunused-arguments -fPIC -fPIE ref
clang -march=native -O3 -fomit-frame-pointer -fwrapv -Qunused-arguments -fPIC -fPIE ref
clang -march=native -O -fomit-frame-pointer -fwrapv -Qunused-arguments -fPIC -fPIE ref
clang -march=native -Os -fomit-frame-pointer -fwrapv -Qunused-arguments -fPIC -fPIE ref
clang -mcpu=native -O3 -fomit-frame-pointer -fwrapv -Qunused-arguments -fPIC -fPIE ref
gcc -march=native -mtune=native -O2 -fomit-frame-pointer -fwrapv -fPIC -fPIE ref
gcc -march=native -mtune=native -O3 -fomit-frame-pointer -fwrapv -fPIC -fPIE ref
gcc -march=native -mtune=native -O -fomit-frame-pointer -fwrapv -fPIC -fPIE ref