Implementation notes: amd64, h6sandy, crypto_sign/mqqsig160

Computer: h6sandy
Microarchitecture: amd64; Sandy Bridge (206a7)
Architecture: amd64
CPU ID: GenuineIntel-000206a7-bfebfbff
SUPERCOP version: 20240425
Operation: crypto_sign
Primitive: mqqsig160

Compiler output

Implementation: T:sse
Security model: timingleaks
Compiler: clang -march=native -O2 -fomit-frame-pointer -fwrapv -Qunused-arguments -fPIC -fPIE
try.c: /usr/bin/ld: libcrypto_sign_mqqsig160.a(keygen.o):(.bss+0x1c0): multiple definition of `lookup_table_private_key'; /tmp/try-small-0b0654.o:(.bss+0x230): first defined here
try.c: /usr/bin/ld: libcrypto_sign_mqqsig160.a(keygen.o):(.bss+0x0): multiple definition of `mqq_a'; /tmp/try-small-0b0654.o:(.bss+0x70): first defined here
try.c: /usr/bin/ld: libcrypto_sign_mqqsig160.a(keygen.o):(.bss+0x60): multiple definition of `cc1'; /tmp/try-small-0b0654.o:(.bss+0xd0): first defined here
try.c: /usr/bin/ld: libcrypto_sign_mqqsig160.a(keygen.o):(.bss+0x70): multiple definition of `cc2'; /tmp/try-small-0b0654.o:(.bss+0xe0): first defined here
try.c: /usr/bin/ld: libcrypto_sign_mqqsig160.a(keygen.o):(.bss+0x80): multiple definition of `mqq_sigma1'; /tmp/try-small-0b0654.o:(.bss+0xf0): first defined here
try.c: /usr/bin/ld: libcrypto_sign_mqqsig160.a(keygen.o):(.bss+0x120): multiple definition of `mqq_sigmaK'; /tmp/try-small-0b0654.o:(.bss+0x190): first defined here
try.c: /usr/bin/ld: libcrypto_sign_mqqsig160.a(mqq-sign.o):(.bss+0x0): multiple definition of `cc1'; /tmp/try-small-0b0654.o:(.bss+0xd0): first defined here
try.c: /usr/bin/ld: libcrypto_sign_mqqsig160.a(mqq-sign.o):(.bss+0x10): multiple definition of `cc2'; /tmp/try-small-0b0654.o:(.bss+0xe0): first defined here
try.c: /usr/bin/ld: libcrypto_sign_mqqsig160.a(mqq-sign.o):(.bss+0x20): multiple definition of `mqq_a'; /tmp/try-small-0b0654.o:(.bss+0x70): first defined here
try.c: /usr/bin/ld: libcrypto_sign_mqqsig160.a(mqq-sign.o):(.bss+0x80): multiple definition of `mqq_sigma1'; /tmp/try-small-0b0654.o:(.bss+0xf0): first defined here
try.c: /usr/bin/ld: libcrypto_sign_mqqsig160.a(mqq-sign.o):(.bss+0x120): multiple definition of `mqq_sigmaK'; /tmp/try-small-0b0654.o:(.bss+0x190): first defined here
try.c: /usr/bin/ld: libcrypto_sign_mqqsig160.a(mqq-sign.o):(.bss+0x1c0): multiple definition of `lookup_table_private_key'; /tmp/try-small-0b0654.o:(.bss+0x230): first defined here
try.c: /usr/bin/ld: libcrypto_sign_mqqsig160.a(mqq-verify.o):(.bss+0x0): multiple definition of `mqq_a'; /tmp/try-small-0b0654.o:(.bss+0x70): first defined here
try.c: /usr/bin/ld: libcrypto_sign_mqqsig160.a(mqq-verify.o):(.bss+0x60): multiple definition of `cc1'; /tmp/try-small-0b0654.o:(.bss+0xd0): first defined here
try.c: /usr/bin/ld: libcrypto_sign_mqqsig160.a(mqq-verify.o):(.bss+0x70): multiple definition of `cc2'; /tmp/try-small-0b0654.o:(.bss+0xe0): first defined here
try.c: /usr/bin/ld: libcrypto_sign_mqqsig160.a(mqq-verify.o):(.bss+0x80): multiple definition of `mqq_sigma1'; /tmp/try-small-0b0654.o:(.bss+0xf0): first defined here
try.c: /usr/bin/ld: libcrypto_sign_mqqsig160.a(mqq-verify.o):(.bss+0x120): multiple definition of `mqq_sigmaK'; /tmp/try-small-0b0654.o:(.bss+0x190): first defined here
try.c: /usr/bin/ld: libcrypto_sign_mqqsig160.a(mqq-verify.o):(.bss+0x1c0): multiple definition of `lookup_table_private_key'; /tmp/try-small-0b0654.o:(.bss+0x230): first defined here
try.c: clang: error: linker command failed with exit code 1 (use -v to see invocation)

Number of similar (compiler,implementation) pairs: 1, namely:
CompilerImplementations
clang -march=native -O2 -fomit-frame-pointer -fwrapv -Qunused-arguments -fPIC -fPIE T:sse

Compiler output

Implementation: T:sse
Security model: timingleaks
Compiler: clang -march=native -O3 -fomit-frame-pointer -fwrapv -Qunused-arguments -fPIC -fPIE
try.c: /usr/bin/ld: libcrypto_sign_mqqsig160.a(keygen.o):(.bss+0x1c0): multiple definition of `lookup_table_private_key'; /tmp/try-small-47e786.o:(.bss+0x230): first defined here
try.c: /usr/bin/ld: libcrypto_sign_mqqsig160.a(keygen.o):(.bss+0x0): multiple definition of `mqq_a'; /tmp/try-small-47e786.o:(.bss+0x70): first defined here
try.c: /usr/bin/ld: libcrypto_sign_mqqsig160.a(keygen.o):(.bss+0x60): multiple definition of `cc1'; /tmp/try-small-47e786.o:(.bss+0xd0): first defined here
try.c: /usr/bin/ld: libcrypto_sign_mqqsig160.a(keygen.o):(.bss+0x70): multiple definition of `cc2'; /tmp/try-small-47e786.o:(.bss+0xe0): first defined here
try.c: /usr/bin/ld: libcrypto_sign_mqqsig160.a(keygen.o):(.bss+0x80): multiple definition of `mqq_sigma1'; /tmp/try-small-47e786.o:(.bss+0xf0): first defined here
try.c: /usr/bin/ld: libcrypto_sign_mqqsig160.a(keygen.o):(.bss+0x120): multiple definition of `mqq_sigmaK'; /tmp/try-small-47e786.o:(.bss+0x190): first defined here
try.c: /usr/bin/ld: libcrypto_sign_mqqsig160.a(mqq-sign.o):(.bss+0x0): multiple definition of `cc1'; /tmp/try-small-47e786.o:(.bss+0xd0): first defined here
try.c: /usr/bin/ld: libcrypto_sign_mqqsig160.a(mqq-sign.o):(.bss+0x10): multiple definition of `cc2'; /tmp/try-small-47e786.o:(.bss+0xe0): first defined here
try.c: /usr/bin/ld: libcrypto_sign_mqqsig160.a(mqq-sign.o):(.bss+0x20): multiple definition of `mqq_a'; /tmp/try-small-47e786.o:(.bss+0x70): first defined here
try.c: /usr/bin/ld: libcrypto_sign_mqqsig160.a(mqq-sign.o):(.bss+0x80): multiple definition of `mqq_sigma1'; /tmp/try-small-47e786.o:(.bss+0xf0): first defined here
try.c: /usr/bin/ld: libcrypto_sign_mqqsig160.a(mqq-sign.o):(.bss+0x120): multiple definition of `mqq_sigmaK'; /tmp/try-small-47e786.o:(.bss+0x190): first defined here
try.c: /usr/bin/ld: libcrypto_sign_mqqsig160.a(mqq-sign.o):(.bss+0x1c0): multiple definition of `lookup_table_private_key'; /tmp/try-small-47e786.o:(.bss+0x230): first defined here
try.c: /usr/bin/ld: libcrypto_sign_mqqsig160.a(mqq-verify.o):(.bss+0x0): multiple definition of `mqq_a'; /tmp/try-small-47e786.o:(.bss+0x70): first defined here
try.c: /usr/bin/ld: libcrypto_sign_mqqsig160.a(mqq-verify.o):(.bss+0x60): multiple definition of `cc1'; /tmp/try-small-47e786.o:(.bss+0xd0): first defined here
try.c: /usr/bin/ld: libcrypto_sign_mqqsig160.a(mqq-verify.o):(.bss+0x70): multiple definition of `cc2'; /tmp/try-small-47e786.o:(.bss+0xe0): first defined here
try.c: /usr/bin/ld: libcrypto_sign_mqqsig160.a(mqq-verify.o):(.bss+0x80): multiple definition of `mqq_sigma1'; /tmp/try-small-47e786.o:(.bss+0xf0): first defined here
try.c: /usr/bin/ld: libcrypto_sign_mqqsig160.a(mqq-verify.o):(.bss+0x120): multiple definition of `mqq_sigmaK'; /tmp/try-small-47e786.o:(.bss+0x190): first defined here
try.c: /usr/bin/ld: libcrypto_sign_mqqsig160.a(mqq-verify.o):(.bss+0x1c0): multiple definition of `lookup_table_private_key'; /tmp/try-small-47e786.o:(.bss+0x230): first defined here
try.c: clang: error: linker command failed with exit code 1 (use -v to see invocation)

Number of similar (compiler,implementation) pairs: 1, namely:
CompilerImplementations
clang -march=native -O3 -fomit-frame-pointer -fwrapv -Qunused-arguments -fPIC -fPIE T:sse

Compiler output

Implementation: T:sse
Security model: timingleaks
Compiler: clang -march=native -O -fomit-frame-pointer -fwrapv -Qunused-arguments -fPIC -fPIE
try.c: /usr/bin/ld: libcrypto_sign_mqqsig160.a(keygen.o):(.bss+0x1c0): multiple definition of `lookup_table_private_key'; /tmp/try-small-0a71a3.o:(.bss+0x230): first defined here
try.c: /usr/bin/ld: libcrypto_sign_mqqsig160.a(keygen.o):(.bss+0x0): multiple definition of `mqq_a'; /tmp/try-small-0a71a3.o:(.bss+0x70): first defined here
try.c: /usr/bin/ld: libcrypto_sign_mqqsig160.a(keygen.o):(.bss+0x60): multiple definition of `cc1'; /tmp/try-small-0a71a3.o:(.bss+0xd0): first defined here
try.c: /usr/bin/ld: libcrypto_sign_mqqsig160.a(keygen.o):(.bss+0x70): multiple definition of `cc2'; /tmp/try-small-0a71a3.o:(.bss+0xe0): first defined here
try.c: /usr/bin/ld: libcrypto_sign_mqqsig160.a(keygen.o):(.bss+0x80): multiple definition of `mqq_sigma1'; /tmp/try-small-0a71a3.o:(.bss+0xf0): first defined here
try.c: /usr/bin/ld: libcrypto_sign_mqqsig160.a(keygen.o):(.bss+0x120): multiple definition of `mqq_sigmaK'; /tmp/try-small-0a71a3.o:(.bss+0x190): first defined here
try.c: /usr/bin/ld: libcrypto_sign_mqqsig160.a(mqq-sign.o):(.bss+0x0): multiple definition of `cc1'; /tmp/try-small-0a71a3.o:(.bss+0xd0): first defined here
try.c: /usr/bin/ld: libcrypto_sign_mqqsig160.a(mqq-sign.o):(.bss+0x10): multiple definition of `cc2'; /tmp/try-small-0a71a3.o:(.bss+0xe0): first defined here
try.c: /usr/bin/ld: libcrypto_sign_mqqsig160.a(mqq-sign.o):(.bss+0x20): multiple definition of `mqq_a'; /tmp/try-small-0a71a3.o:(.bss+0x70): first defined here
try.c: /usr/bin/ld: libcrypto_sign_mqqsig160.a(mqq-sign.o):(.bss+0x80): multiple definition of `mqq_sigma1'; /tmp/try-small-0a71a3.o:(.bss+0xf0): first defined here
try.c: /usr/bin/ld: libcrypto_sign_mqqsig160.a(mqq-sign.o):(.bss+0x120): multiple definition of `mqq_sigmaK'; /tmp/try-small-0a71a3.o:(.bss+0x190): first defined here
try.c: /usr/bin/ld: libcrypto_sign_mqqsig160.a(mqq-sign.o):(.bss+0x1c0): multiple definition of `lookup_table_private_key'; /tmp/try-small-0a71a3.o:(.bss+0x230): first defined here
try.c: /usr/bin/ld: libcrypto_sign_mqqsig160.a(mqq-verify.o):(.bss+0x0): multiple definition of `mqq_a'; /tmp/try-small-0a71a3.o:(.bss+0x70): first defined here
try.c: /usr/bin/ld: libcrypto_sign_mqqsig160.a(mqq-verify.o):(.bss+0x60): multiple definition of `cc1'; /tmp/try-small-0a71a3.o:(.bss+0xd0): first defined here
try.c: /usr/bin/ld: libcrypto_sign_mqqsig160.a(mqq-verify.o):(.bss+0x70): multiple definition of `cc2'; /tmp/try-small-0a71a3.o:(.bss+0xe0): first defined here
try.c: /usr/bin/ld: libcrypto_sign_mqqsig160.a(mqq-verify.o):(.bss+0x80): multiple definition of `mqq_sigma1'; /tmp/try-small-0a71a3.o:(.bss+0xf0): first defined here
try.c: /usr/bin/ld: libcrypto_sign_mqqsig160.a(mqq-verify.o):(.bss+0x120): multiple definition of `mqq_sigmaK'; /tmp/try-small-0a71a3.o:(.bss+0x190): first defined here
try.c: /usr/bin/ld: libcrypto_sign_mqqsig160.a(mqq-verify.o):(.bss+0x1c0): multiple definition of `lookup_table_private_key'; /tmp/try-small-0a71a3.o:(.bss+0x230): first defined here
try.c: clang: error: linker command failed with exit code 1 (use -v to see invocation)

Number of similar (compiler,implementation) pairs: 1, namely:
CompilerImplementations
clang -march=native -O -fomit-frame-pointer -fwrapv -Qunused-arguments -fPIC -fPIE T:sse

Compiler output

Implementation: T:sse
Security model: timingleaks
Compiler: clang -march=native -Os -fomit-frame-pointer -fwrapv -Qunused-arguments -fPIC -fPIE
try.c: /usr/bin/ld: libcrypto_sign_mqqsig160.a(keygen.o):(.bss+0x1c0): multiple definition of `lookup_table_private_key'; /tmp/try-small-477669.o:(.bss+0x230): first defined here
try.c: /usr/bin/ld: libcrypto_sign_mqqsig160.a(keygen.o):(.bss+0x0): multiple definition of `mqq_a'; /tmp/try-small-477669.o:(.bss+0x70): first defined here
try.c: /usr/bin/ld: libcrypto_sign_mqqsig160.a(keygen.o):(.bss+0x60): multiple definition of `cc1'; /tmp/try-small-477669.o:(.bss+0xd0): first defined here
try.c: /usr/bin/ld: libcrypto_sign_mqqsig160.a(keygen.o):(.bss+0x70): multiple definition of `cc2'; /tmp/try-small-477669.o:(.bss+0xe0): first defined here
try.c: /usr/bin/ld: libcrypto_sign_mqqsig160.a(keygen.o):(.bss+0x80): multiple definition of `mqq_sigma1'; /tmp/try-small-477669.o:(.bss+0xf0): first defined here
try.c: /usr/bin/ld: libcrypto_sign_mqqsig160.a(keygen.o):(.bss+0x120): multiple definition of `mqq_sigmaK'; /tmp/try-small-477669.o:(.bss+0x190): first defined here
try.c: /usr/bin/ld: libcrypto_sign_mqqsig160.a(mqq-sign.o):(.bss+0x0): multiple definition of `cc1'; /tmp/try-small-477669.o:(.bss+0xd0): first defined here
try.c: /usr/bin/ld: libcrypto_sign_mqqsig160.a(mqq-sign.o):(.bss+0x10): multiple definition of `cc2'; /tmp/try-small-477669.o:(.bss+0xe0): first defined here
try.c: /usr/bin/ld: libcrypto_sign_mqqsig160.a(mqq-sign.o):(.bss+0x20): multiple definition of `mqq_a'; /tmp/try-small-477669.o:(.bss+0x70): first defined here
try.c: /usr/bin/ld: libcrypto_sign_mqqsig160.a(mqq-sign.o):(.bss+0x80): multiple definition of `mqq_sigma1'; /tmp/try-small-477669.o:(.bss+0xf0): first defined here
try.c: /usr/bin/ld: libcrypto_sign_mqqsig160.a(mqq-sign.o):(.bss+0x120): multiple definition of `mqq_sigmaK'; /tmp/try-small-477669.o:(.bss+0x190): first defined here
try.c: /usr/bin/ld: libcrypto_sign_mqqsig160.a(mqq-sign.o):(.bss+0x1c0): multiple definition of `lookup_table_private_key'; /tmp/try-small-477669.o:(.bss+0x230): first defined here
try.c: /usr/bin/ld: libcrypto_sign_mqqsig160.a(mqq-verify.o):(.bss+0x0): multiple definition of `mqq_a'; /tmp/try-small-477669.o:(.bss+0x70): first defined here
try.c: /usr/bin/ld: libcrypto_sign_mqqsig160.a(mqq-verify.o):(.bss+0x60): multiple definition of `cc1'; /tmp/try-small-477669.o:(.bss+0xd0): first defined here
try.c: /usr/bin/ld: libcrypto_sign_mqqsig160.a(mqq-verify.o):(.bss+0x70): multiple definition of `cc2'; /tmp/try-small-477669.o:(.bss+0xe0): first defined here
try.c: /usr/bin/ld: libcrypto_sign_mqqsig160.a(mqq-verify.o):(.bss+0x80): multiple definition of `mqq_sigma1'; /tmp/try-small-477669.o:(.bss+0xf0): first defined here
try.c: /usr/bin/ld: libcrypto_sign_mqqsig160.a(mqq-verify.o):(.bss+0x120): multiple definition of `mqq_sigmaK'; /tmp/try-small-477669.o:(.bss+0x190): first defined here
try.c: /usr/bin/ld: libcrypto_sign_mqqsig160.a(mqq-verify.o):(.bss+0x1c0): multiple definition of `lookup_table_private_key'; /tmp/try-small-477669.o:(.bss+0x230): first defined here
try.c: clang: error: linker command failed with exit code 1 (use -v to see invocation)

Number of similar (compiler,implementation) pairs: 1, namely:
CompilerImplementations
clang -march=native -Os -fomit-frame-pointer -fwrapv -Qunused-arguments -fPIC -fPIE T:sse

Compiler output

Implementation: T:sse
Security model: timingleaks
Compiler: clang -mcpu=native -O3 -fomit-frame-pointer -fwrapv -Qunused-arguments -fPIC -fPIE
try.c: /usr/bin/ld: libcrypto_sign_mqqsig160.a(keygen.o):(.bss+0x1c0): multiple definition of `lookup_table_private_key'; /tmp/try-small-8b6dd0.o:(.bss+0x230): first defined here
try.c: /usr/bin/ld: libcrypto_sign_mqqsig160.a(keygen.o):(.bss+0x0): multiple definition of `mqq_a'; /tmp/try-small-8b6dd0.o:(.bss+0x70): first defined here
try.c: /usr/bin/ld: libcrypto_sign_mqqsig160.a(keygen.o):(.bss+0x60): multiple definition of `cc1'; /tmp/try-small-8b6dd0.o:(.bss+0xd0): first defined here
try.c: /usr/bin/ld: libcrypto_sign_mqqsig160.a(keygen.o):(.bss+0x70): multiple definition of `cc2'; /tmp/try-small-8b6dd0.o:(.bss+0xe0): first defined here
try.c: /usr/bin/ld: libcrypto_sign_mqqsig160.a(keygen.o):(.bss+0x80): multiple definition of `mqq_sigma1'; /tmp/try-small-8b6dd0.o:(.bss+0xf0): first defined here
try.c: /usr/bin/ld: libcrypto_sign_mqqsig160.a(keygen.o):(.bss+0x120): multiple definition of `mqq_sigmaK'; /tmp/try-small-8b6dd0.o:(.bss+0x190): first defined here
try.c: /usr/bin/ld: libcrypto_sign_mqqsig160.a(mqq-sign.o):(.bss+0x0): multiple definition of `cc1'; /tmp/try-small-8b6dd0.o:(.bss+0xd0): first defined here
try.c: /usr/bin/ld: libcrypto_sign_mqqsig160.a(mqq-sign.o):(.bss+0x10): multiple definition of `cc2'; /tmp/try-small-8b6dd0.o:(.bss+0xe0): first defined here
try.c: /usr/bin/ld: libcrypto_sign_mqqsig160.a(mqq-sign.o):(.bss+0x20): multiple definition of `mqq_a'; /tmp/try-small-8b6dd0.o:(.bss+0x70): first defined here
try.c: /usr/bin/ld: libcrypto_sign_mqqsig160.a(mqq-sign.o):(.bss+0x80): multiple definition of `mqq_sigma1'; /tmp/try-small-8b6dd0.o:(.bss+0xf0): first defined here
try.c: /usr/bin/ld: libcrypto_sign_mqqsig160.a(mqq-sign.o):(.bss+0x120): multiple definition of `mqq_sigmaK'; /tmp/try-small-8b6dd0.o:(.bss+0x190): first defined here
try.c: /usr/bin/ld: libcrypto_sign_mqqsig160.a(mqq-sign.o):(.bss+0x1c0): multiple definition of `lookup_table_private_key'; /tmp/try-small-8b6dd0.o:(.bss+0x230): first defined here
try.c: /usr/bin/ld: libcrypto_sign_mqqsig160.a(mqq-verify.o):(.bss+0x0): multiple definition of `mqq_a'; /tmp/try-small-8b6dd0.o:(.bss+0x70): first defined here
try.c: /usr/bin/ld: libcrypto_sign_mqqsig160.a(mqq-verify.o):(.bss+0x60): multiple definition of `cc1'; /tmp/try-small-8b6dd0.o:(.bss+0xd0): first defined here
try.c: /usr/bin/ld: libcrypto_sign_mqqsig160.a(mqq-verify.o):(.bss+0x70): multiple definition of `cc2'; /tmp/try-small-8b6dd0.o:(.bss+0xe0): first defined here
try.c: /usr/bin/ld: libcrypto_sign_mqqsig160.a(mqq-verify.o):(.bss+0x80): multiple definition of `mqq_sigma1'; /tmp/try-small-8b6dd0.o:(.bss+0xf0): first defined here
try.c: /usr/bin/ld: libcrypto_sign_mqqsig160.a(mqq-verify.o):(.bss+0x120): multiple definition of `mqq_sigmaK'; /tmp/try-small-8b6dd0.o:(.bss+0x190): first defined here
try.c: /usr/bin/ld: libcrypto_sign_mqqsig160.a(mqq-verify.o):(.bss+0x1c0): multiple definition of `lookup_table_private_key'; /tmp/try-small-8b6dd0.o:(.bss+0x230): first defined here
try.c: clang: error: linker command failed with exit code 1 (use -v to see invocation)

Number of similar (compiler,implementation) pairs: 1, namely:
CompilerImplementations
clang -mcpu=native -O3 -fomit-frame-pointer -fwrapv -Qunused-arguments -fPIC -fPIE T:sse

Compiler output

Implementation: T:sse
Security model: timingleaks
Compiler: gcc -march=native -mtune=native -O2 -fomit-frame-pointer -fwrapv -fPIC -fPIE
try.c: /usr/bin/ld: libcrypto_sign_mqqsig160.a(keygen.o):(.bss+0x0): multiple definition of `lookup_table_private_key'; /tmp/cclsiRNM.o:(.bss+0x20): first defined here
try.c: /usr/bin/ld: libcrypto_sign_mqqsig160.a(keygen.o):(.bss+0x20000): multiple definition of `mqq_sigmaK'; /tmp/cclsiRNM.o:(.bss+0x20020): first defined here
try.c: /usr/bin/ld: libcrypto_sign_mqqsig160.a(keygen.o):(.bss+0x200a0): multiple definition of `mqq_sigma1'; /tmp/cclsiRNM.o:(.bss+0x200c0): first defined here
try.c: /usr/bin/ld: libcrypto_sign_mqqsig160.a(keygen.o):(.bss+0x20140): multiple definition of `cc2'; /tmp/cclsiRNM.o:(.bss+0x20160): first defined here
try.c: /usr/bin/ld: libcrypto_sign_mqqsig160.a(keygen.o):(.bss+0x20150): multiple definition of `cc1'; /tmp/cclsiRNM.o:(.bss+0x20170): first defined here
try.c: /usr/bin/ld: libcrypto_sign_mqqsig160.a(keygen.o):(.bss+0x20160): multiple definition of `mqq_a'; /tmp/cclsiRNM.o:(.bss+0x20180): first defined here
try.c: /usr/bin/ld: libcrypto_sign_mqqsig160.a(mqq-sign.o):(.bss+0x20150): multiple definition of `cc1'; /tmp/cclsiRNM.o:(.bss+0x20170): first defined here
try.c: /usr/bin/ld: libcrypto_sign_mqqsig160.a(mqq-sign.o):(.bss+0x20160): multiple definition of `mqq_a'; /tmp/cclsiRNM.o:(.bss+0x20180): first defined here
try.c: /usr/bin/ld: libcrypto_sign_mqqsig160.a(mqq-sign.o):(.bss+0x20140): multiple definition of `cc2'; /tmp/cclsiRNM.o:(.bss+0x20160): first defined here
try.c: /usr/bin/ld: libcrypto_sign_mqqsig160.a(mqq-sign.o):(.bss+0x20000): multiple definition of `mqq_sigmaK'; /tmp/cclsiRNM.o:(.bss+0x20020): first defined here
try.c: /usr/bin/ld: libcrypto_sign_mqqsig160.a(mqq-sign.o):(.bss+0x200a0): multiple definition of `mqq_sigma1'; /tmp/cclsiRNM.o:(.bss+0x200c0): first defined here
try.c: /usr/bin/ld: libcrypto_sign_mqqsig160.a(mqq-sign.o):(.bss+0x0): multiple definition of `lookup_table_private_key'; /tmp/cclsiRNM.o:(.bss+0x20): first defined here
try.c: /usr/bin/ld: libcrypto_sign_mqqsig160.a(mqq-verify.o):(.bss+0x0): multiple definition of `lookup_table_private_key'; /tmp/cclsiRNM.o:(.bss+0x20): first defined here
try.c: /usr/bin/ld: libcrypto_sign_mqqsig160.a(mqq-verify.o):(.bss+0x20000): multiple definition of `mqq_sigmaK'; /tmp/cclsiRNM.o:(.bss+0x20020): first defined here
try.c: /usr/bin/ld: libcrypto_sign_mqqsig160.a(mqq-verify.o):(.bss+0x200a0): multiple definition of `mqq_sigma1'; /tmp/cclsiRNM.o:(.bss+0x200c0): first defined here
try.c: /usr/bin/ld: libcrypto_sign_mqqsig160.a(mqq-verify.o):(.bss+0x20140): multiple definition of `cc2'; /tmp/cclsiRNM.o:(.bss+0x20160): first defined here
try.c: /usr/bin/ld: libcrypto_sign_mqqsig160.a(mqq-verify.o):(.bss+0x20150): multiple definition of `cc1'; /tmp/cclsiRNM.o:(.bss+0x20170): first defined here
try.c: /usr/bin/ld: libcrypto_sign_mqqsig160.a(mqq-verify.o):(.bss+0x20160): multiple definition of `mqq_a'; /tmp/cclsiRNM.o:(.bss+0x20180): first defined here
try.c: collect2: error: ld returned 1 exit status

Number of similar (compiler,implementation) pairs: 1, namely:
CompilerImplementations
gcc -march=native -mtune=native -O2 -fomit-frame-pointer -fwrapv -fPIC -fPIE T:sse

Compiler output

Implementation: T:sse
Security model: timingleaks
Compiler: gcc -march=native -mtune=native -O3 -fomit-frame-pointer -fwrapv -fPIC -fPIE
try.c: /usr/bin/ld: libcrypto_sign_mqqsig160.a(keygen.o):(.bss+0x0): multiple definition of `lookup_table_private_key'; /tmp/ccUBRnXV.o:(.bss+0x20): first defined here
try.c: /usr/bin/ld: libcrypto_sign_mqqsig160.a(keygen.o):(.bss+0x20000): multiple definition of `mqq_sigmaK'; /tmp/ccUBRnXV.o:(.bss+0x20020): first defined here
try.c: /usr/bin/ld: libcrypto_sign_mqqsig160.a(keygen.o):(.bss+0x200a0): multiple definition of `mqq_sigma1'; /tmp/ccUBRnXV.o:(.bss+0x200c0): first defined here
try.c: /usr/bin/ld: libcrypto_sign_mqqsig160.a(keygen.o):(.bss+0x20140): multiple definition of `cc2'; /tmp/ccUBRnXV.o:(.bss+0x20160): first defined here
try.c: /usr/bin/ld: libcrypto_sign_mqqsig160.a(keygen.o):(.bss+0x20150): multiple definition of `cc1'; /tmp/ccUBRnXV.o:(.bss+0x20170): first defined here
try.c: /usr/bin/ld: libcrypto_sign_mqqsig160.a(keygen.o):(.bss+0x20160): multiple definition of `mqq_a'; /tmp/ccUBRnXV.o:(.bss+0x20180): first defined here
try.c: /usr/bin/ld: libcrypto_sign_mqqsig160.a(mqq-sign.o):(.bss+0x20000): multiple definition of `mqq_sigmaK'; /tmp/ccUBRnXV.o:(.bss+0x20020): first defined here
try.c: /usr/bin/ld: libcrypto_sign_mqqsig160.a(mqq-sign.o):(.bss+0x200a0): multiple definition of `mqq_sigma1'; /tmp/ccUBRnXV.o:(.bss+0x200c0): first defined here
try.c: /usr/bin/ld: libcrypto_sign_mqqsig160.a(mqq-sign.o):(.bss+0x20150): multiple definition of `cc1'; /tmp/ccUBRnXV.o:(.bss+0x20170): first defined here
try.c: /usr/bin/ld: libcrypto_sign_mqqsig160.a(mqq-sign.o):(.bss+0x20140): multiple definition of `cc2'; /tmp/ccUBRnXV.o:(.bss+0x20160): first defined here
try.c: /usr/bin/ld: libcrypto_sign_mqqsig160.a(mqq-sign.o):(.bss+0x20160): multiple definition of `mqq_a'; /tmp/ccUBRnXV.o:(.bss+0x20180): first defined here
try.c: /usr/bin/ld: libcrypto_sign_mqqsig160.a(mqq-sign.o):(.bss+0x0): multiple definition of `lookup_table_private_key'; /tmp/ccUBRnXV.o:(.bss+0x20): first defined here
try.c: /usr/bin/ld: libcrypto_sign_mqqsig160.a(mqq-verify.o):(.bss+0x0): multiple definition of `lookup_table_private_key'; /tmp/ccUBRnXV.o:(.bss+0x20): first defined here
try.c: /usr/bin/ld: libcrypto_sign_mqqsig160.a(mqq-verify.o):(.bss+0x20000): multiple definition of `mqq_sigmaK'; /tmp/ccUBRnXV.o:(.bss+0x20020): first defined here
try.c: /usr/bin/ld: libcrypto_sign_mqqsig160.a(mqq-verify.o):(.bss+0x200a0): multiple definition of `mqq_sigma1'; /tmp/ccUBRnXV.o:(.bss+0x200c0): first defined here
try.c: /usr/bin/ld: libcrypto_sign_mqqsig160.a(mqq-verify.o):(.bss+0x20140): multiple definition of `cc2'; /tmp/ccUBRnXV.o:(.bss+0x20160): first defined here
try.c: /usr/bin/ld: libcrypto_sign_mqqsig160.a(mqq-verify.o):(.bss+0x20150): multiple definition of `cc1'; /tmp/ccUBRnXV.o:(.bss+0x20170): first defined here
try.c: /usr/bin/ld: libcrypto_sign_mqqsig160.a(mqq-verify.o):(.bss+0x20160): multiple definition of `mqq_a'; /tmp/ccUBRnXV.o:(.bss+0x20180): first defined here
try.c: collect2: error: ld returned 1 exit status

Number of similar (compiler,implementation) pairs: 1, namely:
CompilerImplementations
gcc -march=native -mtune=native -O3 -fomit-frame-pointer -fwrapv -fPIC -fPIE T:sse

Compiler output

Implementation: T:sse
Security model: timingleaks
Compiler: gcc -march=native -mtune=native -O -fomit-frame-pointer -fwrapv -fPIC -fPIE
try.c: /usr/bin/ld: libcrypto_sign_mqqsig160.a(keygen.o):(.bss+0x0): multiple definition of `lookup_table_private_key'; /tmp/ccjf4Ya8.o:(.bss+0x20): first defined here
try.c: /usr/bin/ld: libcrypto_sign_mqqsig160.a(keygen.o):(.bss+0x20000): multiple definition of `mqq_sigmaK'; /tmp/ccjf4Ya8.o:(.bss+0x20020): first defined here
try.c: /usr/bin/ld: libcrypto_sign_mqqsig160.a(keygen.o):(.bss+0x200a0): multiple definition of `mqq_sigma1'; /tmp/ccjf4Ya8.o:(.bss+0x200c0): first defined here
try.c: /usr/bin/ld: libcrypto_sign_mqqsig160.a(keygen.o):(.bss+0x20140): multiple definition of `cc2'; /tmp/ccjf4Ya8.o:(.bss+0x20160): first defined here
try.c: /usr/bin/ld: libcrypto_sign_mqqsig160.a(keygen.o):(.bss+0x20150): multiple definition of `cc1'; /tmp/ccjf4Ya8.o:(.bss+0x20170): first defined here
try.c: /usr/bin/ld: libcrypto_sign_mqqsig160.a(keygen.o):(.bss+0x20160): multiple definition of `mqq_a'; /tmp/ccjf4Ya8.o:(.bss+0x20180): first defined here
try.c: /usr/bin/ld: libcrypto_sign_mqqsig160.a(mqq-sign.o):(.bss+0x20000): multiple definition of `mqq_sigmaK'; /tmp/ccjf4Ya8.o:(.bss+0x20020): first defined here
try.c: /usr/bin/ld: libcrypto_sign_mqqsig160.a(mqq-sign.o):(.bss+0x200a0): multiple definition of `mqq_sigma1'; /tmp/ccjf4Ya8.o:(.bss+0x200c0): first defined here
try.c: /usr/bin/ld: libcrypto_sign_mqqsig160.a(mqq-sign.o):(.bss+0x20150): multiple definition of `cc1'; /tmp/ccjf4Ya8.o:(.bss+0x20170): first defined here
try.c: /usr/bin/ld: libcrypto_sign_mqqsig160.a(mqq-sign.o):(.bss+0x20160): multiple definition of `mqq_a'; /tmp/ccjf4Ya8.o:(.bss+0x20180): first defined here
try.c: /usr/bin/ld: libcrypto_sign_mqqsig160.a(mqq-sign.o):(.bss+0x20140): multiple definition of `cc2'; /tmp/ccjf4Ya8.o:(.bss+0x20160): first defined here
try.c: /usr/bin/ld: libcrypto_sign_mqqsig160.a(mqq-sign.o):(.bss+0x0): multiple definition of `lookup_table_private_key'; /tmp/ccjf4Ya8.o:(.bss+0x20): first defined here
try.c: /usr/bin/ld: libcrypto_sign_mqqsig160.a(mqq-verify.o):(.bss+0x0): multiple definition of `lookup_table_private_key'; /tmp/ccjf4Ya8.o:(.bss+0x20): first defined here
try.c: /usr/bin/ld: libcrypto_sign_mqqsig160.a(mqq-verify.o):(.bss+0x20000): multiple definition of `mqq_sigmaK'; /tmp/ccjf4Ya8.o:(.bss+0x20020): first defined here
try.c: /usr/bin/ld: libcrypto_sign_mqqsig160.a(mqq-verify.o):(.bss+0x200a0): multiple definition of `mqq_sigma1'; /tmp/ccjf4Ya8.o:(.bss+0x200c0): first defined here
try.c: /usr/bin/ld: libcrypto_sign_mqqsig160.a(mqq-verify.o):(.bss+0x20140): multiple definition of `cc2'; /tmp/ccjf4Ya8.o:(.bss+0x20160): first defined here
try.c: /usr/bin/ld: libcrypto_sign_mqqsig160.a(mqq-verify.o):(.bss+0x20150): multiple definition of `cc1'; /tmp/ccjf4Ya8.o:(.bss+0x20170): first defined here
try.c: /usr/bin/ld: libcrypto_sign_mqqsig160.a(mqq-verify.o):(.bss+0x20160): multiple definition of `mqq_a'; /tmp/ccjf4Ya8.o:(.bss+0x20180): first defined here
try.c: collect2: error: ld returned 1 exit status

Number of similar (compiler,implementation) pairs: 1, namely:
CompilerImplementations
gcc -march=native -mtune=native -O -fomit-frame-pointer -fwrapv -fPIC -fPIE T:sse

Compiler output

Implementation: T:sse
Security model: timingleaks
Compiler: gcc -march=native -mtune=native -Os -fomit-frame-pointer -fwrapv -fPIC -fPIE
try.c: /usr/bin/ld: libcrypto_sign_mqqsig160.a(keygen.o):(.bss+0x0): multiple definition of `lookup_table_private_key'; /tmp/ccUZBqUu.o:(.bss+0x20): first defined here
try.c: /usr/bin/ld: libcrypto_sign_mqqsig160.a(keygen.o):(.bss+0x20000): multiple definition of `mqq_sigmaK'; /tmp/ccUZBqUu.o:(.bss+0x20020): first defined here
try.c: /usr/bin/ld: libcrypto_sign_mqqsig160.a(keygen.o):(.bss+0x200a0): multiple definition of `mqq_sigma1'; /tmp/ccUZBqUu.o:(.bss+0x200c0): first defined here
try.c: /usr/bin/ld: libcrypto_sign_mqqsig160.a(keygen.o):(.bss+0x20140): multiple definition of `cc2'; /tmp/ccUZBqUu.o:(.bss+0x20160): first defined here
try.c: /usr/bin/ld: libcrypto_sign_mqqsig160.a(keygen.o):(.bss+0x20150): multiple definition of `cc1'; /tmp/ccUZBqUu.o:(.bss+0x20170): first defined here
try.c: /usr/bin/ld: libcrypto_sign_mqqsig160.a(keygen.o):(.bss+0x20160): multiple definition of `mqq_a'; /tmp/ccUZBqUu.o:(.bss+0x20180): first defined here
try.c: /usr/bin/ld: libcrypto_sign_mqqsig160.a(mqq-sign.o):(.bss+0x20000): multiple definition of `mqq_sigmaK'; /tmp/ccUZBqUu.o:(.bss+0x20020): first defined here
try.c: /usr/bin/ld: libcrypto_sign_mqqsig160.a(mqq-sign.o):(.bss+0x200a0): multiple definition of `mqq_sigma1'; /tmp/ccUZBqUu.o:(.bss+0x200c0): first defined here
try.c: /usr/bin/ld: libcrypto_sign_mqqsig160.a(mqq-sign.o):(.bss+0x20150): multiple definition of `cc1'; /tmp/ccUZBqUu.o:(.bss+0x20170): first defined here
try.c: /usr/bin/ld: libcrypto_sign_mqqsig160.a(mqq-sign.o):(.bss+0x20160): multiple definition of `mqq_a'; /tmp/ccUZBqUu.o:(.bss+0x20180): first defined here
try.c: /usr/bin/ld: libcrypto_sign_mqqsig160.a(mqq-sign.o):(.bss+0x20140): multiple definition of `cc2'; /tmp/ccUZBqUu.o:(.bss+0x20160): first defined here
try.c: /usr/bin/ld: libcrypto_sign_mqqsig160.a(mqq-sign.o):(.bss+0x0): multiple definition of `lookup_table_private_key'; /tmp/ccUZBqUu.o:(.bss+0x20): first defined here
try.c: /usr/bin/ld: libcrypto_sign_mqqsig160.a(mqq-verify.o):(.bss+0x0): multiple definition of `lookup_table_private_key'; /tmp/ccUZBqUu.o:(.bss+0x20): first defined here
try.c: /usr/bin/ld: libcrypto_sign_mqqsig160.a(mqq-verify.o):(.bss+0x20000): multiple definition of `mqq_sigmaK'; /tmp/ccUZBqUu.o:(.bss+0x20020): first defined here
try.c: /usr/bin/ld: libcrypto_sign_mqqsig160.a(mqq-verify.o):(.bss+0x200a0): multiple definition of `mqq_sigma1'; /tmp/ccUZBqUu.o:(.bss+0x200c0): first defined here
try.c: /usr/bin/ld: libcrypto_sign_mqqsig160.a(mqq-verify.o):(.bss+0x20140): multiple definition of `cc2'; /tmp/ccUZBqUu.o:(.bss+0x20160): first defined here
try.c: /usr/bin/ld: libcrypto_sign_mqqsig160.a(mqq-verify.o):(.bss+0x20150): multiple definition of `cc1'; /tmp/ccUZBqUu.o:(.bss+0x20170): first defined here
try.c: /usr/bin/ld: libcrypto_sign_mqqsig160.a(mqq-verify.o):(.bss+0x20160): multiple definition of `mqq_a'; /tmp/ccUZBqUu.o:(.bss+0x20180): first defined here
try.c: collect2: error: ld returned 1 exit status

Number of similar (compiler,implementation) pairs: 1, namely:
CompilerImplementations
gcc -march=native -mtune=native -Os -fomit-frame-pointer -fwrapv -fPIC -fPIE T:sse