Implementation notes: amd64, h6sandy, crypto_hash/blake512

Computer: h6sandy
Architecture: amd64
CPU ID: GenuineIntel-000206a7-bfebfbff
SUPERCOP version: 20200618
Operation: crypto_hash
Primitive: blake512
TimeObject sizeTest sizeImplementationCompilerBenchmark dateSUPERCOP version
1647611614 0 024193 776 752ssse3clang_-march=native_-O_-fomit-frame-pointer_-fwrapv_-Qunused-arguments_-fPIC_-fPIE2020041020200409
1673211434 0 021573 768 808sse41gcc_-march=native_-mtune=native_-O_-fomit-frame-pointer_-fwrapv_-fPIC_-fPIE2020041020200409
1680010984 0 019967 768 736sse41clang_-march=native_-Os_-fomit-frame-pointer_-fwrapv_-Qunused-arguments_-fPIC_-fPIE2020041020200409
1690812549 0 026617 776 752sse41clang_-march=native_-O3_-fomit-frame-pointer_-fwrapv_-Qunused-arguments_-fPIC_-fPIE2020041020200409
1811213267 4 20823638 780 1016vect128-inplacegcc_-march=native_-mtune=native_-O2_-fomit-frame-pointer_-fwrapv_-fPIC_-fPIE2020041020200409
1839214488 0 027078 776 808ssse3gcc_-march=native_-mtune=native_-O3_-fomit-frame-pointer_-fwrapv_-fPIC_-fPIE2020041020200409
1870412735 0 021993 752 776ssse3gcc_-march=native_-mtune=native_-Os_-fomit-frame-pointer_-fwrapv_-fPIC_-fPIE2020041020200409
1889611795 0 024369 776 752sse2sclang_-march=native_-O2_-fomit-frame-pointer_-fwrapv_-Qunused-arguments_-fPIC_-fPIE2020041020200409
1906411614 0 024193 776 752ssse3clang_-march=native_-O2_-fomit-frame-pointer_-fwrapv_-Qunused-arguments_-fPIC_-fPIE2020041020200409
1909612910 0 027001 776 752ssse3clang_-march=native_-O3_-fomit-frame-pointer_-fwrapv_-Qunused-arguments_-fPIC_-fPIE2020041020200409
1910413938 0 028025 776 752sse2clang_-march=native_-O3_-fomit-frame-pointer_-fwrapv_-Qunused-arguments_-fPIC_-fPIE2020041020200409
1910412701 0 022829 768 808ssse3gcc_-march=native_-mtune=native_-O_-fomit-frame-pointer_-fwrapv_-fPIC_-fPIE2020041020200409
1911212757 4 20822215 772 984vect128gcc_-march=native_-mtune=native_-Os_-fomit-frame-pointer_-fwrapv_-fPIC_-fPIE2020041020200409
1923211973 0 024529 776 752sse41clang_-march=native_-O_-fomit-frame-pointer_-fwrapv_-Qunused-arguments_-fPIC_-fPIE2020041020200409
1928011973 0 024529 776 752sse41clang_-march=native_-O2_-fomit-frame-pointer_-fwrapv_-Qunused-arguments_-fPIC_-fPIE2020041020200409
1938812953 0 025542 776 808sse41gcc_-march=native_-mtune=native_-O3_-fomit-frame-pointer_-fwrapv_-fPIC_-fPIE2020041020200409
1946014760 0 027350 776 808sse2sgcc_-march=native_-mtune=native_-O3_-fomit-frame-pointer_-fwrapv_-fPIC_-fPIE2020041020200409
1947214711 0 026633 776 736sse2sclang_-mcpu=native_-O3_-fomit-frame-pointer_-fwrapv_-Qunused-arguments_-fPIC_-fPIE2020041020200409
1961212867 4 20823238 780 1016vect128gcc_-march=native_-mtune=native_-O2_-fomit-frame-pointer_-fwrapv_-fPIC_-fPIE2020041020200409
1965615080 4 20827742 780 1016vect128gcc_-march=native_-mtune=native_-O3_-fomit-frame-pointer_-fwrapv_-fPIC_-fPIE2020041020200409
1969614184 0 026761 776 752bswapclang_-march=native_-O_-fomit-frame-pointer_-fwrapv_-Qunused-arguments_-fPIC_-fPIE2020041020200409
1970011517 0 020511 768 736ssse3clang_-march=native_-Os_-fomit-frame-pointer_-fwrapv_-Qunused-arguments_-fPIC_-fPIE2020041020200409
1972013098 0 022361 752 776sse2sgcc_-march=native_-mtune=native_-Os_-fomit-frame-pointer_-fwrapv_-fPIC_-fPIE2020041020200409
1980412995 0 023237 768 808ssse3gcc_-march=native_-mtune=native_-O2_-fomit-frame-pointer_-fwrapv_-fPIC_-fPIE2020041020200409
1982413435 0 022681 752 776sandygcc_-march=native_-mtune=native_-Os_-fomit-frame-pointer_-fwrapv_-fPIC_-fPIE2020041020200409
1992812642 0 025217 776 752sse2clang_-march=native_-O2_-fomit-frame-pointer_-fwrapv_-Qunused-arguments_-fPIC_-fPIE2020041020200409
2004013259 4 20823660 796 1016vect128-inplacegcc_-march=native_-mtune=native_-O_-fomit-frame-pointer_-fwrapv_-fPIC_-fPIE2020041020200409
2015212879 4 20823276 796 1016vect128gcc_-march=native_-mtune=native_-O_-fomit-frame-pointer_-fwrapv_-fPIC_-fPIE2020041020200409
2016411435 0 020697 752 776sse41gcc_-march=native_-mtune=native_-Os_-fomit-frame-pointer_-fwrapv_-fPIC_-fPIE2020041020200409
2022011601 0 021837 768 808sse41gcc_-march=native_-mtune=native_-O2_-fomit-frame-pointer_-fwrapv_-fPIC_-fPIE2020041020200409
2028414024 0 026601 776 752sandyclang_-march=native_-O2_-fomit-frame-pointer_-fwrapv_-Qunused-arguments_-fPIC_-fPIE2020041020200409
2038013267 0 023509 768 808sse2sgcc_-march=native_-mtune=native_-O2_-fomit-frame-pointer_-fwrapv_-fPIC_-fPIE2020041020200409
2040413151 0 023277 768 808sse2sgcc_-march=native_-mtune=native_-O_-fomit-frame-pointer_-fwrapv_-fPIC_-fPIE2020041020200409
2044813091 0 027177 776 752sse2sclang_-march=native_-O3_-fomit-frame-pointer_-fwrapv_-Qunused-arguments_-fPIC_-fPIE2020041020200409
2045213648 0 022913 752 776sse2gcc_-march=native_-mtune=native_-Os_-fomit-frame-pointer_-fwrapv_-fPIC_-fPIE2020041020200409
2072011795 0 024369 776 752sse2sclang_-march=native_-O_-fomit-frame-pointer_-fwrapv_-Qunused-arguments_-fPIC_-fPIE2020041020200409
2076811698 0 020687 768 736sse2sclang_-march=native_-Os_-fomit-frame-pointer_-fwrapv_-Qunused-arguments_-fPIC_-fPIE2020041020200409
2085615480 4 20828142 780 1016vect128-inplacegcc_-march=native_-mtune=native_-O3_-fomit-frame-pointer_-fwrapv_-fPIC_-fPIE2020041020200409
2102013575 0 023709 768 808sse2gcc_-march=native_-mtune=native_-O_-fomit-frame-pointer_-fwrapv_-fPIC_-fPIE2020041020200409
2109214663 0 023655 768 736regsclang_-march=native_-Os_-fomit-frame-pointer_-fwrapv_-Qunused-arguments_-fPIC_-fPIE2020041020200409
2114012545 0 021535 768 736sse2clang_-march=native_-Os_-fomit-frame-pointer_-fwrapv_-Qunused-arguments_-fPIC_-fPIE2020041020200409
2118014085 0 023079 768 736bswapclang_-march=native_-Os_-fomit-frame-pointer_-fwrapv_-Qunused-arguments_-fPIC_-fPIE2020041020200409
2119212642 0 025217 776 752sse2clang_-march=native_-O_-fomit-frame-pointer_-fwrapv_-Qunused-arguments_-fPIC_-fPIE2020041020200409
2135225310 0 034431 768 736sphlibclang_-march=native_-Os_-fomit-frame-pointer_-fwrapv_-Qunused-arguments_-fPIC_-fPIE2020041020200409
2135625460 0 039681 776 752sphlibclang_-march=native_-O3_-fomit-frame-pointer_-fwrapv_-Qunused-arguments_-fPIC_-fPIE2020041020200409
2136015416 0 028006 776 808sse2gcc_-march=native_-mtune=native_-O3_-fomit-frame-pointer_-fwrapv_-fPIC_-fPIE2020041020200409
2146814760 0 027337 776 752regsclang_-march=native_-O2_-fomit-frame-pointer_-fwrapv_-Qunused-arguments_-fPIC_-fPIE2020041020200409
2158014184 0 026761 776 752bswapclang_-march=native_-O2_-fomit-frame-pointer_-fwrapv_-Qunused-arguments_-fPIC_-fPIE2020041020200409
2170816056 0 030145 776 752regsclang_-march=native_-O3_-fomit-frame-pointer_-fwrapv_-Qunused-arguments_-fPIC_-fPIE2020041020200409
2173615352 0 027281 776 736sandyclang_-mcpu=native_-O3_-fomit-frame-pointer_-fwrapv_-Qunused-arguments_-fPIC_-fPIE2020041020200409
2176813923 0 024165 768 808sse2gcc_-march=native_-mtune=native_-O2_-fomit-frame-pointer_-fwrapv_-fPIC_-fPIE2020041020200409
2192015336 0 029425 776 752sandyclang_-march=native_-O3_-fomit-frame-pointer_-fwrapv_-Qunused-arguments_-fPIC_-fPIE2020041020200409
2197613925 0 022919 768 736sandyclang_-march=native_-Os_-fomit-frame-pointer_-fwrapv_-Qunused-arguments_-fPIC_-fPIE2020041020200409
2210814024 0 026601 776 752sandyclang_-march=native_-O_-fomit-frame-pointer_-fwrapv_-Qunused-arguments_-fPIC_-fPIE2020041020200409
2220825428 0 038129 776 752sphlibclang_-march=native_-O_-fomit-frame-pointer_-fwrapv_-Qunused-arguments_-fPIC_-fPIE2020041020200409
2264816584 0 029190 776 808sandygcc_-march=native_-mtune=native_-O3_-fomit-frame-pointer_-fwrapv_-fPIC_-fPIE2020041020200409
2280814987 0 025205 768 808sandygcc_-march=native_-mtune=native_-O2_-fomit-frame-pointer_-fwrapv_-fPIC_-fPIE2020041020200409
2286025428 0 038129 776 752sphlibclang_-march=native_-O2_-fomit-frame-pointer_-fwrapv_-Qunused-arguments_-fPIC_-fPIE2020041020200409
2287612929 4 20822391 772 984vect128-inplacegcc_-march=native_-mtune=native_-Os_-fomit-frame-pointer_-fwrapv_-fPIC_-fPIE2020041020200409
2294016940 0 028873 776 736sse2clang_-mcpu=native_-O3_-fomit-frame-pointer_-fwrapv_-Qunused-arguments_-fPIC_-fPIE2020041020200409
2299214688 0 024813 768 808sandygcc_-march=native_-mtune=native_-O_-fomit-frame-pointer_-fwrapv_-fPIC_-fPIE2020041020200409
2323615496 0 029585 776 752bswapclang_-march=native_-O3_-fomit-frame-pointer_-fwrapv_-Qunused-arguments_-fPIC_-fPIE2020041020200409
2338014760 0 027337 776 752regsclang_-march=native_-O_-fomit-frame-pointer_-fwrapv_-Qunused-arguments_-fPIC_-fPIE2020041020200409
2439213043 0 023165 768 808bswapgcc_-march=native_-mtune=native_-O_-fomit-frame-pointer_-fwrapv_-fPIC_-fPIE2020041020200409
2473623869 0 034174 776 808sphlibgcc_-march=native_-mtune=native_-O_-fomit-frame-pointer_-fwrapv_-fPIC_-fPIE2020041020200409
2504014872 0 027478 776 808bswapgcc_-march=native_-mtune=native_-O3_-fomit-frame-pointer_-fwrapv_-fPIC_-fPIE2020041020200409
2524823510 0 033950 776 808sphlibgcc_-march=native_-mtune=native_-O2_-fomit-frame-pointer_-fwrapv_-fPIC_-fPIE2020041020200409
2574415384 0 027990 776 808regsgcc_-march=native_-mtune=native_-O3_-fomit-frame-pointer_-fwrapv_-fPIC_-fPIE2020041020200409
2607213275 0 023493 768 808bswapgcc_-march=native_-mtune=native_-O2_-fomit-frame-pointer_-fwrapv_-fPIC_-fPIE2020041020200409
2663613319 0 022569 752 776regsgcc_-march=native_-mtune=native_-Os_-fomit-frame-pointer_-fwrapv_-fPIC_-fPIE2020041020200409
2680013891 0 024117 768 808regsgcc_-march=native_-mtune=native_-O2_-fomit-frame-pointer_-fwrapv_-fPIC_-fPIE2020041020200409
2705612707 0 021961 752 776bswapgcc_-march=native_-mtune=native_-Os_-fomit-frame-pointer_-fwrapv_-fPIC_-fPIE2020041020200409
2760427713 0 040406 776 808sphlibgcc_-march=native_-mtune=native_-O3_-fomit-frame-pointer_-fwrapv_-fPIC_-fPIE2020041020200409
2794422805 0 032169 752 776sphlibgcc_-march=native_-mtune=native_-Os_-fomit-frame-pointer_-fwrapv_-fPIC_-fPIE2020041020200409
2863224344 0 036401 776 736sphlibclang_-mcpu=native_-O3_-fomit-frame-pointer_-fwrapv_-Qunused-arguments_-fPIC_-fPIE2020041020200409
2931214821 0 024941 768 808regsgcc_-march=native_-mtune=native_-O_-fomit-frame-pointer_-fwrapv_-fPIC_-fPIE2020041020200409
2948415528 0 027457 776 736regsclang_-mcpu=native_-O3_-fomit-frame-pointer_-fwrapv_-Qunused-arguments_-fPIC_-fPIE2020041020200409
304728401 0 018710 776 808sphlib-smallgcc_-march=native_-mtune=native_-O_-fomit-frame-pointer_-fwrapv_-fPIC_-fPIE2020041020200409
3094815000 0 026929 776 736bswapclang_-mcpu=native_-O3_-fomit-frame-pointer_-fwrapv_-Qunused-arguments_-fPIC_-fPIE2020041020200409
320846200 0 020289 776 752refclang_-march=native_-O3_-fomit-frame-pointer_-fwrapv_-Qunused-arguments_-fPIC_-fPIE2020041020200409
327727494 0 016857 752 776sphlib-smallgcc_-march=native_-mtune=native_-Os_-fomit-frame-pointer_-fwrapv_-fPIC_-fPIE2020041020200409
328048228 0 020945 776 752sphlib-smallclang_-march=native_-O2_-fomit-frame-pointer_-fwrapv_-Qunused-arguments_-fPIC_-fPIE2020041020200409
328168276 0 022513 776 752sphlib-smallclang_-march=native_-O3_-fomit-frame-pointer_-fwrapv_-Qunused-arguments_-fPIC_-fPIE2020041020200409
338963926 0 013177 752 776refgcc_-march=native_-mtune=native_-Os_-fomit-frame-pointer_-fwrapv_-fPIC_-fPIE2020041020200409
341448228 0 020945 776 752sphlib-smallclang_-march=native_-O_-fomit-frame-pointer_-fwrapv_-Qunused-arguments_-fPIC_-fPIE2020041020200409
345447979 0 017103 768 736sphlib-smallclang_-march=native_-Os_-fomit-frame-pointer_-fwrapv_-Qunused-arguments_-fPIC_-fPIE2020041020200409
345484029 0 014141 768 808refgcc_-march=native_-mtune=native_-O_-fomit-frame-pointer_-fwrapv_-fPIC_-fPIE2020041020200409
364444219 0 016793 776 752refclang_-march=native_-O2_-fomit-frame-pointer_-fwrapv_-Qunused-arguments_-fPIC_-fPIE2020041020200409
378005125 0 017057 776 736refclang_-mcpu=native_-O3_-fomit-frame-pointer_-fwrapv_-Qunused-arguments_-fPIC_-fPIE2020041020200409
382969878 0 020318 776 808sphlib-smallgcc_-march=native_-mtune=native_-O2_-fomit-frame-pointer_-fwrapv_-fPIC_-fPIE2020041020200409
385564038 0 013031 768 736refclang_-march=native_-Os_-fomit-frame-pointer_-fwrapv_-Qunused-arguments_-fPIC_-fPIE2020041020200409
386404219 0 016793 776 752refclang_-march=native_-O_-fomit-frame-pointer_-fwrapv_-Qunused-arguments_-fPIC_-fPIE2020041020200409
3978013849 0 026542 776 808sphlib-smallgcc_-march=native_-mtune=native_-O3_-fomit-frame-pointer_-fwrapv_-fPIC_-fPIE2020041020200409
413248312 0 020385 776 736sphlib-smallclang_-mcpu=native_-O3_-fomit-frame-pointer_-fwrapv_-Qunused-arguments_-fPIC_-fPIE2020041020200409
420528071 0 020630 776 808refgcc_-march=native_-mtune=native_-O3_-fomit-frame-pointer_-fwrapv_-fPIC_-fPIE2020041020200409
423925138 0 015365 768 808refgcc_-march=native_-mtune=native_-O2_-fomit-frame-pointer_-fwrapv_-fPIC_-fPIE2020041020200409

Compiler output

Implementation: avxicc
Security model: unknown
Compiler: clang -march=native -O2 -fomit-frame-pointer -fwrapv -Qunused-arguments -fPIC -fPIE
hash.s: hash.s:395915:31: error: cannot use more than one symbol in memory operand
hash.s: mov esi, offset flat: padding.0 #246.3
hash.s: ^
hash.s: hash.s:395927:31: error: cannot use more than one symbol in memory operand
hash.s: mov esi, offset flat: padding.0 #246.3
hash.s: ^
hash.s: hash.s:395933:31: error: cannot use more than one symbol in memory operand
hash.s: mov esi, offset flat: padding.0+1 #246.3
hash.s: ^

Number of similar (compiler,implementation) pairs: 5, namely:
CompilerImplementations
clang -march=native -O2 -fomit-frame-pointer -fwrapv -Qunused-arguments -fPIC -fPIE avxicc
clang -march=native -O3 -fomit-frame-pointer -fwrapv -Qunused-arguments -fPIC -fPIE avxicc
clang -march=native -O -fomit-frame-pointer -fwrapv -Qunused-arguments -fPIC -fPIE avxicc
clang -march=native -Os -fomit-frame-pointer -fwrapv -Qunused-arguments -fPIC -fPIE avxicc
clang -mcpu=native -O3 -fomit-frame-pointer -fwrapv -Qunused-arguments -fPIC -fPIE avxicc

Compiler output

Implementation: avxicc
Security model: unknown
Compiler: gcc -march=native -mtune=native -O2 -fomit-frame-pointer -fwrapv -fPIC -fPIE
try.c: /usr/bin/ld: crypto_hash_blake512.a(hash.o): relocation R_X86_64_32 against `.rodata' can not be used when making a PIE object; recompile with -fPIC
try.c: /usr/bin/ld: final link failed: Nonrepresentable section on output
try.c: collect2: error: ld returned 1 exit status

Number of similar (compiler,implementation) pairs: 4, namely:
CompilerImplementations
gcc -march=native -mtune=native -O2 -fomit-frame-pointer -fwrapv -fPIC -fPIE avxicc
gcc -march=native -mtune=native -O3 -fomit-frame-pointer -fwrapv -fPIC -fPIE avxicc
gcc -march=native -mtune=native -O -fomit-frame-pointer -fwrapv -fPIC -fPIE avxicc
gcc -march=native -mtune=native -Os -fomit-frame-pointer -fwrapv -fPIC -fPIE avxicc

Compiler output

Implementation: sse41
Security model: unknown
Compiler: clang -march=native -O2 -fomit-frame-pointer -fwrapv -Qunused-arguments -fPIC -fPIE
hash.c: In file included from hash.c:8:
hash.c: ./rounds.h:8:10: warning: '_mm_roti_epi64' macro redefined [-Wmacro-redefined]
hash.c: #define _mm_roti_epi64(x, c) \
hash.c: ^
hash.c: /usr/lib/llvm-6.0/lib/clang/6.0.0/include/xopintrin.h:249:9: note: previous definition is here
hash.c: #define _mm_roti_epi64(A, N) __extension__ ({ \
hash.c: ^
hash.c: 1 warning generated.

Number of similar (compiler,implementation) pairs: 4, namely:
CompilerImplementations
clang -march=native -O2 -fomit-frame-pointer -fwrapv -Qunused-arguments -fPIC -fPIE sse41
clang -march=native -O3 -fomit-frame-pointer -fwrapv -Qunused-arguments -fPIC -fPIE sse41
clang -march=native -O -fomit-frame-pointer -fwrapv -Qunused-arguments -fPIC -fPIE sse41
clang -march=native -Os -fomit-frame-pointer -fwrapv -Qunused-arguments -fPIC -fPIE sse41

Compiler output

Implementation: sse41
Security model: unknown
Compiler: clang -mcpu=native -O3 -fomit-frame-pointer -fwrapv -Qunused-arguments -fPIC -fPIE
hash.c: In file included from hash.c:8:
hash.c: ./rounds.h:8:10: warning: '_mm_roti_epi64' macro redefined [-Wmacro-redefined]
hash.c: #define _mm_roti_epi64(x, c) \
hash.c: ^
hash.c: /usr/lib/llvm-6.0/lib/clang/6.0.0/include/xopintrin.h:249:9: note: previous definition is here
hash.c: #define _mm_roti_epi64(A, N) __extension__ ({ \
hash.c: ^
hash.c: hash.c:81:8: error: always_inline function '_mm_shuffle_epi8' requires target feature 'ssse3', but would be inlined into function 'blake512_compress' that is compiled without support for 'ssse3'
hash.c: m0 = BSWAP64(m0);
hash.c: ^
hash.c: ./rounds.h:6:21: note: expanded from macro 'BSWAP64'
hash.c: #define BSWAP64(x) _mm_shuffle_epi8((x), u8to64)
hash.c: ^
hash.c: hash.c:82:8: error: always_inline function '_mm_shuffle_epi8' requires target feature 'ssse3', but would be inlined into function 'blake512_compress' that is compiled without support for 'ssse3'
hash.c: m1 = BSWAP64(m1);
hash.c: ^
hash.c: ./rounds.h:6:21: note: expanded from macro 'BSWAP64'
hash.c: #define BSWAP64(x) _mm_shuffle_epi8((x), u8to64)
hash.c: ^
hash.c: hash.c:83:8: error: always_inline function '_mm_shuffle_epi8' requires target feature 'ssse3', but would be inlined into function 'blake512_compress' that is compiled without support for 'ssse3'
hash.c: m2 = BSWAP64(m2);
hash.c: ^
hash.c: ./rounds.h:6:21: note: expanded from macro 'BSWAP64'
hash.c: #define BSWAP64(x) _mm_shuffle_epi8((x), u8to64)
hash.c: ^
hash.c: ...

Number of similar (compiler,implementation) pairs: 1, namely:
CompilerImplementations
clang -mcpu=native -O3 -fomit-frame-pointer -fwrapv -Qunused-arguments -fPIC -fPIE sse41

Compiler output

Implementation: ssse3
Security model: unknown
Compiler: clang -mcpu=native -O3 -fomit-frame-pointer -fwrapv -Qunused-arguments -fPIC -fPIE
hash.c: hash.c:141:15: error: always_inline function '_mm_shuffle_epi8' requires target feature 'ssse3', but would be inlined into function 'blake512_compress' that is compiled without support for 'ssse3'
hash.c: m.u128[0] = _mm_shuffle_epi8(_mm_loadu_si128((__m128i*)(datablock + 00)), u8to64);
hash.c: ^
hash.c: hash.c:142:15: error: always_inline function '_mm_shuffle_epi8' requires target feature 'ssse3', but would be inlined into function 'blake512_compress' that is compiled without support for 'ssse3'
hash.c: m.u128[1] = _mm_shuffle_epi8(_mm_loadu_si128((__m128i*)(datablock + 16)), u8to64);
hash.c: ^
hash.c: hash.c:143:15: error: always_inline function '_mm_shuffle_epi8' requires target feature 'ssse3', but would be inlined into function 'blake512_compress' that is compiled without support for 'ssse3'
hash.c: m.u128[2] = _mm_shuffle_epi8(_mm_loadu_si128((__m128i*)(datablock + 32)), u8to64);
hash.c: ^
hash.c: hash.c:144:15: error: always_inline function '_mm_shuffle_epi8' requires target feature 'ssse3', but would be inlined into function 'blake512_compress' that is compiled without support for 'ssse3'
hash.c: m.u128[3] = _mm_shuffle_epi8(_mm_loadu_si128((__m128i*)(datablock + 48)), u8to64);
hash.c: ^
hash.c: hash.c:145:15: error: always_inline function '_mm_shuffle_epi8' requires target feature 'ssse3', but would be inlined into function 'blake512_compress' that is compiled without support for 'ssse3'
hash.c: m.u128[4] = _mm_shuffle_epi8(_mm_loadu_si128((__m128i*)(datablock + 64)), u8to64);
hash.c: ^
hash.c: hash.c:146:15: error: always_inline function '_mm_shuffle_epi8' requires target feature 'ssse3', but would be inlined into function 'blake512_compress' that is compiled without support for 'ssse3'
hash.c: m.u128[5] = _mm_shuffle_epi8(_mm_loadu_si128((__m128i*)(datablock + 80)), u8to64);
hash.c: ^
hash.c: hash.c:147:15: error: always_inline function '_mm_shuffle_epi8' requires target feature 'ssse3', but would be inlined into function 'blake512_compress' that is compiled without support for 'ssse3'
hash.c: m.u128[6] = _mm_shuffle_epi8(_mm_loadu_si128((__m128i*)(datablock + 96)), u8to64);
hash.c: ^
hash.c: hash.c:148:15: error: always_inline function '_mm_shuffle_epi8' requires target feature 'ssse3', but would be inlined into function 'blake512_compress' that is compiled without support for 'ssse3'
hash.c: m.u128[7] = _mm_shuffle_epi8(_mm_loadu_si128((__m128i*)(datablock + 112)), u8to64);
hash.c: ^
hash.c: hash.c:291:3: error: always_inline function '_mm_shuffle_epi8' requires target feature 'ssse3', but would be inlined into function 'blake512_compress' that is compiled without support for 'ssse3'
hash.c: ...

Number of similar (compiler,implementation) pairs: 1, namely:
CompilerImplementations
clang -mcpu=native -O3 -fomit-frame-pointer -fwrapv -Qunused-arguments -fPIC -fPIE ssse3

Compiler output

Implementation: vect128
Security model: unknown
Compiler: clang -march=native -O2 -fomit-frame-pointer -fwrapv -Qunused-arguments -fPIC -fPIE
vector.c: vector.c:753:3: error: use of unknown builtin '__builtin_ia32_punpcklqdq128' [-Wimplicit-function-declaration]
vector.c: ROUND( 0); ROUND( 1); ROUND( 2); ROUND( 3);
vector.c: ^
vector.c: vector.c:670:5: note: expanded from macro 'ROUND'
vector.c: PERM(i); \
vector.c: ^
vector.c: ./perm512-m.h:1:17: note: expanded from macro 'PERM'
vector.c: #define PERM(i) XCAT(PERM_512_INPLACE_,i)
vector.c: ^
vector.c: ./vector.h:6:19: note: expanded from macro 'XCAT'
vector.c: #define XCAT(x,y) CAT(x,y)
vector.c: ^
vector.c: note: (skipping 1 expansions in backtrace; use -fmacro-backtrace-limit=0 to see all)
vector.c: <scratch space>:67:1: note: expanded from here
vector.c: PERM_512_INPLACE_0
vector.c: ^
vector.c: ./perm512-m.h:4:10: note: expanded from macro 'PERM_512_INPLACE_0'
vector.c: m0 = v64_interleavel(mm0, mm1); \
vector.c: ^
vector.c: ./vector.h:97:27: note: expanded from macro 'v64_interleavel'
vector.c: #define v64_interleavel __builtin_ia32_punpcklqdq128
vector.c: ^
vector.c: vector.c:753:3: error: assigning to 'v64' (aka 'v2di') from incompatible type 'int'
vector.c: ROUND( 0); ROUND( 1); ROUND( 2); ROUND( 3);
vector.c: ^~~~~~~~~
vector.c: ...

Number of similar (compiler,implementation) pairs: 4, namely:
CompilerImplementations
clang -march=native -O2 -fomit-frame-pointer -fwrapv -Qunused-arguments -fPIC -fPIE vect128
clang -march=native -O3 -fomit-frame-pointer -fwrapv -Qunused-arguments -fPIC -fPIE vect128
clang -march=native -O -fomit-frame-pointer -fwrapv -Qunused-arguments -fPIC -fPIE vect128
clang -mcpu=native -O3 -fomit-frame-pointer -fwrapv -Qunused-arguments -fPIC -fPIE vect128

Compiler output

Implementation: vect128
Security model: unknown
Compiler: clang -march=native -Os -fomit-frame-pointer -fwrapv -Qunused-arguments -fPIC -fPIE
vector.c: vector.c:753:3: error: use of unknown builtin '__builtin_ia32_punpcklqdq128' [-Wimplicit-function-declaration]
vector.c: ROUND( 0); ROUND( 1); ROUND( 2); ROUND( 3);
vector.c: ^
vector.c: vector.c:670:5: note: expanded from macro 'ROUND'
vector.c: PERM(i); \
vector.c: ^
vector.c: ./perm512-m.h:1:17: note: expanded from macro 'PERM'
vector.c: #define PERM(i) XCAT(PERM_512_INPLACE_,i)
vector.c: ^
vector.c: ./vector.h:6:19: note: expanded from macro 'XCAT'
vector.c: #define XCAT(x,y) CAT(x,y)
vector.c: ^
vector.c: note: (skipping 1 expansions in backtrace; use -fmacro-backtrace-limit=0 to see all)
vector.c: <scratch space>:64:1: note: expanded from here
vector.c: PERM_512_INPLACE_0
vector.c: ^
vector.c: ./perm512-m.h:4:10: note: expanded from macro 'PERM_512_INPLACE_0'
vector.c: m0 = v64_interleavel(mm0, mm1); \
vector.c: ^
vector.c: ./vector.h:97:27: note: expanded from macro 'v64_interleavel'
vector.c: #define v64_interleavel __builtin_ia32_punpcklqdq128
vector.c: ^
vector.c: vector.c:753:3: error: assigning to 'v64' (aka 'v2di') from incompatible type 'int'
vector.c: ROUND( 0); ROUND( 1); ROUND( 2); ROUND( 3);
vector.c: ^~~~~~~~~
vector.c: ...

Number of similar (compiler,implementation) pairs: 1, namely:
CompilerImplementations
clang -march=native -Os -fomit-frame-pointer -fwrapv -Qunused-arguments -fPIC -fPIE vect128

Compiler output

Implementation: vect128-inplace
Security model: unknown
Compiler: clang -march=native -O2 -fomit-frame-pointer -fwrapv -Qunused-arguments -fPIC -fPIE
vector.c: vector.c:753:3: error: use of unknown builtin '__builtin_ia32_punpcklqdq128' [-Wimplicit-function-declaration]
vector.c: ROUND( 0); ROUND( 1); ROUND( 2); ROUND( 3);
vector.c: ^
vector.c: vector.c:670:5: note: expanded from macro 'ROUND'
vector.c: PERM(i); \
vector.c: ^
vector.c: ./perm512.h:1:17: note: expanded from macro 'PERM'
vector.c: #define PERM(i) XCAT(PERM_512_,i)
vector.c: ^
vector.c: ./vector.h:6:19: note: expanded from macro 'XCAT'
vector.c: #define XCAT(x,y) CAT(x,y)
vector.c: ^
vector.c: note: (skipping 1 expansions in backtrace; use -fmacro-backtrace-limit=0 to see all)
vector.c: <scratch space>:67:1: note: expanded from here
vector.c: PERM_512_0
vector.c: ^
vector.c: ./perm512.h:6:10: note: expanded from macro 'PERM_512_0'
vector.c: m0 = v64_interleavel(mm0, mm1); \
vector.c: ^
vector.c: ./vector.h:97:27: note: expanded from macro 'v64_interleavel'
vector.c: #define v64_interleavel __builtin_ia32_punpcklqdq128
vector.c: ^
vector.c: vector.c:753:3: error: assigning to 'v64' (aka 'v2di') from incompatible type 'int'
vector.c: ROUND( 0); ROUND( 1); ROUND( 2); ROUND( 3);
vector.c: ^~~~~~~~~
vector.c: ...

Number of similar (compiler,implementation) pairs: 4, namely:
CompilerImplementations
clang -march=native -O2 -fomit-frame-pointer -fwrapv -Qunused-arguments -fPIC -fPIE vect128-inplace
clang -march=native -O3 -fomit-frame-pointer -fwrapv -Qunused-arguments -fPIC -fPIE vect128-inplace
clang -march=native -O -fomit-frame-pointer -fwrapv -Qunused-arguments -fPIC -fPIE vect128-inplace
clang -mcpu=native -O3 -fomit-frame-pointer -fwrapv -Qunused-arguments -fPIC -fPIE vect128-inplace

Compiler output

Implementation: vect128-inplace
Security model: unknown
Compiler: clang -march=native -Os -fomit-frame-pointer -fwrapv -Qunused-arguments -fPIC -fPIE
vector.c: vector.c:753:3: error: use of unknown builtin '__builtin_ia32_punpcklqdq128' [-Wimplicit-function-declaration]
vector.c: ROUND( 0); ROUND( 1); ROUND( 2); ROUND( 3);
vector.c: ^
vector.c: vector.c:670:5: note: expanded from macro 'ROUND'
vector.c: PERM(i); \
vector.c: ^
vector.c: ./perm512.h:1:17: note: expanded from macro 'PERM'
vector.c: #define PERM(i) XCAT(PERM_512_,i)
vector.c: ^
vector.c: ./vector.h:6:19: note: expanded from macro 'XCAT'
vector.c: #define XCAT(x,y) CAT(x,y)
vector.c: ^
vector.c: note: (skipping 1 expansions in backtrace; use -fmacro-backtrace-limit=0 to see all)
vector.c: <scratch space>:64:1: note: expanded from here
vector.c: PERM_512_0
vector.c: ^
vector.c: ./perm512.h:6:10: note: expanded from macro 'PERM_512_0'
vector.c: m0 = v64_interleavel(mm0, mm1); \
vector.c: ^
vector.c: ./vector.h:97:27: note: expanded from macro 'v64_interleavel'
vector.c: #define v64_interleavel __builtin_ia32_punpcklqdq128
vector.c: ^
vector.c: vector.c:753:3: error: assigning to 'v64' (aka 'v2di') from incompatible type 'int'
vector.c: ROUND( 0); ROUND( 1); ROUND( 2); ROUND( 3);
vector.c: ^~~~~~~~~
vector.c: ...

Number of similar (compiler,implementation) pairs: 1, namely:
CompilerImplementations
clang -march=native -Os -fomit-frame-pointer -fwrapv -Qunused-arguments -fPIC -fPIE vect128-inplace

Compiler output

Implementation: vect128-xop
Security model: unknown
Compiler: clang -march=native -O2 -fomit-frame-pointer -fwrapv -Qunused-arguments -fPIC -fPIE
vector.c: vector.c:646:13: error: always_inline function '_mm_perm_epi8' requires target feature 'fma4', but would be inlined into function 'round512' that is compiled without support for 'fma4'
vector.c: v64 mm0 = v64_lswap(MM[0]), mm1 = v64_lswap(MM[1]);
vector.c: ^
vector.c: ./vector.h:153:27: note: expanded from macro 'v64_lswap'
vector.c: #define v64_lswap(x) V864(vector_shuffle(V648(x), v64_swap_endianness.v8))
vector.c: ^
vector.c: ./vector.h:64:29: note: expanded from macro 'vector_shuffle'
vector.c: #define vector_shuffle(x,s) _mm_perm_epi8(x,x, s)
vector.c: ^
vector.c: vector.c:646:37: error: always_inline function '_mm_perm_epi8' requires target feature 'fma4', but would be inlined into function 'round512' that is compiled without support for 'fma4'
vector.c: v64 mm0 = v64_lswap(MM[0]), mm1 = v64_lswap(MM[1]);
vector.c: ^
vector.c: ./vector.h:153:27: note: expanded from macro 'v64_lswap'
vector.c: #define v64_lswap(x) V864(vector_shuffle(V648(x), v64_swap_endianness.v8))
vector.c: ^
vector.c: ./vector.h:64:29: note: expanded from macro 'vector_shuffle'
vector.c: #define vector_shuffle(x,s) _mm_perm_epi8(x,x, s)
vector.c: ^
vector.c: vector.c:647:13: error: always_inline function '_mm_perm_epi8' requires target feature 'fma4', but would be inlined into function 'round512' that is compiled without support for 'fma4'
vector.c: v64 mm2 = v64_lswap(MM[2]), mm3 = v64_lswap(MM[3]);
vector.c: ^
vector.c: ./vector.h:153:27: note: expanded from macro 'v64_lswap'
vector.c: #define v64_lswap(x) V864(vector_shuffle(V648(x), v64_swap_endianness.v8))
vector.c: ^
vector.c: ./vector.h:64:29: note: expanded from macro 'vector_shuffle'
vector.c: ...

Number of similar (compiler,implementation) pairs: 4, namely:
CompilerImplementations
clang -march=native -O2 -fomit-frame-pointer -fwrapv -Qunused-arguments -fPIC -fPIE vect128-xop
clang -march=native -O3 -fomit-frame-pointer -fwrapv -Qunused-arguments -fPIC -fPIE vect128-xop
clang -march=native -O -fomit-frame-pointer -fwrapv -Qunused-arguments -fPIC -fPIE vect128-xop
clang -march=native -Os -fomit-frame-pointer -fwrapv -Qunused-arguments -fPIC -fPIE vect128-xop

Compiler output

Implementation: vect128-xop
Security model: unknown
Compiler: clang -mcpu=native -O3 -fomit-frame-pointer -fwrapv -Qunused-arguments -fPIC -fPIE
vector.c: vector.c:646:13: warning: implicit declaration of function '_mm_perm_epi8' is invalid in C99 [-Wimplicit-function-declaration]
vector.c: v64 mm0 = v64_lswap(MM[0]), mm1 = v64_lswap(MM[1]);
vector.c: ^
vector.c: ./vector.h:153:27: note: expanded from macro 'v64_lswap'
vector.c: #define v64_lswap(x) V864(vector_shuffle(V648(x), v64_swap_endianness.v8))
vector.c: ^
vector.c: ./vector.h:64:29: note: expanded from macro 'vector_shuffle'
vector.c: #define vector_shuffle(x,s) _mm_perm_epi8(x,x, s)
vector.c: ^
vector.c: vector.c:646:7: error: initializing 'v64' (aka '__m128i') with an expression of incompatible type 'int'
vector.c: v64 mm0 = v64_lswap(MM[0]), mm1 = v64_lswap(MM[1]);
vector.c: ^ ~~~~~~~~~~~~~~~~
vector.c: vector.c:646:31: error: initializing 'v64' (aka '__m128i') with an expression of incompatible type 'int'
vector.c: v64 mm0 = v64_lswap(MM[0]), mm1 = v64_lswap(MM[1]);
vector.c: ^ ~~~~~~~~~~~~~~~~
vector.c: vector.c:647:7: error: initializing 'v64' (aka '__m128i') with an expression of incompatible type 'int'
vector.c: v64 mm2 = v64_lswap(MM[2]), mm3 = v64_lswap(MM[3]);
vector.c: ^ ~~~~~~~~~~~~~~~~
vector.c: vector.c:647:31: error: initializing 'v64' (aka '__m128i') with an expression of incompatible type 'int'
vector.c: v64 mm2 = v64_lswap(MM[2]), mm3 = v64_lswap(MM[3]);
vector.c: ^ ~~~~~~~~~~~~~~~~
vector.c: vector.c:648:7: error: initializing 'v64' (aka '__m128i') with an expression of incompatible type 'int'
vector.c: v64 mm4 = v64_lswap(MM[4]), mm5 = v64_lswap(MM[5]);
vector.c: ^ ~~~~~~~~~~~~~~~~
vector.c: vector.c:648:31: error: initializing 'v64' (aka '__m128i') with an expression of incompatible type 'int'
vector.c: ...

Number of similar (compiler,implementation) pairs: 1, namely:
CompilerImplementations
clang -mcpu=native -O3 -fomit-frame-pointer -fwrapv -Qunused-arguments -fPIC -fPIE vect128-xop

Compiler output

Implementation: vect128-xop
Security model: unknown
Compiler: gcc -march=native -mtune=native -O2 -fomit-frame-pointer -fwrapv -fPIC -fPIE
vector.c: In file included from /usr/lib/gcc/x86_64-linux-gnu/7/include/x86intrin.h:54:0,
vector.c: from vector.h:29,
vector.c: from vector.c:7:
vector.c: vector.c: In function 'round512':
vector.c: /usr/lib/gcc/x86_64-linux-gnu/7/include/xopintrin.h:266:1: error: inlining failed in call to always_inline '_mm_roti_epi64': target specific option mismatch
vector.c: _mm_roti_epi64(__m128i __A, const int __B)
vector.c: ^~~~~~~~~~~~~~
vector.c: vector.c:745:8: note: called from here
vector.c: B1 = v64_rotate(B1, 64-11); \
vector.c: vector.c:756:36: note: in expansion of macro 'ROUND'
vector.c: ROUND(12); ROUND(13); ROUND(14); ROUND(15);
vector.c: ^~~~~
vector.c: In file included from /usr/lib/gcc/x86_64-linux-gnu/7/include/x86intrin.h:54:0,
vector.c: from vector.h:29,
vector.c: from vector.c:7:
vector.c: /usr/lib/gcc/x86_64-linux-gnu/7/include/xopintrin.h:266:1: error: inlining failed in call to always_inline '_mm_roti_epi64': target specific option mismatch
vector.c: _mm_roti_epi64(__m128i __A, const int __B)
vector.c: ^~~~~~~~~~~~~~
vector.c: vector.c:744:8: note: called from here
vector.c: B0 = v64_rotate(B0, 64-11); \
vector.c: vector.c:756:36: note: in expansion of macro 'ROUND'
vector.c: ROUND(12); ROUND(13); ROUND(14); ROUND(15);
vector.c: ^~~~~
vector.c: In file included from /usr/lib/gcc/x86_64-linux-gnu/7/include/x86intrin.h:54:0,
vector.c: from vector.h:29,
vector.c: ...

Number of similar (compiler,implementation) pairs: 4, namely:
CompilerImplementations
gcc -march=native -mtune=native -O2 -fomit-frame-pointer -fwrapv -fPIC -fPIE vect128-xop
gcc -march=native -mtune=native -O3 -fomit-frame-pointer -fwrapv -fPIC -fPIE vect128-xop
gcc -march=native -mtune=native -O -fomit-frame-pointer -fwrapv -fPIC -fPIE vect128-xop
gcc -march=native -mtune=native -Os -fomit-frame-pointer -fwrapv -fPIC -fPIE vect128-xop

Compiler output

Implementation: xop
Security model: unknown
Compiler: clang -march=native -O2 -fomit-frame-pointer -fwrapv -Qunused-arguments -fPIC -fPIE
hash.c: hash.c:81:8: error: always_inline function '_mm_perm_epi8' requires target feature 'fma4', but would be inlined into function 'blake512_compress' that is compiled without support for 'fma4'
hash.c: m0 = BSWAP64(m0);
hash.c: ^
hash.c: ./rounds.h:13:21: note: expanded from macro 'BSWAP64'
hash.c: #define BSWAP64(x) _mm_perm_epi8((x),(x),u8to64)
hash.c: ^
hash.c: hash.c:82:8: error: always_inline function '_mm_perm_epi8' requires target feature 'fma4', but would be inlined into function 'blake512_compress' that is compiled without support for 'fma4'
hash.c: m1 = BSWAP64(m1);
hash.c: ^
hash.c: ./rounds.h:13:21: note: expanded from macro 'BSWAP64'
hash.c: #define BSWAP64(x) _mm_perm_epi8((x),(x),u8to64)
hash.c: ^
hash.c: hash.c:83:8: error: always_inline function '_mm_perm_epi8' requires target feature 'fma4', but would be inlined into function 'blake512_compress' that is compiled without support for 'fma4'
hash.c: m2 = BSWAP64(m2);
hash.c: ^
hash.c: ./rounds.h:13:21: note: expanded from macro 'BSWAP64'
hash.c: #define BSWAP64(x) _mm_perm_epi8((x),(x),u8to64)
hash.c: ^
hash.c: hash.c:84:8: error: always_inline function '_mm_perm_epi8' requires target feature 'fma4', but would be inlined into function 'blake512_compress' that is compiled without support for 'fma4'
hash.c: m3 = BSWAP64(m3);
hash.c: ^
hash.c: ./rounds.h:13:21: note: expanded from macro 'BSWAP64'
hash.c: #define BSWAP64(x) _mm_perm_epi8((x),(x),u8to64)
hash.c: ^
hash.c: hash.c:85:8: error: always_inline function '_mm_perm_epi8' requires target feature 'fma4', but would be inlined into function 'blake512_compress' that is compiled without support for 'fma4'
hash.c: ...

Number of similar (compiler,implementation) pairs: 4, namely:
CompilerImplementations
clang -march=native -O2 -fomit-frame-pointer -fwrapv -Qunused-arguments -fPIC -fPIE xop
clang -march=native -O3 -fomit-frame-pointer -fwrapv -Qunused-arguments -fPIC -fPIE xop
clang -march=native -O -fomit-frame-pointer -fwrapv -Qunused-arguments -fPIC -fPIE xop
clang -march=native -Os -fomit-frame-pointer -fwrapv -Qunused-arguments -fPIC -fPIE xop

Compiler output

Implementation: xop
Security model: unknown
Compiler: clang -mcpu=native -O3 -fomit-frame-pointer -fwrapv -Qunused-arguments -fPIC -fPIE
hash.c: hash.c:81:8: error: always_inline function '_mm_perm_epi8' requires target feature 'sse4a', but would be inlined into function 'blake512_compress' that is compiled without support for 'sse4a'
hash.c: m0 = BSWAP64(m0);
hash.c: ^
hash.c: ./rounds.h:13:21: note: expanded from macro 'BSWAP64'
hash.c: #define BSWAP64(x) _mm_perm_epi8((x),(x),u8to64)
hash.c: ^
hash.c: hash.c:82:8: error: always_inline function '_mm_perm_epi8' requires target feature 'sse4a', but would be inlined into function 'blake512_compress' that is compiled without support for 'sse4a'
hash.c: m1 = BSWAP64(m1);
hash.c: ^
hash.c: ./rounds.h:13:21: note: expanded from macro 'BSWAP64'
hash.c: #define BSWAP64(x) _mm_perm_epi8((x),(x),u8to64)
hash.c: ^
hash.c: hash.c:83:8: error: always_inline function '_mm_perm_epi8' requires target feature 'sse4a', but would be inlined into function 'blake512_compress' that is compiled without support for 'sse4a'
hash.c: m2 = BSWAP64(m2);
hash.c: ^
hash.c: ./rounds.h:13:21: note: expanded from macro 'BSWAP64'
hash.c: #define BSWAP64(x) _mm_perm_epi8((x),(x),u8to64)
hash.c: ^
hash.c: hash.c:84:8: error: always_inline function '_mm_perm_epi8' requires target feature 'sse4a', but would be inlined into function 'blake512_compress' that is compiled without support for 'sse4a'
hash.c: m3 = BSWAP64(m3);
hash.c: ^
hash.c: ./rounds.h:13:21: note: expanded from macro 'BSWAP64'
hash.c: #define BSWAP64(x) _mm_perm_epi8((x),(x),u8to64)
hash.c: ^
hash.c: hash.c:85:8: error: always_inline function '_mm_perm_epi8' requires target feature 'sse4a', but would be inlined into function 'blake512_compress' that is compiled without support for 'sse4a'
hash.c: ...

Number of similar (compiler,implementation) pairs: 1, namely:
CompilerImplementations
clang -mcpu=native -O3 -fomit-frame-pointer -fwrapv -Qunused-arguments -fPIC -fPIE xop

Compiler output

Implementation: xop
Security model: unknown
Compiler: gcc -march=native -mtune=native -O2 -fomit-frame-pointer -fwrapv -fPIC -fPIE
hash.c: In file included from /usr/lib/gcc/x86_64-linux-gnu/7/include/x86intrin.h:54:0,
hash.c: from hash.c:5:
hash.c: hash.c: In function 'blake512_compress':
hash.c: /usr/lib/gcc/x86_64-linux-gnu/7/include/xopintrin.h:266:1: error: inlining failed in call to always_inline '_mm_roti_epi64': target specific option mismatch
hash.c: _mm_roti_epi64(__m128i __A, const int __B)
hash.c: ^~~~~~~~~~~~~~
hash.c: In file included from hash.c:8:0:
hash.c: rounds.h:825:9: note: called from here
hash.c: row2h = _mm_roti_epi64(row2h, -11); \
hash.c: ^
hash.c: rounds.h:867:3: note: in expansion of macro 'G2'
hash.c: G2(row1l,row2l,row3l,row4l,row1h,row2h,row3h,row4h,b0,b1); \
hash.c: ^~
hash.c: hash.c:132:3: note: in expansion of macro 'ROUND'
hash.c: ROUND(15);
hash.c: ^~~~~
hash.c: In file included from /usr/lib/gcc/x86_64-linux-gnu/7/include/x86intrin.h:54:0,
hash.c: from hash.c:5:
hash.c: /usr/lib/gcc/x86_64-linux-gnu/7/include/xopintrin.h:266:1: error: inlining failed in call to always_inline '_mm_roti_epi64': target specific option mismatch
hash.c: _mm_roti_epi64(__m128i __A, const int __B)
hash.c: ^~~~~~~~~~~~~~
hash.c: In file included from hash.c:8:0:
hash.c: rounds.h:824:9: note: called from here
hash.c: row2l = _mm_roti_epi64(row2l, -11); \
hash.c: ^
hash.c: ...

Number of similar (compiler,implementation) pairs: 4, namely:
CompilerImplementations
gcc -march=native -mtune=native -O2 -fomit-frame-pointer -fwrapv -fPIC -fPIE xop
gcc -march=native -mtune=native -O3 -fomit-frame-pointer -fwrapv -fPIC -fPIE xop
gcc -march=native -mtune=native -O -fomit-frame-pointer -fwrapv -fPIC -fPIE xop
gcc -march=native -mtune=native -Os -fomit-frame-pointer -fwrapv -fPIC -fPIE xop

Compiler output

Implementation: xop-2
Security model: unknown
Compiler: clang -march=native -O2 -fomit-frame-pointer -fwrapv -Qunused-arguments -fPIC -fPIE
hash.c: hash.c:92:15: error: always_inline function '_mm_perm_epi8' requires target feature 'fma4', but would be inlined into function 'blake512_compress' that is compiled without support for 'fma4'
hash.c: m.u128[0] = BSWAP64(m.u128[0]);
hash.c: ^
hash.c: ./rounds.h:15:21: note: expanded from macro 'BSWAP64'
hash.c: #define BSWAP64(x) _mm_perm_epi8((x),(x),u8to64)
hash.c: ^
hash.c: hash.c:93:15: error: always_inline function '_mm_perm_epi8' requires target feature 'fma4', but would be inlined into function 'blake512_compress' that is compiled without support for 'fma4'
hash.c: m.u128[1] = BSWAP64(m.u128[1]);
hash.c: ^
hash.c: ./rounds.h:15:21: note: expanded from macro 'BSWAP64'
hash.c: #define BSWAP64(x) _mm_perm_epi8((x),(x),u8to64)
hash.c: ^
hash.c: hash.c:94:15: error: always_inline function '_mm_perm_epi8' requires target feature 'fma4', but would be inlined into function 'blake512_compress' that is compiled without support for 'fma4'
hash.c: m.u128[2] = BSWAP64(m.u128[2]);
hash.c: ^
hash.c: ./rounds.h:15:21: note: expanded from macro 'BSWAP64'
hash.c: #define BSWAP64(x) _mm_perm_epi8((x),(x),u8to64)
hash.c: ^
hash.c: hash.c:95:15: error: always_inline function '_mm_perm_epi8' requires target feature 'fma4', but would be inlined into function 'blake512_compress' that is compiled without support for 'fma4'
hash.c: m.u128[3] = BSWAP64(m.u128[3]);
hash.c: ^
hash.c: ./rounds.h:15:21: note: expanded from macro 'BSWAP64'
hash.c: #define BSWAP64(x) _mm_perm_epi8((x),(x),u8to64)
hash.c: ^
hash.c: hash.c:96:15: error: always_inline function '_mm_perm_epi8' requires target feature 'fma4', but would be inlined into function 'blake512_compress' that is compiled without support for 'fma4'
hash.c: ...

Number of similar (compiler,implementation) pairs: 4, namely:
CompilerImplementations
clang -march=native -O2 -fomit-frame-pointer -fwrapv -Qunused-arguments -fPIC -fPIE xop-2
clang -march=native -O3 -fomit-frame-pointer -fwrapv -Qunused-arguments -fPIC -fPIE xop-2
clang -march=native -O -fomit-frame-pointer -fwrapv -Qunused-arguments -fPIC -fPIE xop-2
clang -march=native -Os -fomit-frame-pointer -fwrapv -Qunused-arguments -fPIC -fPIE xop-2

Compiler output

Implementation: xop-2
Security model: unknown
Compiler: clang -mcpu=native -O3 -fomit-frame-pointer -fwrapv -Qunused-arguments -fPIC -fPIE
hash.c: hash.c:92:15: error: always_inline function '_mm_perm_epi8' requires target feature 'sse4a', but would be inlined into function 'blake512_compress' that is compiled without support for 'sse4a'
hash.c: m.u128[0] = BSWAP64(m.u128[0]);
hash.c: ^
hash.c: ./rounds.h:15:21: note: expanded from macro 'BSWAP64'
hash.c: #define BSWAP64(x) _mm_perm_epi8((x),(x),u8to64)
hash.c: ^
hash.c: hash.c:93:15: error: always_inline function '_mm_perm_epi8' requires target feature 'sse4a', but would be inlined into function 'blake512_compress' that is compiled without support for 'sse4a'
hash.c: m.u128[1] = BSWAP64(m.u128[1]);
hash.c: ^
hash.c: ./rounds.h:15:21: note: expanded from macro 'BSWAP64'
hash.c: #define BSWAP64(x) _mm_perm_epi8((x),(x),u8to64)
hash.c: ^
hash.c: hash.c:94:15: error: always_inline function '_mm_perm_epi8' requires target feature 'sse4a', but would be inlined into function 'blake512_compress' that is compiled without support for 'sse4a'
hash.c: m.u128[2] = BSWAP64(m.u128[2]);
hash.c: ^
hash.c: ./rounds.h:15:21: note: expanded from macro 'BSWAP64'
hash.c: #define BSWAP64(x) _mm_perm_epi8((x),(x),u8to64)
hash.c: ^
hash.c: hash.c:95:15: error: always_inline function '_mm_perm_epi8' requires target feature 'sse4a', but would be inlined into function 'blake512_compress' that is compiled without support for 'sse4a'
hash.c: m.u128[3] = BSWAP64(m.u128[3]);
hash.c: ^
hash.c: ./rounds.h:15:21: note: expanded from macro 'BSWAP64'
hash.c: #define BSWAP64(x) _mm_perm_epi8((x),(x),u8to64)
hash.c: ^
hash.c: hash.c:96:15: error: always_inline function '_mm_perm_epi8' requires target feature 'sse4a', but would be inlined into function 'blake512_compress' that is compiled without support for 'sse4a'
hash.c: ...

Number of similar (compiler,implementation) pairs: 1, namely:
CompilerImplementations
clang -mcpu=native -O3 -fomit-frame-pointer -fwrapv -Qunused-arguments -fPIC -fPIE xop-2

Compiler output

Implementation: xop-2
Security model: unknown
Compiler: gcc -march=native -mtune=native -O2 -fomit-frame-pointer -fwrapv -fPIC -fPIE
hash.c: In file included from /usr/lib/gcc/x86_64-linux-gnu/7/include/x86intrin.h:54:0,
hash.c: from hash.c:5:
hash.c: hash.c: In function 'blake512_compress':
hash.c: /usr/lib/gcc/x86_64-linux-gnu/7/include/xopintrin.h:212:1: error: inlining failed in call to always_inline '_mm_perm_epi8': target specific option mismatch
hash.c: _mm_perm_epi8(__m128i __A, __m128i __B, __m128i __C)
hash.c: ^~~~~~~~~~~~~
hash.c: In file included from hash.c:8:0:
hash.c: rounds.h:15:21: note: called from here
hash.c: #define BSWAP64(x) _mm_perm_epi8((x),(x),u8to64)
hash.c: ^~~~~~~~~~~~~~~~~~~~~~~~~~~~~
hash.c: hash.c:99:15: note: in expansion of macro 'BSWAP64'
hash.c: m.u128[7] = BSWAP64(m.u128[7]);
hash.c: ^~~~~~~
hash.c: In file included from /usr/lib/gcc/x86_64-linux-gnu/7/include/x86intrin.h:54:0,
hash.c: from hash.c:5:
hash.c: /usr/lib/gcc/x86_64-linux-gnu/7/include/xopintrin.h:212:1: error: inlining failed in call to always_inline '_mm_perm_epi8': target specific option mismatch
hash.c: _mm_perm_epi8(__m128i __A, __m128i __B, __m128i __C)
hash.c: ^~~~~~~~~~~~~
hash.c: In file included from hash.c:8:0:
hash.c: rounds.h:15:21: note: called from here
hash.c: #define BSWAP64(x) _mm_perm_epi8((x),(x),u8to64)
hash.c: ^~~~~~~~~~~~~~~~~~~~~~~~~~~~~
hash.c: hash.c:98:15: note: in expansion of macro 'BSWAP64'
hash.c: m.u128[6] = BSWAP64(m.u128[6]);
hash.c: ^~~~~~~
hash.c: ...

Number of similar (compiler,implementation) pairs: 4, namely:
CompilerImplementations
gcc -march=native -mtune=native -O2 -fomit-frame-pointer -fwrapv -fPIC -fPIE xop-2
gcc -march=native -mtune=native -O3 -fomit-frame-pointer -fwrapv -fPIC -fPIE xop-2
gcc -march=native -mtune=native -O -fomit-frame-pointer -fwrapv -fPIC -fPIE xop-2
gcc -march=native -mtune=native -Os -fomit-frame-pointer -fwrapv -fPIC -fPIE xop-2

Namespace violations

Implementation: sphlib
Security model: unknown
Compiler: clang -march=native -O2 -fomit-frame-pointer -fwrapv -Qunused-arguments -fPIC -fPIE
blake.o sph_blake224 T
blake.o sph_blake224_addbits_and_close T
blake.o sph_blake224_close T
blake.o sph_blake224_init T
blake.o sph_blake256 T
blake.o sph_blake256_addbits_and_close T
blake.o sph_blake256_close T
blake.o sph_blake256_init T
blake.o sph_blake384 T
blake.o sph_blake384_addbits_and_close T
blake.o sph_blake384_close T
blake.o sph_blake384_init T
blake.o sph_blake512 T
blake.o sph_blake512_addbits_and_close T
blake.o sph_blake512_close T
blake.o sph_blake512_init T

Number of similar (compiler,implementation) pairs: 18, namely:
CompilerImplementations
clang -march=native -O2 -fomit-frame-pointer -fwrapv -Qunused-arguments -fPIC -fPIE sphlib
clang -march=native -O3 -fomit-frame-pointer -fwrapv -Qunused-arguments -fPIC -fPIE sphlib
clang -march=native -O -fomit-frame-pointer -fwrapv -Qunused-arguments -fPIC -fPIE sphlib
clang -march=native -Os -fomit-frame-pointer -fwrapv -Qunused-arguments -fPIC -fPIE sphlib
clang -mcpu=native -O3 -fomit-frame-pointer -fwrapv -Qunused-arguments -fPIC -fPIE sphlib
gcc -march=native -mtune=native -O2 -fomit-frame-pointer -fwrapv -fPIC -fPIE sphlib
gcc -march=native -mtune=native -O3 -fomit-frame-pointer -fwrapv -fPIC -fPIE sphlib
gcc -march=native -mtune=native -O -fomit-frame-pointer -fwrapv -fPIC -fPIE sphlib
gcc -march=native -mtune=native -Os -fomit-frame-pointer -fwrapv -fPIC -fPIE sphlib
clang -march=native -O2 -fomit-frame-pointer -fwrapv -Qunused-arguments -fPIC -fPIE sphlib-small
clang -march=native -O3 -fomit-frame-pointer -fwrapv -Qunused-arguments -fPIC -fPIE sphlib-small
clang -march=native -O -fomit-frame-pointer -fwrapv -Qunused-arguments -fPIC -fPIE sphlib-small
clang -march=native -Os -fomit-frame-pointer -fwrapv -Qunused-arguments -fPIC -fPIE sphlib-small
clang -mcpu=native -O3 -fomit-frame-pointer -fwrapv -Qunused-arguments -fPIC -fPIE sphlib-small
gcc -march=native -mtune=native -O2 -fomit-frame-pointer -fwrapv -fPIC -fPIE sphlib-small
gcc -march=native -mtune=native -O3 -fomit-frame-pointer -fwrapv -fPIC -fPIE sphlib-small
gcc -march=native -mtune=native -O -fomit-frame-pointer -fwrapv -fPIC -fPIE sphlib-small
gcc -march=native -mtune=native -Os -fomit-frame-pointer -fwrapv -fPIC -fPIE sphlib-small

Namespace violations

Implementation: vect128
Security model: unknown
Compiler: gcc -march=native -mtune=native -O2 -fomit-frame-pointer -fwrapv -fPIC -fPIE
nist.o Final T
nist.o Hash T
nist.o IncreaseCounter T
nist.o Init T
nist.o InitIV T
nist.o Update T
vector.o Blake_Compress T
vector.o RequiredAlignment T
vector.o SupportedLength T
vector.o VERSION T
vector.o print_m32 T
vector.o print_m64 T
vector.o round512 T

Number of similar (compiler,implementation) pairs: 8, namely:
CompilerImplementations
gcc -march=native -mtune=native -O2 -fomit-frame-pointer -fwrapv -fPIC -fPIE vect128
gcc -march=native -mtune=native -O3 -fomit-frame-pointer -fwrapv -fPIC -fPIE vect128
gcc -march=native -mtune=native -O -fomit-frame-pointer -fwrapv -fPIC -fPIE vect128
gcc -march=native -mtune=native -Os -fomit-frame-pointer -fwrapv -fPIC -fPIE vect128
gcc -march=native -mtune=native -O2 -fomit-frame-pointer -fwrapv -fPIC -fPIE vect128-inplace
gcc -march=native -mtune=native -O3 -fomit-frame-pointer -fwrapv -fPIC -fPIE vect128-inplace
gcc -march=native -mtune=native -O -fomit-frame-pointer -fwrapv -fPIC -fPIE vect128-inplace
gcc -march=native -mtune=native -Os -fomit-frame-pointer -fwrapv -fPIC -fPIE vect128-inplace