Implementation notes: amd64, h6sandy, crypto_hash/blake256

Computer: h6sandy
Architecture: amd64
CPU ID: GenuineIntel-000206a7-bfebfbff
SUPERCOP version: 20200618
Operation: crypto_hash
Primitive: blake256
TimeObject sizeTest sizeImplementationCompilerBenchmark dateSUPERCOP version
139685831 0 019969 776 752sse41-2clang_-march=native_-O3_-fomit-frame-pointer_-fwrapv_-Qunused-arguments_-fPIC_-fPIE2020041020200409
140965831 0 018449 776 752sse41-2clang_-march=native_-O2_-fomit-frame-pointer_-fwrapv_-Qunused-arguments_-fPIC_-fPIE2020041020200409
142325831 0 018449 776 752sse41-2clang_-march=native_-O_-fomit-frame-pointer_-fwrapv_-Qunused-arguments_-fPIC_-fPIE2020041020200409
144325776 0 014815 768 736sse41-2clang_-march=native_-Os_-fomit-frame-pointer_-fwrapv_-Qunused-arguments_-fPIC_-fPIE2020041020200409
144686016 0 016125 768 808sse41-2gcc_-march=native_-mtune=native_-O_-fomit-frame-pointer_-fwrapv_-fPIC_-fPIE2020041020200409
147966173 0 016301 768 808sse41-2gcc_-march=native_-mtune=native_-O2_-fomit-frame-pointer_-fwrapv_-fPIC_-fPIE2020041020200409
150886962 0 019430 776 808sse41-2gcc_-march=native_-mtune=native_-O3_-fomit-frame-pointer_-fwrapv_-fPIC_-fPIE2020041020200409
152806812 0 019318 776 808sse41gcc_-march=native_-mtune=native_-O3_-fomit-frame-pointer_-fwrapv_-fPIC_-fPIE2020041020200409
153049469 4 20819908 796 1016vect128gcc_-march=native_-mtune=native_-O_-fomit-frame-pointer_-fwrapv_-fPIC_-fPIE2020041020200409
1553213439 4 20826038 780 1016vect128gcc_-march=native_-mtune=native_-O3_-fomit-frame-pointer_-fwrapv_-fPIC_-fPIE2020041020200409
156286367 0 016501 768 808sse41gcc_-march=native_-mtune=native_-O2_-fomit-frame-pointer_-fwrapv_-fPIC_-fPIE2020041020200409
158089682 4 20820006 780 1016vect128gcc_-march=native_-mtune=native_-O2_-fomit-frame-pointer_-fwrapv_-fPIC_-fPIE2020041020200409
159606233 0 016349 768 808sse41gcc_-march=native_-mtune=native_-O_-fomit-frame-pointer_-fwrapv_-fPIC_-fPIE2020041020200409
160565866 0 015097 752 776sse41-2gcc_-march=native_-mtune=native_-Os_-fomit-frame-pointer_-fwrapv_-fPIC_-fPIE2020041020200409
164086110 0 015353 752 776sse41gcc_-march=native_-mtune=native_-Os_-fomit-frame-pointer_-fwrapv_-fPIC_-fPIE2020041020200409
167126751 0 016885 768 808ssse3gcc_-march=native_-mtune=native_-O2_-fomit-frame-pointer_-fwrapv_-fPIC_-fPIE2020041020200409
169887212 0 019718 776 808ssse3gcc_-march=native_-mtune=native_-O3_-fomit-frame-pointer_-fwrapv_-fPIC_-fPIE2020041020200409
174169066 4 20818551 772 984vect128gcc_-march=native_-mtune=native_-Os_-fomit-frame-pointer_-fwrapv_-fPIC_-fPIE2020041020200409
175286796 0 019441 776 752sse2clang_-march=native_-O2_-fomit-frame-pointer_-fwrapv_-Qunused-arguments_-fPIC_-fPIE2020041020200409
175446564 0 015809 752 776ssse3gcc_-march=native_-mtune=native_-Os_-fomit-frame-pointer_-fwrapv_-fPIC_-fPIE2020041020200409
176006762 0 015823 768 736sse2clang_-march=native_-Os_-fomit-frame-pointer_-fwrapv_-Qunused-arguments_-fPIC_-fPIE2020041020200409
176366796 0 019441 776 752sse2clang_-march=native_-O_-fomit-frame-pointer_-fwrapv_-Qunused-arguments_-fPIC_-fPIE2020041020200409
176526796 0 020961 776 752sse2clang_-march=native_-O3_-fomit-frame-pointer_-fwrapv_-Qunused-arguments_-fPIC_-fPIE2020041020200409
182846764 0 016877 768 808ssse3gcc_-march=native_-mtune=native_-O_-fomit-frame-pointer_-fwrapv_-fPIC_-fPIE2020041020200409
1852010161 4 20819655 772 984vect128-mmxhackgcc_-march=native_-mtune=native_-Os_-fomit-frame-pointer_-fwrapv_-fPIC_-fPIE2020041020200409
1873614527 4 20827142 780 1016vect128-mmxhackgcc_-march=native_-mtune=native_-O3_-fomit-frame-pointer_-fwrapv_-fPIC_-fPIE2020041020200409
189927972 0 019985 776 736sse2-2clang_-mcpu=native_-O3_-fomit-frame-pointer_-fwrapv_-Qunused-arguments_-fPIC_-fPIE2020041020200409
191927804 0 020294 776 808sse2gcc_-march=native_-mtune=native_-O3_-fomit-frame-pointer_-fwrapv_-fPIC_-fPIE2020041020200409
1922010548 4 20820972 796 1016vect128-mmxhackgcc_-march=native_-mtune=native_-O_-fomit-frame-pointer_-fwrapv_-fPIC_-fPIE2020041020200409
1924810770 4 20821094 780 1016vect128-mmxhackgcc_-march=native_-mtune=native_-O2_-fomit-frame-pointer_-fwrapv_-fPIC_-fPIE2020041020200409
195887126 0 017245 768 808sse2gcc_-march=native_-mtune=native_-O_-fomit-frame-pointer_-fwrapv_-fPIC_-fPIE2020041020200409
197687018 0 016265 752 776sse2gcc_-march=native_-mtune=native_-Os_-fomit-frame-pointer_-fwrapv_-fPIC_-fPIE2020041020200409
200167343 0 017477 768 808sse2gcc_-march=native_-mtune=native_-O2_-fomit-frame-pointer_-fwrapv_-fPIC_-fPIE2020041020200409
201247610 0 019633 776 736sse2clang_-mcpu=native_-O3_-fomit-frame-pointer_-fwrapv_-Qunused-arguments_-fPIC_-fPIE2020041020200409
211128033 0 017281 752 776sse2-2gcc_-march=native_-mtune=native_-Os_-fomit-frame-pointer_-fwrapv_-fPIC_-fPIE2020041020200409
212768748 0 021238 776 808sse2-2gcc_-march=native_-mtune=native_-O3_-fomit-frame-pointer_-fwrapv_-fPIC_-fPIE2020041020200409
214088287 0 018421 768 808sse2-2gcc_-march=native_-mtune=native_-O2_-fomit-frame-pointer_-fwrapv_-fPIC_-fPIE2020041020200409
222527648 0 020265 776 752bswapclang_-march=native_-O_-fomit-frame-pointer_-fwrapv_-Qunused-arguments_-fPIC_-fPIE2020041020200409
223727648 0 020265 776 752bswapclang_-march=native_-O2_-fomit-frame-pointer_-fwrapv_-Qunused-arguments_-fPIC_-fPIE2020041020200409
231007597 0 016647 768 736bswapclang_-march=native_-Os_-fomit-frame-pointer_-fwrapv_-Qunused-arguments_-fPIC_-fPIE2020041020200409
237287648 0 021785 776 752bswapclang_-march=native_-O3_-fomit-frame-pointer_-fwrapv_-Qunused-arguments_-fPIC_-fPIE2020041020200409
238128176 0 018301 768 808sse2-2gcc_-march=native_-mtune=native_-O_-fomit-frame-pointer_-fwrapv_-fPIC_-fPIE2020041020200409
246768779 0 020809 776 736bswapclang_-mcpu=native_-O3_-fomit-frame-pointer_-fwrapv_-Qunused-arguments_-fPIC_-fPIE2020041020200409
272088230 0 021009 776 752sphlib-smallclang_-march=native_-O2_-fomit-frame-pointer_-fwrapv_-Qunused-arguments_-fPIC_-fPIE2020041020200409
277207981 0 017183 768 736sphlib-smallclang_-march=native_-Os_-fomit-frame-pointer_-fwrapv_-Qunused-arguments_-fPIC_-fPIE2020041020200409
277288278 0 022577 776 752sphlib-smallclang_-march=native_-O3_-fomit-frame-pointer_-fwrapv_-Qunused-arguments_-fPIC_-fPIE2020041020200409
279328818 0 021465 776 752regsclang_-march=native_-O2_-fomit-frame-pointer_-fwrapv_-Qunused-arguments_-fPIC_-fPIE2020041020200409
279848230 0 021009 776 752sphlib-smallclang_-march=native_-O_-fomit-frame-pointer_-fwrapv_-Qunused-arguments_-fPIC_-fPIE2020041020200409
282049328 0 021353 776 736regsclang_-mcpu=native_-O3_-fomit-frame-pointer_-fwrapv_-Qunused-arguments_-fPIC_-fPIE2020041020200409
291088818 0 022985 776 752regsclang_-march=native_-O3_-fomit-frame-pointer_-fwrapv_-Qunused-arguments_-fPIC_-fPIE2020041020200409
297008784 0 017847 768 736regsclang_-march=native_-Os_-fomit-frame-pointer_-fwrapv_-Qunused-arguments_-fPIC_-fPIE2020041020200409
299408818 0 021465 776 752regsclang_-march=native_-O_-fomit-frame-pointer_-fwrapv_-Qunused-arguments_-fPIC_-fPIE2020041020200409
311522479 0 011543 768 736refclang_-march=native_-Os_-fomit-frame-pointer_-fwrapv_-Qunused-arguments_-fPIC_-fPIE2020041020200409
319968314 0 020465 776 736sphlib-smallclang_-mcpu=native_-O3_-fomit-frame-pointer_-fwrapv_-Qunused-arguments_-fPIC_-fPIE2020041020200409
330288401 0 018710 776 808sphlib-smallgcc_-march=native_-mtune=native_-O_-fomit-frame-pointer_-fwrapv_-fPIC_-fPIE2020041020200409
3329610018 0 022665 776 752sandyclang_-march=native_-O2_-fomit-frame-pointer_-fwrapv_-Qunused-arguments_-fPIC_-fPIE2020041020200409
3338825430 0 038193 776 752sphlibclang_-march=native_-O_-fomit-frame-pointer_-fwrapv_-Qunused-arguments_-fPIC_-fPIE2020041020200409
3375225312 0 034495 768 736sphlibclang_-march=native_-Os_-fomit-frame-pointer_-fwrapv_-Qunused-arguments_-fPIC_-fPIE2020041020200409
3410025462 0 039745 776 752sphlibclang_-march=native_-O3_-fomit-frame-pointer_-fwrapv_-Qunused-arguments_-fPIC_-fPIE2020041020200409
3455610650 0 019897 752 776sandygcc_-march=native_-mtune=native_-Os_-fomit-frame-pointer_-fwrapv_-fPIC_-fPIE2020041020200409
3463611583 0 021717 768 808sandygcc_-march=native_-mtune=native_-O2_-fomit-frame-pointer_-fwrapv_-fPIC_-fPIE2020041020200409
3509610213 0 022233 776 736sandyclang_-mcpu=native_-O3_-fomit-frame-pointer_-fwrapv_-Qunused-arguments_-fPIC_-fPIE2020041020200409
3538010018 0 022665 776 752sandyclang_-march=native_-O_-fomit-frame-pointer_-fwrapv_-Qunused-arguments_-fPIC_-fPIE2020041020200409
3544825430 0 038193 776 752sphlibclang_-march=native_-O2_-fomit-frame-pointer_-fwrapv_-Qunused-arguments_-fPIC_-fPIE2020041020200409
3559210018 0 024185 776 752sandyclang_-march=native_-O3_-fomit-frame-pointer_-fwrapv_-Qunused-arguments_-fPIC_-fPIE2020041020200409
359249967 0 019031 768 736sandyclang_-march=native_-Os_-fomit-frame-pointer_-fwrapv_-Qunused-arguments_-fPIC_-fPIE2020041020200409
3620811255 0 021373 768 808sandygcc_-march=native_-mtune=native_-O_-fomit-frame-pointer_-fwrapv_-fPIC_-fPIE2020041020200409
3692812427 0 024918 776 808sandygcc_-march=native_-mtune=native_-O3_-fomit-frame-pointer_-fwrapv_-fPIC_-fPIE2020041020200409
3827223869 0 034174 776 808sphlibgcc_-march=native_-mtune=native_-O_-fomit-frame-pointer_-fwrapv_-fPIC_-fPIE2020041020200409
4160823510 0 033870 776 808sphlibgcc_-march=native_-mtune=native_-O2_-fomit-frame-pointer_-fwrapv_-fPIC_-fPIE2020041020200409
4216827713 0 040310 776 808sphlibgcc_-march=native_-mtune=native_-O3_-fomit-frame-pointer_-fwrapv_-fPIC_-fPIE2020041020200409
423362947 0 014969 776 736refclang_-mcpu=native_-O3_-fomit-frame-pointer_-fwrapv_-Qunused-arguments_-fPIC_-fPIE2020041020200409
4257210367 0 020501 768 808bswapgcc_-march=native_-mtune=native_-O2_-fomit-frame-pointer_-fwrapv_-fPIC_-fPIE2020041020200409
4328010575 0 020709 768 808regsgcc_-march=native_-mtune=native_-O2_-fomit-frame-pointer_-fwrapv_-fPIC_-fPIE2020041020200409
4356811211 0 023702 776 808bswapgcc_-march=native_-mtune=native_-O3_-fomit-frame-pointer_-fwrapv_-fPIC_-fPIE2020041020200409
4417610229 0 020349 768 808bswapgcc_-march=native_-mtune=native_-O_-fomit-frame-pointer_-fwrapv_-fPIC_-fPIE2020041020200409
4456811036 0 023526 776 808regsgcc_-march=native_-mtune=native_-O3_-fomit-frame-pointer_-fwrapv_-fPIC_-fPIE2020041020200409
4460824346 0 036481 776 736sphlibclang_-mcpu=native_-O3_-fomit-frame-pointer_-fwrapv_-Qunused-arguments_-fPIC_-fPIE2020041020200409
4480010160 0 019417 752 776regsgcc_-march=native_-mtune=native_-Os_-fomit-frame-pointer_-fwrapv_-fPIC_-fPIE2020041020200409
452249958 0 019209 752 776bswapgcc_-march=native_-mtune=native_-Os_-fomit-frame-pointer_-fwrapv_-fPIC_-fPIE2020041020200409
4663610969 0 021085 768 808regsgcc_-march=native_-mtune=native_-O_-fomit-frame-pointer_-fwrapv_-fPIC_-fPIE2020041020200409
4913622805 0 032169 752 776sphlibgcc_-march=native_-mtune=native_-Os_-fomit-frame-pointer_-fwrapv_-fPIC_-fPIE2020041020200409
515962979 0 013101 768 808refgcc_-march=native_-mtune=native_-O_-fomit-frame-pointer_-fwrapv_-fPIC_-fPIE2020041020200409
559962833 0 012089 752 776refgcc_-march=native_-mtune=native_-Os_-fomit-frame-pointer_-fwrapv_-fPIC_-fPIE2020041020200409
569887494 0 016857 752 776sphlib-smallgcc_-march=native_-mtune=native_-Os_-fomit-frame-pointer_-fwrapv_-fPIC_-fPIE2020041020200409
583603577 0 017737 776 752refclang_-march=native_-O3_-fomit-frame-pointer_-fwrapv_-Qunused-arguments_-fPIC_-fPIE2020041020200409
589323177 0 015817 776 752refclang_-march=native_-O2_-fomit-frame-pointer_-fwrapv_-Qunused-arguments_-fPIC_-fPIE2020041020200409
619963177 0 015817 776 752refclang_-march=native_-O_-fomit-frame-pointer_-fwrapv_-Qunused-arguments_-fPIC_-fPIE2020041020200409
6258813849 0 026446 776 808sphlib-smallgcc_-march=native_-mtune=native_-O3_-fomit-frame-pointer_-fwrapv_-fPIC_-fPIE2020041020200409
632689878 0 020238 776 808sphlib-smallgcc_-march=native_-mtune=native_-O2_-fomit-frame-pointer_-fwrapv_-fPIC_-fPIE2020041020200409
678405028 0 017502 776 808refgcc_-march=native_-mtune=native_-O3_-fomit-frame-pointer_-fwrapv_-fPIC_-fPIE2020041020200409
756803887 0 014021 768 808refgcc_-march=native_-mtune=native_-O2_-fomit-frame-pointer_-fwrapv_-fPIC_-fPIE2020041020200409
4750567641 0 016703 768 736sse2-2clang_-march=native_-Os_-fomit-frame-pointer_-fwrapv_-Qunused-arguments_-fPIC_-fPIE2020041020200409
4751127675 0 020321 776 752sse2-2clang_-march=native_-O2_-fomit-frame-pointer_-fwrapv_-Qunused-arguments_-fPIC_-fPIE2020041020200409
5025207675 0 020321 776 752sse2-2clang_-march=native_-O_-fomit-frame-pointer_-fwrapv_-Qunused-arguments_-fPIC_-fPIE2020041020200409
5186967675 0 021841 776 752sse2-2clang_-march=native_-O3_-fomit-frame-pointer_-fwrapv_-Qunused-arguments_-fPIC_-fPIE2020041020200409

Compiler output

Implementation: avxicc
Security model: unknown
Compiler: clang -march=native -O2 -fomit-frame-pointer -fwrapv -Qunused-arguments -fPIC -fPIE
hash.s: hash.s:219710:31: error: cannot use more than one symbol in memory operand
hash.s: mov esi, offset flat: padding.0 #289.3
hash.s: ^
hash.s: hash.s:219728:31: error: cannot use more than one symbol in memory operand
hash.s: mov esi, offset flat: padding.0 #289.3
hash.s: ^
hash.s: hash.s:221419:31: error: cannot use more than one symbol in memory operand
hash.s: mov esi, offset flat: padding.0 #289.3
hash.s: ^
hash.s: hash.s:221437:31: error: cannot use more than one symbol in memory operand
hash.s: mov esi, offset flat: padding.0 #289.3
hash.s: ^
hash.s: hash.s:223123:31: error: cannot use more than one symbol in memory operand
hash.s: mov esi, offset flat: padding.0+1 #289.3
hash.s: ^

Number of similar (compiler,implementation) pairs: 5, namely:
CompilerImplementations
clang -march=native -O2 -fomit-frame-pointer -fwrapv -Qunused-arguments -fPIC -fPIE avxicc
clang -march=native -O3 -fomit-frame-pointer -fwrapv -Qunused-arguments -fPIC -fPIE avxicc
clang -march=native -O -fomit-frame-pointer -fwrapv -Qunused-arguments -fPIC -fPIE avxicc
clang -march=native -Os -fomit-frame-pointer -fwrapv -Qunused-arguments -fPIC -fPIE avxicc
clang -mcpu=native -O3 -fomit-frame-pointer -fwrapv -Qunused-arguments -fPIC -fPIE avxicc

Compiler output

Implementation: avxicc
Security model: unknown
Compiler: gcc -march=native -mtune=native -O2 -fomit-frame-pointer -fwrapv -fPIC -fPIE
try.c: /usr/bin/ld: crypto_hash_blake256.a(hash.o): relocation R_X86_64_32 against `.rodata' can not be used when making a PIE object; recompile with -fPIC
try.c: /usr/bin/ld: final link failed: Nonrepresentable section on output
try.c: collect2: error: ld returned 1 exit status

Number of similar (compiler,implementation) pairs: 4, namely:
CompilerImplementations
gcc -march=native -mtune=native -O2 -fomit-frame-pointer -fwrapv -fPIC -fPIE avxicc
gcc -march=native -mtune=native -O3 -fomit-frame-pointer -fwrapv -fPIC -fPIE avxicc
gcc -march=native -mtune=native -O -fomit-frame-pointer -fwrapv -fPIC -fPIE avxicc
gcc -march=native -mtune=native -Os -fomit-frame-pointer -fwrapv -fPIC -fPIE avxicc

Compiler output

Implementation: avxs
Security model: unknown
Compiler: clang -march=native -O2 -fomit-frame-pointer -fwrapv -Qunused-arguments -fPIC -fPIE
b256.s: b256.s:98:31: error: unknown token in expression
b256.s: vpshufd xmm4, xmm4, 0b00101101
b256.s: ^
b256.s: b256.s:99:40: error: unknown token in expression
b256.s: vpblendw xmm5, xmm12, xmm13, 0b11000000
b256.s: ^
b256.s: b256.s:101:31: error: unknown token in expression
b256.s: vpshufd xmm5, xmm5, 0b01110010
b256.s: ^
b256.s: b256.s:104:31: error: unknown token in expression
b256.s: vpshufd xmm6, xmm6, 0b01001011
b256.s: ^
b256.s: b256.s:106:39: error: unknown token in expression
b256.s: vpblendw xmm7, xmm7, xmm13, 0b00000011
b256.s: ^
b256.s: b256.s:153:40: error: unknown token in expression
b256.s: vpblendw xmm4, xmm13, xmm11, 0b00001100
b256.s: ^
b256.s: b256.s:155:31: error: unknown token in expression
b256.s: vpshufd xmm4, xmm4, 0b11010010
b256.s: ^
b256.s: b256.s:156:40: error: unknown token in expression
b256.s: vpblendw xmm5, xmm10, xmm13, 0b00001100
b256.s: ^
b256.s: b256.s:158:31: error: unknown token in expression
b256.s: ...

Number of similar (compiler,implementation) pairs: 4, namely:
CompilerImplementations
clang -march=native -O2 -fomit-frame-pointer -fwrapv -Qunused-arguments -fPIC -fPIE avxs
clang -march=native -O3 -fomit-frame-pointer -fwrapv -Qunused-arguments -fPIC -fPIE avxs
clang -march=native -O -fomit-frame-pointer -fwrapv -Qunused-arguments -fPIC -fPIE avxs
clang -march=native -Os -fomit-frame-pointer -fwrapv -Qunused-arguments -fPIC -fPIE avxs

Compiler output

Implementation: avxs
Security model: unknown
Compiler: clang -mcpu=native -O3 -fomit-frame-pointer -fwrapv -Qunused-arguments -fPIC -fPIE
hash.c: hash.c:154:61: error: always_inline function '_mm_shuffle_epi8' requires target feature 'ssse3', but would be inlined into function 'blake256_final' that is compiled without support for 'ssse3'
hash.c: __m128i w0 = _mm_load_si128((__m128i*)(&S->h[0])); w0 = _mm_shuffle_epi8(w0, u32to8);
hash.c: ^
hash.c: hash.c:155:61: error: always_inline function '_mm_shuffle_epi8' requires target feature 'ssse3', but would be inlined into function 'blake256_final' that is compiled without support for 'ssse3'
hash.c: __m128i w1 = _mm_load_si128((__m128i*)(&S->h[4])); w1 = _mm_shuffle_epi8(w1, u32to8);
hash.c: ^
hash.c: 2 errors generated.

Number of similar (compiler,implementation) pairs: 1, namely:
CompilerImplementations
clang -mcpu=native -O3 -fomit-frame-pointer -fwrapv -Qunused-arguments -fPIC -fPIE avxs

Compiler output

Implementation: avxs
Security model: unknown
Compiler: gcc -march=native -mtune=native -O2 -fomit-frame-pointer -fwrapv -fPIC -fPIE
try.c: /usr/bin/ld: crypto_hash_blake256.a(b256.o): relocation R_X86_64_32S against `.rodata' can not be used when making a PIE object; recompile with -fPIC
try.c: /usr/bin/ld: final link failed: Nonrepresentable section on output
try.c: collect2: error: ld returned 1 exit status

Number of similar (compiler,implementation) pairs: 4, namely:
CompilerImplementations
gcc -march=native -mtune=native -O2 -fomit-frame-pointer -fwrapv -fPIC -fPIE avxs
gcc -march=native -mtune=native -O3 -fomit-frame-pointer -fwrapv -fPIC -fPIE avxs
gcc -march=native -mtune=native -O -fomit-frame-pointer -fwrapv -fPIC -fPIE avxs
gcc -march=native -mtune=native -Os -fomit-frame-pointer -fwrapv -fPIC -fPIE avxs

Compiler output

Implementation: sse41
Security model: unknown
Compiler: clang -march=native -O2 -fomit-frame-pointer -fwrapv -Qunused-arguments -fPIC -fPIE
hash.c: In file included from hash.c:121:
hash.c: ./rounds.sse41.h:17:22: warning: implicit conversion from 'long' to 'int' changes value from 3964562569 to -330404727 [-Wconstant-conversion]
hash.c: buf2 = _mm_set_epi32(3964562569, 698298832, 57701188, 2242054355);
hash.c: ~~~~~~~~~~~~~ ^~~~~~~~~~
hash.c: ./rounds.sse41.h:17:55: warning: implicit conversion from 'long' to 'int' changes value from 2242054355 to -2052912941 [-Wconstant-conversion]
hash.c: buf2 = _mm_set_epi32(3964562569, 698298832, 57701188, 2242054355);
hash.c: ~~~~~~~~~~~~~ ^~~~~~~~~~
hash.c: ./rounds.sse41.h:20:33: warning: implicit conversion from 'long' to 'int' changes value from 2752067618 to -1542899678 [-Wconstant-conversion]
hash.c: buf1 = _mm_set_epi32(137296536, 2752067618, 320440878, 608135816);
hash.c: ~~~~~~~~~~~~~ ^~~~~~~~~~
hash.c: ./rounds.sse41.h:47:22: warning: implicit conversion from 'long' to 'int' changes value from 3041331479 to -1253635817 [-Wconstant-conversion]
hash.c: buf2 = _mm_set_epi32(3041331479, 3380367581, 887688300, 953160567);
hash.c: ~~~~~~~~~~~~~ ^~~~~~~~~~
hash.c: ./rounds.sse41.h:47:34: warning: implicit conversion from 'long' to 'int' changes value from 3380367581 to -914599715 [-Wconstant-conversion]
hash.c: buf2 = _mm_set_epi32(3041331479, 3380367581, 887688300, 953160567);
hash.c: ~~~~~~~~~~~~~ ^~~~~~~~~~
hash.c: ./rounds.sse41.h:50:34: warning: implicit conversion from 'long' to 'int' changes value from 3232508343 to -1062458953 [-Wconstant-conversion]
hash.c: buf1 = _mm_set_epi32(1065670069, 3232508343, 3193202383, 1160258022);
hash.c: ~~~~~~~~~~~~~ ^~~~~~~~~~
hash.c: ./rounds.sse41.h:50:46: warning: implicit conversion from 'long' to 'int' changes value from 3193202383 to -1101764913 [-Wconstant-conversion]
hash.c: buf1 = _mm_set_epi32(1065670069, 3232508343, 3193202383, 1160258022);
hash.c: ~~~~~~~~~~~~~ ^~~~~~~~~~
hash.c: ./rounds.sse41.h:81:33: warning: implicit conversion from 'long' to 'int' changes value from 3041331479 to -1253635817 [-Wconstant-conversion]
hash.c: buf2 = _mm_set_epi32(137296536, 3041331479, 1160258022, 3193202383);
hash.c: ~~~~~~~~~~~~~ ^~~~~~~~~~
hash.c: ...

Number of similar (compiler,implementation) pairs: 5, namely:
CompilerImplementations
clang -march=native -O2 -fomit-frame-pointer -fwrapv -Qunused-arguments -fPIC -fPIE sse41
clang -march=native -O3 -fomit-frame-pointer -fwrapv -Qunused-arguments -fPIC -fPIE sse41
clang -march=native -O -fomit-frame-pointer -fwrapv -Qunused-arguments -fPIC -fPIE sse41
clang -march=native -Os -fomit-frame-pointer -fwrapv -Qunused-arguments -fPIC -fPIE sse41
clang -mcpu=native -O3 -fomit-frame-pointer -fwrapv -Qunused-arguments -fPIC -fPIE sse41

Compiler output

Implementation: sse41-2
Security model: unknown
Compiler: clang -march=native -O2 -fomit-frame-pointer -fwrapv -Qunused-arguments -fPIC -fPIE
hash.c: In file included from hash.c:2:
hash.c: ./blake256.h:105:15: warning: '_mm_roti_epi32' macro redefined [-Wmacro-redefined]
hash.c: #define _mm_roti_epi32(r, c) ((8==-c) ? _mm_shuffle_epi8(r,r8) : ( (16==-c) ? _mm_shuffle_epi8(r,r16) : _mm_xor_si128(_mm_srli_epi32( (r), -(c) ),_mm_slli_epi32( (r), 32-(-c) )) ) )
hash.c: ^
hash.c: /usr/lib/llvm-6.0/lib/clang/6.0.0/include/xopintrin.h:246:9: note: previous definition is here
hash.c: #define _mm_roti_epi32(A, N) __extension__ ({ \
hash.c: ^
hash.c: 1 warning generated.

Number of similar (compiler,implementation) pairs: 4, namely:
CompilerImplementations
clang -march=native -O2 -fomit-frame-pointer -fwrapv -Qunused-arguments -fPIC -fPIE sse41-2
clang -march=native -O3 -fomit-frame-pointer -fwrapv -Qunused-arguments -fPIC -fPIE sse41-2
clang -march=native -O -fomit-frame-pointer -fwrapv -Qunused-arguments -fPIC -fPIE sse41-2
clang -march=native -Os -fomit-frame-pointer -fwrapv -Qunused-arguments -fPIC -fPIE sse41-2

Compiler output

Implementation: sse41-2
Security model: unknown
Compiler: clang -mcpu=native -O3 -fomit-frame-pointer -fwrapv -Qunused-arguments -fPIC -fPIE
hash.c: In file included from hash.c:2:
hash.c: ./blake256.h:105:15: warning: '_mm_roti_epi32' macro redefined [-Wmacro-redefined]
hash.c: #define _mm_roti_epi32(r, c) ((8==-c) ? _mm_shuffle_epi8(r,r8) : ( (16==-c) ? _mm_shuffle_epi8(r,r16) : _mm_xor_si128(_mm_srli_epi32( (r), -(c) ),_mm_slli_epi32( (r), 32-(-c) )) ) )
hash.c: ^
hash.c: /usr/lib/llvm-6.0/lib/clang/6.0.0/include/xopintrin.h:246:9: note: previous definition is here
hash.c: #define _mm_roti_epi32(A, N) __extension__ ({ \
hash.c: ^
hash.c: hash.c:93:22: error: always_inline function '_mm_shuffle_epi8' requires target feature 'ssse3', but would be inlined into function 'blake256_compress' that is compiled without support for 'ssse3'
hash.c: const __m128i m0 = _mm_shuffle_epi8(LOADU(datablock + 00), u8to32);
hash.c: ^
hash.c: hash.c:94:22: error: always_inline function '_mm_shuffle_epi8' requires target feature 'ssse3', but would be inlined into function 'blake256_compress' that is compiled without support for 'ssse3'
hash.c: const __m128i m1 = _mm_shuffle_epi8(LOADU(datablock + 16), u8to32);
hash.c: ^
hash.c: hash.c:95:22: error: always_inline function '_mm_shuffle_epi8' requires target feature 'ssse3', but would be inlined into function 'blake256_compress' that is compiled without support for 'ssse3'
hash.c: const __m128i m2 = _mm_shuffle_epi8(LOADU(datablock + 32), u8to32);
hash.c: ^
hash.c: hash.c:96:22: error: always_inline function '_mm_shuffle_epi8' requires target feature 'ssse3', but would be inlined into function 'blake256_compress' that is compiled without support for 'ssse3'
hash.c: const __m128i m3 = _mm_shuffle_epi8(LOADU(datablock + 48), u8to32);
hash.c: ^
hash.c: hash.c:115:3: error: always_inline function '_mm_shuffle_epi8' requires target feature 'ssse3', but would be inlined into function 'blake256_compress' that is compiled without support for 'ssse3'
hash.c: ROUND( 0);
hash.c: ^
hash.c: ./rounds.h:52:3: note: expanded from macro 'ROUND'
hash.c: G1(row1,row2,row3,row4,buf1); \
hash.c: ^
hash.c: ...

Number of similar (compiler,implementation) pairs: 1, namely:
CompilerImplementations
clang -mcpu=native -O3 -fomit-frame-pointer -fwrapv -Qunused-arguments -fPIC -fPIE sse41-2

Compiler output

Implementation: ssse3
Security model: unknown
Compiler: clang -march=native -O2 -fomit-frame-pointer -fwrapv -Qunused-arguments -fPIC -fPIE
hash.c: In file included from hash.c:122:
hash.c: ./rounds.ssse3.h:3:22: warning: implicit conversion from 'long' to 'int' changes value from 3964562569 to -330404727 [-Wconstant-conversion]
hash.c: buf2 = _mm_set_epi32(3964562569, 698298832, 57701188, 2242054355);
hash.c: ~~~~~~~~~~~~~ ^~~~~~~~~~
hash.c: ./rounds.ssse3.h:3:55: warning: implicit conversion from 'long' to 'int' changes value from 2242054355 to -2052912941 [-Wconstant-conversion]
hash.c: buf2 = _mm_set_epi32(3964562569, 698298832, 57701188, 2242054355);
hash.c: ~~~~~~~~~~~~~ ^~~~~~~~~~
hash.c: ./rounds.ssse3.h:6:33: warning: implicit conversion from 'long' to 'int' changes value from 2752067618 to -1542899678 [-Wconstant-conversion]
hash.c: buf1 = _mm_set_epi32(137296536, 2752067618, 320440878, 608135816);
hash.c: ~~~~~~~~~~~~~ ^~~~~~~~~~
hash.c: ./rounds.ssse3.h:27:22: warning: implicit conversion from 'long' to 'int' changes value from 3041331479 to -1253635817 [-Wconstant-conversion]
hash.c: buf2 = _mm_set_epi32(3041331479, 3380367581, 887688300, 953160567);
hash.c: ~~~~~~~~~~~~~ ^~~~~~~~~~
hash.c: ./rounds.ssse3.h:27:34: warning: implicit conversion from 'long' to 'int' changes value from 3380367581 to -914599715 [-Wconstant-conversion]
hash.c: buf2 = _mm_set_epi32(3041331479, 3380367581, 887688300, 953160567);
hash.c: ~~~~~~~~~~~~~ ^~~~~~~~~~
hash.c: ./rounds.ssse3.h:30:34: warning: implicit conversion from 'long' to 'int' changes value from 3232508343 to -1062458953 [-Wconstant-conversion]
hash.c: buf1 = _mm_set_epi32(1065670069, 3232508343, 3193202383, 1160258022);
hash.c: ~~~~~~~~~~~~~ ^~~~~~~~~~
hash.c: ./rounds.ssse3.h:30:46: warning: implicit conversion from 'long' to 'int' changes value from 3193202383 to -1101764913 [-Wconstant-conversion]
hash.c: buf1 = _mm_set_epi32(1065670069, 3232508343, 3193202383, 1160258022);
hash.c: ~~~~~~~~~~~~~ ^~~~~~~~~~
hash.c: ./rounds.ssse3.h:51:33: warning: implicit conversion from 'long' to 'int' changes value from 3041331479 to -1253635817 [-Wconstant-conversion]
hash.c: buf2 = _mm_set_epi32(137296536, 3041331479, 1160258022, 3193202383);
hash.c: ~~~~~~~~~~~~~ ^~~~~~~~~~
hash.c: ...

Number of similar (compiler,implementation) pairs: 5, namely:
CompilerImplementations
clang -march=native -O2 -fomit-frame-pointer -fwrapv -Qunused-arguments -fPIC -fPIE ssse3
clang -march=native -O3 -fomit-frame-pointer -fwrapv -Qunused-arguments -fPIC -fPIE ssse3
clang -march=native -O -fomit-frame-pointer -fwrapv -Qunused-arguments -fPIC -fPIE ssse3
clang -march=native -Os -fomit-frame-pointer -fwrapv -Qunused-arguments -fPIC -fPIE ssse3
clang -mcpu=native -O3 -fomit-frame-pointer -fwrapv -Qunused-arguments -fPIC -fPIE ssse3

Compiler output

Implementation: vect128
Security model: unknown
Compiler: clang -march=native -O2 -fomit-frame-pointer -fwrapv -Qunused-arguments -fPIC -fPIE
vector.c: vector.c:389:3: error: use of unknown builtin '__builtin_ia32_punpckldq128' [-Wimplicit-function-declaration]
vector.c: v32_interleave_inplace(M0,M2);
vector.c: ^
vector.c: ./vector.h:1038:17: note: expanded from macro 'v32_interleave_inplace'
vector.c: v32 c__ = v32_interleavel (a__, b__); \
vector.c: ^
vector.c: ./vector.h:100:27: note: expanded from macro 'v32_interleavel'
vector.c: #define v32_interleavel __builtin_ia32_punpckldq128
vector.c: ^
vector.c: vector.c:389:3: error: initializing 'v32' (aka 'v4si') with an expression of incompatible type 'int'
vector.c: v32_interleave_inplace(M0,M2);
vector.c: ^~~~~~~~~~~~~~~~~~~~~~~~~~~~~
vector.c: ./vector.h:1038:11: note: expanded from macro 'v32_interleave_inplace'
vector.c: v32 c__ = v32_interleavel (a__, b__); \
vector.c: ^ ~~~~~~~~~~~~~~~~~~~~~~~~~~
vector.c: vector.c:389:3: error: use of unknown builtin '__builtin_ia32_punpckhdq128' [-Wimplicit-function-declaration]
vector.c: ./vector.h:1039:17: note: expanded from macro 'v32_interleave_inplace'
vector.c: v32 d__ = v32_interleaveh (a__, b__); \
vector.c: ^
vector.c: ./vector.h:101:27: note: expanded from macro 'v32_interleaveh'
vector.c: #define v32_interleaveh __builtin_ia32_punpckhdq128
vector.c: ^
vector.c: vector.c:389:3: note: did you mean '__builtin_ia32_punpckldq128'?
vector.c: ./vector.h:1039:17: note: expanded from macro 'v32_interleave_inplace'
vector.c: v32 d__ = v32_interleaveh (a__, b__); \
vector.c: ...

Number of similar (compiler,implementation) pairs: 5, namely:
CompilerImplementations
clang -march=native -O2 -fomit-frame-pointer -fwrapv -Qunused-arguments -fPIC -fPIE vect128
clang -march=native -O3 -fomit-frame-pointer -fwrapv -Qunused-arguments -fPIC -fPIE vect128
clang -march=native -O -fomit-frame-pointer -fwrapv -Qunused-arguments -fPIC -fPIE vect128
clang -march=native -Os -fomit-frame-pointer -fwrapv -Qunused-arguments -fPIC -fPIE vect128
clang -mcpu=native -O3 -fomit-frame-pointer -fwrapv -Qunused-arguments -fPIC -fPIE vect128

Compiler output

Implementation: vect128-mmxhack
Security model: unknown
Compiler: clang -march=native -O2 -fomit-frame-pointer -fwrapv -Qunused-arguments -fPIC -fPIE
vector.c: vector.c:203:8: error: use of unknown builtin '__builtin_ia32_pshufd' [-Wimplicit-function-declaration]
vector.c: M0 = v32_shufrot(M0,1);
vector.c: ^
vector.c: ./vector.h:151:26: note: expanded from macro 'v32_shufrot'
vector.c: #define v32_shufrot(x,s) v32_shuf(x,XCAT(SHUFROT_,s))
vector.c: ^
vector.c: ./vector.h:140:18: note: expanded from macro 'v32_shuf'
vector.c: #define v32_shuf __builtin_ia32_pshufd
vector.c: ^
vector.c: vector.c:203:8: note: did you mean '__builtin_ia32_psubd'?
vector.c: ./vector.h:151:26: note: expanded from macro 'v32_shufrot'
vector.c: #define v32_shufrot(x,s) v32_shuf(x,XCAT(SHUFROT_,s))
vector.c: ^
vector.c: ./vector.h:140:18: note: expanded from macro 'v32_shuf'
vector.c: #define v32_shuf __builtin_ia32_pshufd
vector.c: ^
vector.c: /usr/lib/llvm-6.0/lib/clang/6.0.0/include/mmintrin.h:560:19: note: '__builtin_ia32_psubd' declared here
vector.c: return (__m64)__builtin_ia32_psubd((__v2si)__m1, (__v2si)__m2);
vector.c: ^
vector.c: vector.c:203:6: error: assigning to 'v32' (aka 'v4si') from incompatible type 'int'
vector.c: M0 = v32_shufrot(M0,1);
vector.c: ^ ~~~~~~~~~~~~~~~~~
vector.c: vector.c:205:6: error: assigning to 'v32' (aka 'v4si') from incompatible type 'int'
vector.c: M0 = v32_shufrot(M0,1);
vector.c: ^ ~~~~~~~~~~~~~~~~~
vector.c: ...

Number of similar (compiler,implementation) pairs: 5, namely:
CompilerImplementations
clang -march=native -O2 -fomit-frame-pointer -fwrapv -Qunused-arguments -fPIC -fPIE vect128-mmxhack
clang -march=native -O3 -fomit-frame-pointer -fwrapv -Qunused-arguments -fPIC -fPIE vect128-mmxhack
clang -march=native -O -fomit-frame-pointer -fwrapv -Qunused-arguments -fPIC -fPIE vect128-mmxhack
clang -march=native -Os -fomit-frame-pointer -fwrapv -Qunused-arguments -fPIC -fPIE vect128-mmxhack
clang -mcpu=native -O3 -fomit-frame-pointer -fwrapv -Qunused-arguments -fPIC -fPIE vect128-mmxhack

Compiler output

Implementation: xop
Security model: unknown
Compiler: clang -march=native -O2 -fomit-frame-pointer -fwrapv -Qunused-arguments -fPIC -fPIE
hash.c: hash.c:115:3: error: always_inline function '_mm_perm_epi8' requires target feature 'fma4', but would be inlined into function 'blake256_compress' that is compiled without support for 'fma4'
hash.c: ROUND( 0);
hash.c: ^
hash.c: ./rounds.h:51:3: note: expanded from macro 'ROUND'
hash.c: LOAD_MSG_ ##r ##_1(buf1); \
hash.c: ^
hash.c: <scratch space>:393:1: note: expanded from here
hash.c: LOAD_MSG_0_1
hash.c: ^
hash.c: ./load.xop.h:19:6: note: expanded from macro 'LOAD_MSG_0_1'
hash.c: s0 = _mm_perm_epi8(m0, m1, _mm_set_epi32(TOB(6),TOB(4),TOB(2),TOB(0)) ); \
hash.c: ^
hash.c: hash.c:115:3: error: '__builtin_ia32_vprotdi' needs target feature xop
hash.c: ./rounds.h:52:3: note: expanded from macro 'ROUND'
hash.c: G1(row1,row2,row3,row4,buf1); \
hash.c: ^
hash.c: ./rounds.h:8:10: note: expanded from macro 'G1'
hash.c: row4 = _mm_roti_epi32(row4, -16); \
hash.c: ^
hash.c: /usr/lib/llvm-6.0/lib/clang/6.0.0/include/xopintrin.h:247:12: note: expanded from macro '_mm_roti_epi32'
hash.c: (__m128i)__builtin_ia32_vprotdi((__v4si)(__m128i)(A), (N)); })
hash.c: ^
hash.c: hash.c:115:3: error: '__builtin_ia32_vprotdi' needs target feature xop
hash.c: ./rounds.h:52:3: note: expanded from macro 'ROUND'
hash.c: G1(row1,row2,row3,row4,buf1); \
hash.c: ...

Number of similar (compiler,implementation) pairs: 3, namely:
CompilerImplementations
clang -march=native -O2 -fomit-frame-pointer -fwrapv -Qunused-arguments -fPIC -fPIE xop
clang -march=native -O3 -fomit-frame-pointer -fwrapv -Qunused-arguments -fPIC -fPIE xop
clang -march=native -O -fomit-frame-pointer -fwrapv -Qunused-arguments -fPIC -fPIE xop

Compiler output

Implementation: xop
Security model: unknown
Compiler: clang -march=native -Os -fomit-frame-pointer -fwrapv -Qunused-arguments -fPIC -fPIE
hash.c: hash.c:115:3: error: always_inline function '_mm_perm_epi8' requires target feature 'fma4', but would be inlined into function 'blake256_compress' that is compiled without support for 'fma4'
hash.c: ROUND( 0);
hash.c: ^
hash.c: ./rounds.h:51:3: note: expanded from macro 'ROUND'
hash.c: LOAD_MSG_ ##r ##_1(buf1); \
hash.c: ^
hash.c: <scratch space>:388:1: note: expanded from here
hash.c: LOAD_MSG_0_1
hash.c: ^
hash.c: ./load.xop.h:19:6: note: expanded from macro 'LOAD_MSG_0_1'
hash.c: s0 = _mm_perm_epi8(m0, m1, _mm_set_epi32(TOB(6),TOB(4),TOB(2),TOB(0)) ); \
hash.c: ^
hash.c: hash.c:115:3: error: '__builtin_ia32_vprotdi' needs target feature xop
hash.c: ./rounds.h:52:3: note: expanded from macro 'ROUND'
hash.c: G1(row1,row2,row3,row4,buf1); \
hash.c: ^
hash.c: ./rounds.h:8:10: note: expanded from macro 'G1'
hash.c: row4 = _mm_roti_epi32(row4, -16); \
hash.c: ^
hash.c: /usr/lib/llvm-6.0/lib/clang/6.0.0/include/xopintrin.h:247:12: note: expanded from macro '_mm_roti_epi32'
hash.c: (__m128i)__builtin_ia32_vprotdi((__v4si)(__m128i)(A), (N)); })
hash.c: ^
hash.c: hash.c:115:3: error: '__builtin_ia32_vprotdi' needs target feature xop
hash.c: ./rounds.h:52:3: note: expanded from macro 'ROUND'
hash.c: G1(row1,row2,row3,row4,buf1); \
hash.c: ...

Number of similar (compiler,implementation) pairs: 1, namely:
CompilerImplementations
clang -march=native -Os -fomit-frame-pointer -fwrapv -Qunused-arguments -fPIC -fPIE xop

Compiler output

Implementation: xop
Security model: unknown
Compiler: clang -mcpu=native -O3 -fomit-frame-pointer -fwrapv -Qunused-arguments -fPIC -fPIE
hash.c: hash.c:93:22: error: always_inline function '_mm_shuffle_epi8' requires target feature 'ssse3', but would be inlined into function 'blake256_compress' that is compiled without support for 'ssse3'
hash.c: const __m128i m0 = _mm_shuffle_epi8(LOADU(datablock + 00), u8to32);
hash.c: ^
hash.c: hash.c:94:22: error: always_inline function '_mm_shuffle_epi8' requires target feature 'ssse3', but would be inlined into function 'blake256_compress' that is compiled without support for 'ssse3'
hash.c: const __m128i m1 = _mm_shuffle_epi8(LOADU(datablock + 16), u8to32);
hash.c: ^
hash.c: hash.c:95:22: error: always_inline function '_mm_shuffle_epi8' requires target feature 'ssse3', but would be inlined into function 'blake256_compress' that is compiled without support for 'ssse3'
hash.c: const __m128i m2 = _mm_shuffle_epi8(LOADU(datablock + 32), u8to32);
hash.c: ^
hash.c: hash.c:96:22: error: always_inline function '_mm_shuffle_epi8' requires target feature 'ssse3', but would be inlined into function 'blake256_compress' that is compiled without support for 'ssse3'
hash.c: const __m128i m3 = _mm_shuffle_epi8(LOADU(datablock + 48), u8to32);
hash.c: ^
hash.c: hash.c:115:3: error: always_inline function '_mm_perm_epi8' requires target feature 'sse4a', but would be inlined into function 'blake256_compress' that is compiled without support for 'sse4a'
hash.c: ROUND( 0);
hash.c: ^
hash.c: ./rounds.h:51:3: note: expanded from macro 'ROUND'
hash.c: LOAD_MSG_ ##r ##_1(buf1); \
hash.c: ^
hash.c: <scratch space>:393:1: note: expanded from here
hash.c: LOAD_MSG_0_1
hash.c: ^
hash.c: ./load.xop.h:19:6: note: expanded from macro 'LOAD_MSG_0_1'
hash.c: s0 = _mm_perm_epi8(m0, m1, _mm_set_epi32(TOB(6),TOB(4),TOB(2),TOB(0)) ); \
hash.c: ^
hash.c: hash.c:115:3: error: '__builtin_ia32_vprotdi' needs target feature xop
hash.c: ...

Number of similar (compiler,implementation) pairs: 1, namely:
CompilerImplementations
clang -mcpu=native -O3 -fomit-frame-pointer -fwrapv -Qunused-arguments -fPIC -fPIE xop

Compiler output

Implementation: xop
Security model: unknown
Compiler: gcc -march=native -mtune=native -O2 -fomit-frame-pointer -fwrapv -fPIC -fPIE
hash.c: In file included from /usr/lib/gcc/x86_64-linux-gnu/7/include/x86intrin.h:54:0,
hash.c: from blake256.h:7,
hash.c: from hash.c:2:
hash.c: hash.c: In function 'blake256_compress':
hash.c: /usr/lib/gcc/x86_64-linux-gnu/7/include/xopintrin.h:260:1: error: inlining failed in call to always_inline '_mm_roti_epi32': target specific option mismatch
hash.c: _mm_roti_epi32(__m128i __A, const int __B)
hash.c: ^~~~~~~~~~~~~~
hash.c: In file included from blake256.h:127:0,
hash.c: from hash.c:2:
hash.c: rounds.h:19:8: note: called from here
hash.c: row2 = _mm_roti_epi32(row2, -7); \
hash.c: ^
hash.c: rounds.h:59:3: note: in expansion of macro 'G2'
hash.c: G2(row1,row2,row3,row4,buf4); \
hash.c: ^~
hash.c: hash.c:128:3: note: in expansion of macro 'ROUND'
hash.c: ROUND(13);
hash.c: ^~~~~
hash.c: In file included from /usr/lib/gcc/x86_64-linux-gnu/7/include/x86intrin.h:54:0,
hash.c: from blake256.h:7,
hash.c: from hash.c:2:
hash.c: /usr/lib/gcc/x86_64-linux-gnu/7/include/xopintrin.h:260:1: error: inlining failed in call to always_inline '_mm_roti_epi32': target specific option mismatch
hash.c: _mm_roti_epi32(__m128i __A, const int __B)
hash.c: ^~~~~~~~~~~~~~
hash.c: In file included from blake256.h:127:0,
hash.c: ...

Number of similar (compiler,implementation) pairs: 4, namely:
CompilerImplementations
gcc -march=native -mtune=native -O2 -fomit-frame-pointer -fwrapv -fPIC -fPIE xop
gcc -march=native -mtune=native -O3 -fomit-frame-pointer -fwrapv -fPIC -fPIE xop
gcc -march=native -mtune=native -O -fomit-frame-pointer -fwrapv -fPIC -fPIE xop
gcc -march=native -mtune=native -Os -fomit-frame-pointer -fwrapv -fPIC -fPIE xop

Namespace violations

Implementation: sphlib
Security model: unknown
Compiler: clang -march=native -O2 -fomit-frame-pointer -fwrapv -Qunused-arguments -fPIC -fPIE
blake.o sph_blake224 T
blake.o sph_blake224_addbits_and_close T
blake.o sph_blake224_close T
blake.o sph_blake224_init T
blake.o sph_blake256 T
blake.o sph_blake256_addbits_and_close T
blake.o sph_blake256_close T
blake.o sph_blake256_init T
blake.o sph_blake384 T
blake.o sph_blake384_addbits_and_close T
blake.o sph_blake384_close T
blake.o sph_blake384_init T
blake.o sph_blake512 T
blake.o sph_blake512_addbits_and_close T
blake.o sph_blake512_close T
blake.o sph_blake512_init T

Number of similar (compiler,implementation) pairs: 18, namely:
CompilerImplementations
clang -march=native -O2 -fomit-frame-pointer -fwrapv -Qunused-arguments -fPIC -fPIE sphlib
clang -march=native -O3 -fomit-frame-pointer -fwrapv -Qunused-arguments -fPIC -fPIE sphlib
clang -march=native -O -fomit-frame-pointer -fwrapv -Qunused-arguments -fPIC -fPIE sphlib
clang -march=native -Os -fomit-frame-pointer -fwrapv -Qunused-arguments -fPIC -fPIE sphlib
clang -mcpu=native -O3 -fomit-frame-pointer -fwrapv -Qunused-arguments -fPIC -fPIE sphlib
gcc -march=native -mtune=native -O2 -fomit-frame-pointer -fwrapv -fPIC -fPIE sphlib
gcc -march=native -mtune=native -O3 -fomit-frame-pointer -fwrapv -fPIC -fPIE sphlib
gcc -march=native -mtune=native -O -fomit-frame-pointer -fwrapv -fPIC -fPIE sphlib
gcc -march=native -mtune=native -Os -fomit-frame-pointer -fwrapv -fPIC -fPIE sphlib
clang -march=native -O2 -fomit-frame-pointer -fwrapv -Qunused-arguments -fPIC -fPIE sphlib-small
clang -march=native -O3 -fomit-frame-pointer -fwrapv -Qunused-arguments -fPIC -fPIE sphlib-small
clang -march=native -O -fomit-frame-pointer -fwrapv -Qunused-arguments -fPIC -fPIE sphlib-small
clang -march=native -Os -fomit-frame-pointer -fwrapv -Qunused-arguments -fPIC -fPIE sphlib-small
clang -mcpu=native -O3 -fomit-frame-pointer -fwrapv -Qunused-arguments -fPIC -fPIE sphlib-small
gcc -march=native -mtune=native -O2 -fomit-frame-pointer -fwrapv -fPIC -fPIE sphlib-small
gcc -march=native -mtune=native -O3 -fomit-frame-pointer -fwrapv -fPIC -fPIE sphlib-small
gcc -march=native -mtune=native -O -fomit-frame-pointer -fwrapv -fPIC -fPIE sphlib-small
gcc -march=native -mtune=native -Os -fomit-frame-pointer -fwrapv -fPIC -fPIE sphlib-small

Namespace violations

Implementation: vect128
Security model: unknown
Compiler: gcc -march=native -mtune=native -O2 -fomit-frame-pointer -fwrapv -fPIC -fPIE
nist.o Final T
nist.o Hash T
nist.o IncreaseCounter T
nist.o Init T
nist.o InitIV T
nist.o Update T
vector.o Blake_Compress T
vector.o RequiredAlignment T
vector.o SupportedLength T
vector.o VERSION T
vector.o blake256_final T
vector.o blake256_init T
vector.o blake256_update T
vector.o crypto_hash T
vector.o cst R
vector.o padding R
vector.o print_m32 T
vector.o print_m64 T
vector.o round256 T
vector.o sigma R

Number of similar (compiler,implementation) pairs: 8, namely:
CompilerImplementations
gcc -march=native -mtune=native -O2 -fomit-frame-pointer -fwrapv -fPIC -fPIE vect128
gcc -march=native -mtune=native -O3 -fomit-frame-pointer -fwrapv -fPIC -fPIE vect128
gcc -march=native -mtune=native -O -fomit-frame-pointer -fwrapv -fPIC -fPIE vect128
gcc -march=native -mtune=native -Os -fomit-frame-pointer -fwrapv -fPIC -fPIE vect128
gcc -march=native -mtune=native -O2 -fomit-frame-pointer -fwrapv -fPIC -fPIE vect128-mmxhack
gcc -march=native -mtune=native -O3 -fomit-frame-pointer -fwrapv -fPIC -fPIE vect128-mmxhack
gcc -march=native -mtune=native -O -fomit-frame-pointer -fwrapv -fPIC -fPIE vect128-mmxhack
gcc -march=native -mtune=native -Os -fomit-frame-pointer -fwrapv -fPIC -fPIE vect128-mmxhack