Implementation notes: amd64, h6sandy, crypto_aead/seakeyakv2

Computer: h6sandy
Microarchitecture: amd64; Sandy Bridge (206a7)
Architecture: amd64
CPU ID: GenuineIntel-000206a7-bfebfbff
SUPERCOP version: 20240425
Operation: crypto_aead
Primitive: seakeyakv2
TimeObject sizeTest sizeImplementationCompilerBenchmark dateSUPERCOP version
24016186495 0 0190476 812 1088T:SandyBridgegcc_-march=native_-mtune=native_-O3_-fomit-frame-pointer_-fwrapv_-fPIC_-fPIE2024042720240425
24112148735 0 0152676 812 1088T:Nehalemgcc_-march=native_-mtune=native_-O3_-fomit-frame-pointer_-fwrapv_-fPIC_-fPIE2024042720240425
24135176678 0 0181644 812 1088T:SandyBridgegcc_-march=native_-mtune=native_-O2_-fomit-frame-pointer_-fwrapv_-fPIC_-fPIE2024042720240425
24446174513 0 0178940 812 1088T:SandyBridgegcc_-march=native_-mtune=native_-O_-fomit-frame-pointer_-fwrapv_-fPIC_-fPIE2024042720240425
24553139086 0 0144020 812 1088T:Nehalemgcc_-march=native_-mtune=native_-O2_-fomit-frame-pointer_-fwrapv_-fPIC_-fPIE2024042720240425
24611190332 0 0190347 844 1024T:SandyBridgeclang_-march=native_-O3_-fomit-frame-pointer_-fwrapv_-Qunused-arguments_-fPIC_-fPIE2024042720240425
24699186599 0 0186339 844 1024T:SandyBridgeclang_-march=native_-O2_-fomit-frame-pointer_-fwrapv_-Qunused-arguments_-fPIC_-fPIE2024042720240425
24707169780 0 0173813 836 1024T:SandyBridgeclang_-march=native_-Os_-fomit-frame-pointer_-fwrapv_-Qunused-arguments_-fPIC_-fPIE2024042720240425
24788180694 0 0184363 844 1024T:SandyBridgeclang_-march=native_-O_-fomit-frame-pointer_-fwrapv_-Qunused-arguments_-fPIC_-fPIE2024042720240425
24827148183 0 0148107 844 1024T:Nehalemclang_-march=native_-O2_-fomit-frame-pointer_-fwrapv_-Qunused-arguments_-fPIC_-fPIE2024042720240425
24831151916 0 0152115 844 1024T:Nehalemclang_-march=native_-O3_-fomit-frame-pointer_-fwrapv_-Qunused-arguments_-fPIC_-fPIE2024042720240425
25374136750 0 0141140 812 1088T:Nehalemgcc_-march=native_-mtune=native_-O_-fomit-frame-pointer_-fwrapv_-fPIC_-fPIE2024042720240425
25493131822 0 0135949 836 1024T:Nehalemclang_-march=native_-Os_-fomit-frame-pointer_-fwrapv_-Qunused-arguments_-fPIC_-fPIE2024042720240425
25602142278 0 0146131 844 1024T:Nehalemclang_-march=native_-O_-fomit-frame-pointer_-fwrapv_-Qunused-arguments_-fPIC_-fPIE2024042720240425
25735165399 0 0170532 804 1056T:SandyBridgegcc_-march=native_-mtune=native_-Os_-fomit-frame-pointer_-fwrapv_-fPIC_-fPIE2024042720240425
27176127654 0 0132780 804 1056T:Nehalemgcc_-march=native_-mtune=native_-Os_-fomit-frame-pointer_-fwrapv_-fPIC_-fPIE2024042720240425
41588147508 0 0148603 844 1024T:generic64lcclang_-march=native_-O3_-fomit-frame-pointer_-fwrapv_-Qunused-arguments_-fPIC_-fPIE2024042720240425
41803143383 0 0144179 844 1024T:generic64lcclang_-march=native_-O2_-fomit-frame-pointer_-fwrapv_-Qunused-arguments_-fPIC_-fPIE2024042720240425
41863136993 0 0140259 844 1024T:generic64lcclang_-march=native_-O_-fomit-frame-pointer_-fwrapv_-Qunused-arguments_-fPIC_-fPIE2024042720240425
42947126014 0 0129557 836 1024T:generic64lcclang_-march=native_-Os_-fomit-frame-pointer_-fwrapv_-Qunused-arguments_-fPIC_-fPIE2024042720240425
45735148536 0 0149643 844 1024T:generic64clang_-march=native_-O3_-fomit-frame-pointer_-fwrapv_-Qunused-arguments_-fPIC_-fPIE2024042720240425
46025144411 0 0145219 844 1024T:generic64clang_-march=native_-O2_-fomit-frame-pointer_-fwrapv_-Qunused-arguments_-fPIC_-fPIE2024042720240425
46162139757 0 0143035 844 1024T:generic64clang_-march=native_-O_-fomit-frame-pointer_-fwrapv_-Qunused-arguments_-fPIC_-fPIE2024042720240425
46451130632 0 0134181 836 1024T:generic64clang_-march=native_-Os_-fomit-frame-pointer_-fwrapv_-Qunused-arguments_-fPIC_-fPIE2024042720240425
47909142588 0 0142859 844 1024T:generic64lcclang_-mcpu=native_-O3_-fomit-frame-pointer_-fwrapv_-Qunused-arguments_-fPIC_-fPIE2024042720240425
50965131298 0 0135732 812 1088T:generic64lcgcc_-march=native_-mtune=native_-O2_-fomit-frame-pointer_-fwrapv_-fPIC_-fPIE2024042720240425
51231141963 0 0146260 812 1088T:generic64lcgcc_-march=native_-mtune=native_-O3_-fomit-frame-pointer_-fwrapv_-fPIC_-fPIE2024042720240425
51426117321 0 0121839 788 1056T:generic64lcgcc_-march=native_-mtune=native_-Os_-fomit-frame-pointer_-fwrapv_-fPIC_-fPIE2024042720240425
51513128291 0 0132308 812 1088T:generic64lcgcc_-march=native_-mtune=native_-O_-fomit-frame-pointer_-fwrapv_-fPIC_-fPIE2024042720240425
51866144395 0 0144667 844 1024T:generic64clang_-mcpu=native_-O3_-fomit-frame-pointer_-fwrapv_-Qunused-arguments_-fPIC_-fPIE2024042720240425
53631120335 0 0124839 788 1056T:generic64gcc_-march=native_-mtune=native_-Os_-fomit-frame-pointer_-fwrapv_-fPIC_-fPIE2024042720240425
53807131934 0 0135916 812 1088T:generic64gcc_-march=native_-mtune=native_-O_-fomit-frame-pointer_-fwrapv_-fPIC_-fPIE2024042720240425
53860135038 0 0139436 812 1088T:generic64gcc_-march=native_-mtune=native_-O2_-fomit-frame-pointer_-fwrapv_-fPIC_-fPIE2024042720240425
54426144425 0 0148708 812 1088T:generic64gcc_-march=native_-mtune=native_-O3_-fomit-frame-pointer_-fwrapv_-fPIC_-fPIE2024042720240425
5654867035 0 1264878 860 1024T:referenceclang_-march=native_-O2_-fomit-frame-pointer_-fwrapv_-Qunused-arguments_-fPIC_-fPIE2024042720240425
5766571667 0 1269750 860 1024T:referenceclang_-march=native_-O3_-fomit-frame-pointer_-fwrapv_-Qunused-arguments_-fPIC_-fPIE2024042720240425
6183470920 0 1268166 860 1024T:referenceclang_-mcpu=native_-O3_-fomit-frame-pointer_-fwrapv_-Qunused-arguments_-fPIC_-fPIE2024042720240425
6523363070 0 067363 844 1024T:compactclang_-march=native_-O3_-fomit-frame-pointer_-fwrapv_-Qunused-arguments_-fPIC_-fPIE2024042720240425
6673062740 0 065755 844 1024T:compactclang_-mcpu=native_-O3_-fomit-frame-pointer_-fwrapv_-Qunused-arguments_-fPIC_-fPIE2024042720240425
11094570741 0 075412 812 1088T:compactgcc_-march=native_-mtune=native_-O3_-fomit-frame-pointer_-fwrapv_-fPIC_-fPIE2024042720240425
11129465284 0 1666783 828 1088T:referencegcc_-march=native_-mtune=native_-O3_-fomit-frame-pointer_-fwrapv_-fPIC_-fPIE2024042720240425
12522159886 0 063243 844 1024T:compactclang_-march=native_-O2_-fomit-frame-pointer_-fwrapv_-Qunused-arguments_-fPIC_-fPIE2024042720240425
12573279263 0 083667 820 1088T:generic32gcc_-march=native_-mtune=native_-O3_-fomit-frame-pointer_-fwrapv_-fPIC_-fPIE2024042720240425
12852780547 0 084987 820 1088T:generic32lcgcc_-march=native_-mtune=native_-O3_-fomit-frame-pointer_-fwrapv_-fPIC_-fPIE2024042720240425
13133283996 0 084979 844 1024T:generic32lcclang_-march=native_-O3_-fomit-frame-pointer_-fwrapv_-Qunused-arguments_-fPIC_-fPIE2024042720240425
13148679687 0 080371 844 1024T:generic32lcclang_-march=native_-O2_-fomit-frame-pointer_-fwrapv_-Qunused-arguments_-fPIC_-fPIE2024042720240425
13238782244 0 083195 844 1024T:generic32clang_-march=native_-O3_-fomit-frame-pointer_-fwrapv_-Qunused-arguments_-fPIC_-fPIE2024042720240425
13267377935 0 078587 844 1024T:generic32clang_-march=native_-O2_-fomit-frame-pointer_-fwrapv_-Qunused-arguments_-fPIC_-fPIE2024042720240425
14203482663 0 082667 844 1024T:generic32lcclang_-mcpu=native_-O3_-fomit-frame-pointer_-fwrapv_-Qunused-arguments_-fPIC_-fPIE2024042720240425
14267281199 0 081203 844 1024T:generic32clang_-mcpu=native_-O3_-fomit-frame-pointer_-fwrapv_-Qunused-arguments_-fPIC_-fPIE2024042720240425
14635658547 0 063190 796 1056T:generic32gcc_-march=native_-mtune=native_-Os_-fomit-frame-pointer_-fwrapv_-fPIC_-fPIE2024042720240425
14658259110 0 063758 796 1056T:generic32lcgcc_-march=native_-mtune=native_-Os_-fomit-frame-pointer_-fwrapv_-fPIC_-fPIE2024042720240425
15247168604 0 071899 844 1024T:generic32clang_-march=native_-O_-fomit-frame-pointer_-fwrapv_-Qunused-arguments_-fPIC_-fPIE2024042720240425
15379869252 0 072547 844 1024T:generic32lcclang_-march=native_-O_-fomit-frame-pointer_-fwrapv_-Qunused-arguments_-fPIC_-fPIE2024042720240425
15495962465 0 066045 836 1024T:generic32lcclang_-march=native_-Os_-fomit-frame-pointer_-fwrapv_-Qunused-arguments_-fPIC_-fPIE2024042720240425
15520962490 0 066061 836 1024T:generic32clang_-march=native_-Os_-fomit-frame-pointer_-fwrapv_-Qunused-arguments_-fPIC_-fPIE2024042720240425
15544570394 0 074971 820 1088T:generic32lcgcc_-march=native_-mtune=native_-O2_-fomit-frame-pointer_-fwrapv_-fPIC_-fPIE2024042720240425
15568369830 0 074371 820 1088T:generic32gcc_-march=native_-mtune=native_-O2_-fomit-frame-pointer_-fwrapv_-fPIC_-fPIE2024042720240425
15709067186 0 071323 820 1088T:generic32gcc_-march=native_-mtune=native_-O_-fomit-frame-pointer_-fwrapv_-fPIC_-fPIE2024042720240425
15925067722 0 071883 820 1088T:generic32lcgcc_-march=native_-mtune=native_-O_-fomit-frame-pointer_-fwrapv_-fPIC_-fPIE2024042720240425
20683143595 0 049415 788 1056T:compactgcc_-march=native_-mtune=native_-Os_-fomit-frame-pointer_-fwrapv_-fPIC_-fPIE2024042720240425
21242050730 0 056131 844 1024T:compactclang_-march=native_-O_-fomit-frame-pointer_-fwrapv_-Qunused-arguments_-fPIC_-fPIE2024042720240425
22732351214 0 057156 812 1088T:compactgcc_-march=native_-mtune=native_-O_-fomit-frame-pointer_-fwrapv_-fPIC_-fPIE2024042720240425
23379353986 0 060092 812 1088T:compactgcc_-march=native_-mtune=native_-O2_-fomit-frame-pointer_-fwrapv_-fPIC_-fPIE2024042720240425
26496345064 0 050789 836 1024T:compactclang_-march=native_-Os_-fomit-frame-pointer_-fwrapv_-Qunused-arguments_-fPIC_-fPIE2024042720240425
39696258892 0 1259302 860 1024T:referenceclang_-march=native_-O_-fomit-frame-pointer_-fwrapv_-Qunused-arguments_-fPIC_-fPIE2024042720240425
42029359939 0 1662175 828 1088T:referencegcc_-march=native_-mtune=native_-O2_-fomit-frame-pointer_-fwrapv_-fPIC_-fPIE2024042720240425
68465052780 0 1254341 852 1024T:referenceclang_-march=native_-Os_-fomit-frame-pointer_-fwrapv_-Qunused-arguments_-fPIC_-fPIE2024042720240425
70199258522 0 1660095 828 1088T:referencegcc_-march=native_-mtune=native_-O_-fomit-frame-pointer_-fwrapv_-fPIC_-fPIE2024042720240425
83946548613 0 1651287 804 1056T:referencegcc_-march=native_-mtune=native_-Os_-fomit-frame-pointer_-fwrapv_-fPIC_-fPIE2024042720240425
105755244688 648 575587 1828 1024T:refnewclang++_-march=native_-O3_-fomit-frame-pointer_-fwrapv_-Qunused-arguments_-fPIC_-fPIE2024042720240425
108523267088 584 598301 2196 1120T:refg++_-march=native_-mtune=native_-O3_-fomit-frame-pointer_-fwrapv_-fPIC_-fPIE2024042720240425
108602840842 552 571455 1732 1024T:refclang++_-march=native_-O3_-fomit-frame-pointer_-fwrapv_-Qunused-arguments_-fPIC_-fPIE2024042720240425
108851436866 552 565531 1732 1024T:refclang++_-march=native_-O2_-fomit-frame-pointer_-fwrapv_-Qunused-arguments_-fPIC_-fPIE2024042720240425
108912938533 648 567491 1828 1024T:refnewclang++_-march=native_-O2_-fomit-frame-pointer_-fwrapv_-Qunused-arguments_-fPIC_-fPIE2024042720240425
109577769653 680 5101071 2316 1120T:refnewg++_-march=native_-mtune=native_-O3_-fomit-frame-pointer_-fwrapv_-fPIC_-fPIE2024042720240425
130742755061 648 585808 2308 1120T:refnewg++_-march=native_-mtune=native_-O2_-fomit-frame-pointer_-fwrapv_-fPIC_-fPIE2024042720240425
131243653096 552 583643 2188 1120T:refg++_-march=native_-mtune=native_-O2_-fomit-frame-pointer_-fwrapv_-fPIC_-fPIE2024042720240425
134227334467 552 561298 1740 1024T:refclang++_-march=native_-O_-fomit-frame-pointer_-fwrapv_-Qunused-arguments_-fPIC_-fPIE2024042720240425
135590435225 648 562354 1836 1024T:refnewclang++_-march=native_-O_-fomit-frame-pointer_-fwrapv_-Qunused-arguments_-fPIC_-fPIE2024042720240425
162375069557 0 1671191 828 1088T:reference32bitsgcc_-march=native_-mtune=native_-O3_-fomit-frame-pointer_-fwrapv_-fPIC_-fPIE2024042720240425
169147829484 648 554509 1772 1024T:refnewclang++_-march=native_-Os_-fomit-frame-pointer_-fwrapv_-Qunused-arguments_-fPIC_-fPIE2024042720240425
170123828912 552 553817 1676 1024T:refclang++_-march=native_-Os_-fomit-frame-pointer_-fwrapv_-Qunused-arguments_-fPIC_-fPIE2024042720240425
208339162628 0 1664975 828 1088T:reference32bitsgcc_-march=native_-mtune=native_-O2_-fomit-frame-pointer_-fwrapv_-fPIC_-fPIE2024042720240425
243418475524 0 1273662 860 1024T:reference32bitsclang_-march=native_-O3_-fomit-frame-pointer_-fwrapv_-Qunused-arguments_-fPIC_-fPIE2024042720240425
246601775081 0 1272366 860 1024T:reference32bitsclang_-mcpu=native_-O3_-fomit-frame-pointer_-fwrapv_-Qunused-arguments_-fPIC_-fPIE2024042720240425
268527662893 0 1263342 860 1024T:reference32bitsclang_-march=native_-O_-fomit-frame-pointer_-fwrapv_-Qunused-arguments_-fPIC_-fPIE2024042720240425
273812168900 0 1266782 860 1024T:reference32bitsclang_-march=native_-O2_-fomit-frame-pointer_-fwrapv_-Qunused-arguments_-fPIC_-fPIE2024042720240425
295389660811 0 1662479 828 1088T:reference32bitsgcc_-march=native_-mtune=native_-O_-fomit-frame-pointer_-fwrapv_-fPIC_-fPIE2024042720240425
308461850100 648 579369 2300 1120T:refnewg++_-march=native_-mtune=native_-O_-fomit-frame-pointer_-fwrapv_-fPIC_-fPIE2024042720240425
308775648666 552 577881 2188 1120T:refg++_-march=native_-mtune=native_-O_-fomit-frame-pointer_-fwrapv_-fPIC_-fPIE2024042720240425
309483550717 0 1653463 804 1056T:reference32bitsgcc_-march=native_-mtune=native_-Os_-fomit-frame-pointer_-fwrapv_-fPIC_-fPIE2024042720240425
325936254446 0 1256093 852 1024T:reference32bitsclang_-march=native_-Os_-fomit-frame-pointer_-fwrapv_-Qunused-arguments_-fPIC_-fPIE2024042720240425
484615824912 552 551671 1668 1088T:refg++_-march=native_-mtune=native_-Os_-fomit-frame-pointer_-fwrapv_-fPIC_-fPIE2024042720240425
485297225521 648 552517 1764 1088T:refnewg++_-march=native_-mtune=native_-Os_-fomit-frame-pointer_-fwrapv_-fPIC_-fPIE2024042720240425

Compiler output

Implementation: T:Bulldozer
Security model: timingleaks
Compiler: clang -march=native -O2 -fomit-frame-pointer -fwrapv -Qunused-arguments -fPIC -fPIE
KeccakP-1600-XOP.c: KeccakP-1600-XOP.c:402:5: error: '__builtin_ia32_vprotqi' needs target feature xop
KeccakP-1600-XOP.c: rounds12
KeccakP-1600-XOP.c: ^
KeccakP-1600-XOP.c: ./KeccakP-1600-unrolling.macros:46:5: note: expanded from macro 'rounds12'
KeccakP-1600-XOP.c: thetaRhoPiChiIotaPrepareTheta(12, A, E) \
KeccakP-1600-XOP.c: ^
KeccakP-1600-XOP.c: KeccakP-1600-XOP.c:200:5: note: expanded from macro 'thetaRhoPiChiIotaPrepareTheta'
KeccakP-1600-XOP.c: computeD \
KeccakP-1600-XOP.c: ^
KeccakP-1600-XOP.c: KeccakP-1600-XOP.c:187:23: note: expanded from macro 'computeD'
KeccakP-1600-XOP.c: Dei = XOR128(Cae, ROL6464same(Cio, 1)); \
KeccakP-1600-XOP.c: ^
KeccakP-1600-XOP.c: KeccakP-1600-XOP.c:60:29: note: expanded from macro 'ROL6464same'
KeccakP-1600-XOP.c: #define ROL6464same(a, o) _mm_roti_epi64(a, o)
KeccakP-1600-XOP.c: ^
KeccakP-1600-XOP.c: /usr/lib/llvm-14/lib/clang/14.0.0/include/xopintrin.h:237:13: note: expanded from macro '_mm_roti_epi64'
KeccakP-1600-XOP.c: ((__m128i)__builtin_ia32_vprotqi((__v2di)(__m128i)(A), (N)))
KeccakP-1600-XOP.c: ^
KeccakP-1600-XOP.c: KeccakP-1600-XOP.c:402:5: error: '__builtin_ia32_vprotqi' needs target feature xop
KeccakP-1600-XOP.c: ./KeccakP-1600-unrolling.macros:46:5: note: expanded from macro 'rounds12'
KeccakP-1600-XOP.c: thetaRhoPiChiIotaPrepareTheta(12, A, E) \
KeccakP-1600-XOP.c: ^
KeccakP-1600-XOP.c: KeccakP-1600-XOP.c:200:5: note: expanded from macro 'thetaRhoPiChiIotaPrepareTheta'
KeccakP-1600-XOP.c: computeD \
KeccakP-1600-XOP.c: ^
KeccakP-1600-XOP.c: ...

Number of similar (compiler,implementation) pairs: 5, namely:
CompilerImplementations
clang -march=native -O2 -fomit-frame-pointer -fwrapv -Qunused-arguments -fPIC -fPIE T:Bulldozer
clang -march=native -O3 -fomit-frame-pointer -fwrapv -Qunused-arguments -fPIC -fPIE T:Bulldozer
clang -march=native -O -fomit-frame-pointer -fwrapv -Qunused-arguments -fPIC -fPIE T:Bulldozer
clang -march=native -Os -fomit-frame-pointer -fwrapv -Qunused-arguments -fPIC -fPIE T:Bulldozer
clang -mcpu=native -O3 -fomit-frame-pointer -fwrapv -Qunused-arguments -fPIC -fPIE T:Bulldozer

Compiler output

Implementation: T:Bulldozer
Security model: timingleaks
Compiler: gcc -march=native -mtune=native -O2 -fomit-frame-pointer -fwrapv -fPIC -fPIE
KeccakP-1600-XOP.c: In file included from /usr/lib/gcc/x86_64-linux-gnu/11/include/x86intrin.h:38,
KeccakP-1600-XOP.c: from KeccakP-1600-XOP.c:32:
KeccakP-1600-XOP.c: KeccakP-1600-XOP.c: In function 'KeccakP1600_Permute_12rounds':
KeccakP-1600-XOP.c: /usr/lib/gcc/x86_64-linux-gnu/11/include/xopintrin.h:272:1: error: inlining failed in call to 'always_inline' '_mm_roti_epi64': target specific option mismatch
KeccakP-1600-XOP.c: 272 | _mm_roti_epi64(__m128i __A, const int __B)
KeccakP-1600-XOP.c: | ^~~~~~~~~~~~~~
KeccakP-1600-XOP.c: KeccakP-1600-XOP.c:60:29: note: called from here
KeccakP-1600-XOP.c: 60 | #define ROL6464same(a, o) _mm_roti_epi64(a, o)
KeccakP-1600-XOP.c: | ^~~~~~~~~~~~~~~~~~~~
KeccakP-1600-XOP.c: KeccakP-1600-XOP.c:250:13: note: in expansion of macro 'ROL6464same'
KeccakP-1600-XOP.c: 250 | Bsusa = ROL6464same(Bsusa, 2); \
KeccakP-1600-XOP.c: | ^~~~~~~~~~~
KeccakP-1600-XOP.c: KeccakP-1600-XOP.c:270:36: note: in expansion of macro 'thetaRhoPiChiIotaPrepareTheta'
KeccakP-1600-XOP.c: 270 | #define thetaRhoPiChiIota(i, A, E) thetaRhoPiChiIotaPrepareTheta(i, A, E)
KeccakP-1600-XOP.c: | ^~~~~~~~~~~~~~~~~~~~~~~~~~~~~
KeccakP-1600-XOP.c: KeccakP-1600-unrolling.macros:57:5: note: in expansion of macro 'thetaRhoPiChiIota'
KeccakP-1600-XOP.c: 57 | thetaRhoPiChiIota(23, E, A) \
KeccakP-1600-XOP.c: | ^~~~~~~~~~~~~~~~~
KeccakP-1600-XOP.c: KeccakP-1600-XOP.c:402:5: note: in expansion of macro 'rounds12'
KeccakP-1600-XOP.c: 402 | rounds12
KeccakP-1600-XOP.c: | ^~~~~~~~
KeccakP-1600-XOP.c: In file included from /usr/lib/gcc/x86_64-linux-gnu/11/include/x86intrin.h:38,
KeccakP-1600-XOP.c: from KeccakP-1600-XOP.c:32:
KeccakP-1600-XOP.c: /usr/lib/gcc/x86_64-linux-gnu/11/include/xopintrin.h:245:1: error: inlining failed in call to 'always_inline' '_mm_rot_epi64': target specific option mismatch
KeccakP-1600-XOP.c: 245 | _mm_rot_epi64(__m128i __A, __m128i __B)
KeccakP-1600-XOP.c: ...

Number of similar (compiler,implementation) pairs: 4, namely:
CompilerImplementations
gcc -march=native -mtune=native -O2 -fomit-frame-pointer -fwrapv -fPIC -fPIE T:Bulldozer
gcc -march=native -mtune=native -O3 -fomit-frame-pointer -fwrapv -fPIC -fPIE T:Bulldozer
gcc -march=native -mtune=native -O -fomit-frame-pointer -fwrapv -fPIC -fPIE T:Bulldozer
gcc -march=native -mtune=native -Os -fomit-frame-pointer -fwrapv -fPIC -fPIE T:Bulldozer

Compiler output

Implementation: T:Haswell
Security model: timingleaks
Compiler: clang -march=native -O2 -fomit-frame-pointer -fwrapv -Qunused-arguments -fPIC -fPIE
KeccakP-1600-times4-SIMD256.c: KeccakP-1600-times4-SIMD256.c:146:9: error: always_inline function '_mm256_xor_si256' requires target feature 'avx2', but would be inlined into function 'KeccakP1600times4_AddLanesAll' that is compiled without support for 'avx2'
KeccakP-1600-times4-SIMD256.c: Xor_In4( 0 );
KeccakP-1600-times4-SIMD256.c: ^
KeccakP-1600-times4-SIMD256.c: KeccakP-1600-times4-SIMD256.c:140:33: note: expanded from macro 'Xor_In4'
KeccakP-1600-times4-SIMD256.c: XOReq256( stateAsLanes[argIndex+0], lanes0 ),\
KeccakP-1600-times4-SIMD256.c: ^
KeccakP-1600-times4-SIMD256.c: KeccakP-1600-times4-SIMD256.c:55:41: note: expanded from macro 'XOReq256'
KeccakP-1600-times4-SIMD256.c: #define XOReq256(a, b) a = _mm256_xor_si256(a, b)
KeccakP-1600-times4-SIMD256.c: ^
KeccakP-1600-times4-SIMD256.c: KeccakP-1600-times4-SIMD256.c:146:9: error: always_inline function '_mm256_xor_si256' requires target feature 'avx2', but would be inlined into function 'KeccakP1600times4_AddLanesAll' that is compiled without support for 'avx2'
KeccakP-1600-times4-SIMD256.c: KeccakP-1600-times4-SIMD256.c:141:33: note: expanded from macro 'Xor_In4'
KeccakP-1600-times4-SIMD256.c: XOReq256( stateAsLanes[argIndex+1], lanes1 ),\
KeccakP-1600-times4-SIMD256.c: ^
KeccakP-1600-times4-SIMD256.c: KeccakP-1600-times4-SIMD256.c:55:41: note: expanded from macro 'XOReq256'
KeccakP-1600-times4-SIMD256.c: #define XOReq256(a, b) a = _mm256_xor_si256(a, b)
KeccakP-1600-times4-SIMD256.c: ^
KeccakP-1600-times4-SIMD256.c: KeccakP-1600-times4-SIMD256.c:146:9: error: always_inline function '_mm256_xor_si256' requires target feature 'avx2', but would be inlined into function 'KeccakP1600times4_AddLanesAll' that is compiled without support for 'avx2'
KeccakP-1600-times4-SIMD256.c: KeccakP-1600-times4-SIMD256.c:142:33: note: expanded from macro 'Xor_In4'
KeccakP-1600-times4-SIMD256.c: XOReq256( stateAsLanes[argIndex+2], lanes2 ),\
KeccakP-1600-times4-SIMD256.c: ^
KeccakP-1600-times4-SIMD256.c: KeccakP-1600-times4-SIMD256.c:55:41: note: expanded from macro 'XOReq256'
KeccakP-1600-times4-SIMD256.c: #define XOReq256(a, b) a = _mm256_xor_si256(a, b)
KeccakP-1600-times4-SIMD256.c: ^
KeccakP-1600-times4-SIMD256.c: KeccakP-1600-times4-SIMD256.c:146:9: error: always_inline function '_mm256_xor_si256' requires target feature 'avx2', but would be inlined into function 'KeccakP1600times4_AddLanesAll' that is compiled without support for 'avx2'
KeccakP-1600-times4-SIMD256.c: KeccakP-1600-times4-SIMD256.c:143:33: note: expanded from macro 'Xor_In4'
KeccakP-1600-times4-SIMD256.c: ...

Number of similar (compiler,implementation) pairs: 4, namely:
CompilerImplementations
clang -march=native -O2 -fomit-frame-pointer -fwrapv -Qunused-arguments -fPIC -fPIE T:Haswell
clang -march=native -O3 -fomit-frame-pointer -fwrapv -Qunused-arguments -fPIC -fPIE T:Haswell
clang -march=native -O -fomit-frame-pointer -fwrapv -Qunused-arguments -fPIC -fPIE T:Haswell
clang -march=native -Os -fomit-frame-pointer -fwrapv -Qunused-arguments -fPIC -fPIE T:Haswell

Compiler output

Implementation: T:Haswell
Security model: timingleaks
Compiler: clang -mcpu=native -O3 -fomit-frame-pointer -fwrapv -Qunused-arguments -fPIC -fPIE
KeccakP-1600-times2-SIMD128.c: KeccakP-1600-times2-SIMD128.c:801:5: error: always_inline function '_mm_shuffle_epi8' requires target feature 'ssse3', but would be inlined into function 'KeccakP1600times2_PermuteAll_24rounds' that is compiled without support for 'ssse3'
KeccakP-1600-times2-SIMD128.c: rounds24
KeccakP-1600-times2-SIMD128.c: ^
KeccakP-1600-times2-SIMD128.c: ./KeccakP-1600-unrolling.macros:157:9: note: expanded from macro 'rounds24'
KeccakP-1600-times2-SIMD128.c: thetaRhoPiChiIotaPrepareTheta(i , A, E) \
KeccakP-1600-times2-SIMD128.c: ^
KeccakP-1600-times2-SIMD128.c: KeccakP-1600-times2-SIMD128.c:532:11: note: expanded from macro 'thetaRhoPiChiIotaPrepareTheta'
KeccakP-1600-times2-SIMD128.c: Bko = ROL64in128_8(A##mu); \
KeccakP-1600-times2-SIMD128.c: ^
KeccakP-1600-times2-SIMD128.c: KeccakP-1600-times2-SIMD128.c:48:37: note: expanded from macro 'ROL64in128_8'
KeccakP-1600-times2-SIMD128.c: #define ROL64in128_8(a) _mm_shuffle_epi8(a, CONST128(rho8))
KeccakP-1600-times2-SIMD128.c: ^
KeccakP-1600-times2-SIMD128.c: KeccakP-1600-times2-SIMD128.c:801:5: error: always_inline function '_mm_shuffle_epi8' requires target feature 'ssse3', but would be inlined into function 'KeccakP1600times2_PermuteAll_24rounds' that is compiled without support for 'ssse3'
KeccakP-1600-times2-SIMD128.c: ./KeccakP-1600-unrolling.macros:157:9: note: expanded from macro 'rounds24'
KeccakP-1600-times2-SIMD128.c: thetaRhoPiChiIotaPrepareTheta(i , A, E) \
KeccakP-1600-times2-SIMD128.c: ^
KeccakP-1600-times2-SIMD128.c: KeccakP-1600-times2-SIMD128.c:557:11: note: expanded from macro 'thetaRhoPiChiIotaPrepareTheta'
KeccakP-1600-times2-SIMD128.c: Bmu = ROL64in128_56(A##so); \
KeccakP-1600-times2-SIMD128.c: ^
KeccakP-1600-times2-SIMD128.c: KeccakP-1600-times2-SIMD128.c:49:37: note: expanded from macro 'ROL64in128_56'
KeccakP-1600-times2-SIMD128.c: #define ROL64in128_56(a) _mm_shuffle_epi8(a, CONST128(rho56))
KeccakP-1600-times2-SIMD128.c: ^
KeccakP-1600-times2-SIMD128.c: KeccakP-1600-times2-SIMD128.c:801:5: error: always_inline function '_mm_shuffle_epi8' requires target feature 'ssse3', but would be inlined into function 'KeccakP1600times2_PermuteAll_24rounds' that is compiled without support for 'ssse3'
KeccakP-1600-times2-SIMD128.c: ./KeccakP-1600-unrolling.macros:158:9: note: expanded from macro 'rounds24'
KeccakP-1600-times2-SIMD128.c: thetaRhoPiChiIotaPrepareTheta(i+1, E, A) \
KeccakP-1600-times2-SIMD128.c: ...

Number of similar (compiler,implementation) pairs: 2, namely:
CompilerImplementations
clang -mcpu=native -O3 -fomit-frame-pointer -fwrapv -Qunused-arguments -fPIC -fPIE T:Haswell T:Nehalem

Compiler output

Implementation: T:Haswell
Security model: timingleaks
Compiler: gcc -march=native -mtune=native -O2 -fomit-frame-pointer -fwrapv -fPIC -fPIE
KeccakP-1600-times4-SIMD256.c: In file included from /usr/lib/gcc/x86_64-linux-gnu/11/include/immintrin.h:47,
KeccakP-1600-times4-SIMD256.c: from KeccakP-1600-times4-SIMD256.c:21:
KeccakP-1600-times4-SIMD256.c: KeccakP-1600-times4-SIMD256.c: In function 'KeccakP1600times4_AddLanesAll':
KeccakP-1600-times4-SIMD256.c: /usr/lib/gcc/x86_64-linux-gnu/11/include/avx2intrin.h:913:1: error: inlining failed in call to 'always_inline' '_mm256_xor_si256': target specific option mismatch
KeccakP-1600-times4-SIMD256.c: 913 | _mm256_xor_si256 (__m256i __A, __m256i __B)
KeccakP-1600-times4-SIMD256.c: | ^~~~~~~~~~~~~~~~
KeccakP-1600-times4-SIMD256.c: KeccakP-1600-times4-SIMD256.c:55:41: note: called from here
KeccakP-1600-times4-SIMD256.c: 55 | #define XOReq256(a, b) a = _mm256_xor_si256(a, b)
KeccakP-1600-times4-SIMD256.c: | ^~~~~~~~~~~~~~~~~~~~~~
KeccakP-1600-times4-SIMD256.c: KeccakP-1600-times4-SIMD256.c:143:33: note: in expansion of macro 'XOReq256'
KeccakP-1600-times4-SIMD256.c: 143 | XOReq256( stateAsLanes[argIndex+3], lanes3 )
KeccakP-1600-times4-SIMD256.c: | ^~~~~~~~
KeccakP-1600-times4-SIMD256.c: KeccakP-1600-times4-SIMD256.c:149:9: note: in expansion of macro 'Xor_In4'
KeccakP-1600-times4-SIMD256.c: 149 | Xor_In4( 12 );
KeccakP-1600-times4-SIMD256.c: | ^~~~~~~
KeccakP-1600-times4-SIMD256.c: In file included from /usr/lib/gcc/x86_64-linux-gnu/11/include/immintrin.h:47,
KeccakP-1600-times4-SIMD256.c: from KeccakP-1600-times4-SIMD256.c:21:
KeccakP-1600-times4-SIMD256.c: /usr/lib/gcc/x86_64-linux-gnu/11/include/avx2intrin.h:913:1: error: inlining failed in call to 'always_inline' '_mm256_xor_si256': target specific option mismatch
KeccakP-1600-times4-SIMD256.c: 913 | _mm256_xor_si256 (__m256i __A, __m256i __B)
KeccakP-1600-times4-SIMD256.c: | ^~~~~~~~~~~~~~~~
KeccakP-1600-times4-SIMD256.c: KeccakP-1600-times4-SIMD256.c:55:41: note: called from here
KeccakP-1600-times4-SIMD256.c: 55 | #define XOReq256(a, b) a = _mm256_xor_si256(a, b)
KeccakP-1600-times4-SIMD256.c: | ^~~~~~~~~~~~~~~~~~~~~~
KeccakP-1600-times4-SIMD256.c: KeccakP-1600-times4-SIMD256.c:142:33: note: in expansion of macro 'XOReq256'
KeccakP-1600-times4-SIMD256.c: 142 | XOReq256( stateAsLanes[argIndex+2], lanes2 ),\
KeccakP-1600-times4-SIMD256.c: ...

Number of similar (compiler,implementation) pairs: 4, namely:
CompilerImplementations
gcc -march=native -mtune=native -O2 -fomit-frame-pointer -fwrapv -fPIC -fPIE T:Haswell
gcc -march=native -mtune=native -O3 -fomit-frame-pointer -fwrapv -fPIC -fPIE T:Haswell
gcc -march=native -mtune=native -O -fomit-frame-pointer -fwrapv -fPIC -fPIE T:Haswell
gcc -march=native -mtune=native -Os -fomit-frame-pointer -fwrapv -fPIC -fPIE T:Haswell

Compiler output

Implementation: T:KnightsLanding
Security model: timingleaks
Compiler: clang -march=native -O2 -fomit-frame-pointer -fwrapv -Qunused-arguments -fPIC -fPIE
KeccakP-1600-AVX512.c: KeccakP-1600-AVX512.c:476:5: error: always_inline function '_mm512_set_epi64' requires target feature 'avx512f', but would be inlined into function 'KeccakP1600_Permute_12rounds' that is compiled without support for 'avx512f'
KeccakP-1600-AVX512.c: KeccakP_DeclareVars
KeccakP-1600-AVX512.c: ^
KeccakP-1600-AVX512.c: KeccakP-1600-AVX512.c:292:23: note: expanded from macro 'KeccakP_DeclareVars'
KeccakP-1600-AVX512.c: V512 moveThetaPrev = _mm512_setr_epi64(4, 0, 1, 2, 3, 5, 6, 7); \
KeccakP-1600-AVX512.c: ^
KeccakP-1600-AVX512.c: /usr/lib/llvm-14/lib/clang/14.0.0/include/avx512fintrin.h:9250:3: note: expanded from macro '_mm512_setr_epi64'
KeccakP-1600-AVX512.c: _mm512_set_epi64((e7),(e6),(e5),(e4),(e3),(e2),(e1),(e0))
KeccakP-1600-AVX512.c: ^
KeccakP-1600-AVX512.c: KeccakP-1600-AVX512.c:476:5: error: AVX vector return of type '__m512i' (vector of 8 'long long' values) without 'avx512f' enabled changes the ABI
KeccakP-1600-AVX512.c: KeccakP-1600-AVX512.c:292:23: note: expanded from macro 'KeccakP_DeclareVars'
KeccakP-1600-AVX512.c: V512 moveThetaPrev = _mm512_setr_epi64(4, 0, 1, 2, 3, 5, 6, 7); \
KeccakP-1600-AVX512.c: ^
KeccakP-1600-AVX512.c: /usr/lib/llvm-14/lib/clang/14.0.0/include/avx512fintrin.h:9250:3: note: expanded from macro '_mm512_setr_epi64'
KeccakP-1600-AVX512.c: _mm512_set_epi64((e7),(e6),(e5),(e4),(e3),(e2),(e1),(e0))
KeccakP-1600-AVX512.c: ^
KeccakP-1600-AVX512.c: KeccakP-1600-AVX512.c:476:5: error: always_inline function '_mm512_set_epi64' requires target feature 'avx512f', but would be inlined into function 'KeccakP1600_Permute_12rounds' that is compiled without support for 'avx512f'
KeccakP-1600-AVX512.c: KeccakP-1600-AVX512.c:293:23: note: expanded from macro 'KeccakP_DeclareVars'
KeccakP-1600-AVX512.c: V512 moveThetaNext = _mm512_setr_epi64(1, 2, 3, 4, 0, 5, 6, 7); \
KeccakP-1600-AVX512.c: ^
KeccakP-1600-AVX512.c: /usr/lib/llvm-14/lib/clang/14.0.0/include/avx512fintrin.h:9250:3: note: expanded from macro '_mm512_setr_epi64'
KeccakP-1600-AVX512.c: _mm512_set_epi64((e7),(e6),(e5),(e4),(e3),(e2),(e1),(e0))
KeccakP-1600-AVX512.c: ^
KeccakP-1600-AVX512.c: KeccakP-1600-AVX512.c:476:5: error: AVX vector return of type '__m512i' (vector of 8 'long long' values) without 'avx512f' enabled changes the ABI
KeccakP-1600-AVX512.c: KeccakP-1600-AVX512.c:293:23: note: expanded from macro 'KeccakP_DeclareVars'
KeccakP-1600-AVX512.c: ...

Number of similar (compiler,implementation) pairs: 5, namely:
CompilerImplementations
clang -march=native -O2 -fomit-frame-pointer -fwrapv -Qunused-arguments -fPIC -fPIE T:KnightsLanding
clang -march=native -O3 -fomit-frame-pointer -fwrapv -Qunused-arguments -fPIC -fPIE T:KnightsLanding
clang -march=native -O -fomit-frame-pointer -fwrapv -Qunused-arguments -fPIC -fPIE T:KnightsLanding
clang -march=native -Os -fomit-frame-pointer -fwrapv -Qunused-arguments -fPIC -fPIE T:KnightsLanding
clang -mcpu=native -O3 -fomit-frame-pointer -fwrapv -Qunused-arguments -fPIC -fPIE T:KnightsLanding

Compiler output

Implementation: T:KnightsLanding
Security model: timingleaks
Compiler: gcc -march=native -mtune=native -O2 -fomit-frame-pointer -fwrapv -fPIC -fPIE
KeccakP-1600-AVX512.c: KeccakP-1600-AVX512.c: In function 'KeccakP1600_Permute_12rounds':
KeccakP-1600-AVX512.c: KeccakP-1600-AVX512.c:292:17: warning: AVX512F vector return without AVX512F enabled changes the ABI [-Wpsabi]
KeccakP-1600-AVX512.c: 292 | V512 moveThetaPrev = _mm512_setr_epi64(4, 0, 1, 2, 3, 5, 6, 7); \
KeccakP-1600-AVX512.c: | ^~~~~~~~~~~~~
KeccakP-1600-AVX512.c: KeccakP-1600-AVX512.c:476:5: note: in expansion of macro 'KeccakP_DeclareVars'
KeccakP-1600-AVX512.c: 476 | KeccakP_DeclareVars
KeccakP-1600-AVX512.c: | ^~~~~~~~~~~~~~~~~~~
KeccakP-1600-AVX512.c: In file included from /usr/lib/gcc/x86_64-linux-gnu/11/include/immintrin.h:49,
KeccakP-1600-AVX512.c: from KeccakP-1600-AVX512.c:26:
KeccakP-1600-AVX512.c: /usr/lib/gcc/x86_64-linux-gnu/11/include/avx512fintrin.h:6440:1: error: inlining failed in call to 'always_inline' '_mm512_mask_storeu_epi64': target specific option mismatch
KeccakP-1600-AVX512.c: 6440 | _mm512_mask_storeu_epi64 (void *__P, __mmask8 __U, __m512i __A)
KeccakP-1600-AVX512.c: | ^~~~~~~~~~~~~~~~~~~~~~~~
KeccakP-1600-AVX512.c: KeccakP-1600-AVX512.c:213:49: note: called from here
KeccakP-1600-AVX512.c: 213 | #define STORE_Plane(a,v) _mm512_mask_storeu_epi64( a, 0x1F, v)
KeccakP-1600-AVX512.c: | ^~~~~~~~~~~~~~~~~~~~~~~~~~~~~~~~~~~~~
KeccakP-1600-AVX512.c: KeccakP-1600-AVX512.c:322:5: note: in expansion of macro 'STORE_Plane'
KeccakP-1600-AVX512.c: 322 | STORE_Plane(pState+20, Saeiou);
KeccakP-1600-AVX512.c: | ^~~~~~~~~~~
KeccakP-1600-AVX512.c: KeccakP-1600-AVX512.c:484:5: note: in expansion of macro 'copyToState'
KeccakP-1600-AVX512.c: 484 | copyToState(stateAsLanes);
KeccakP-1600-AVX512.c: | ^~~~~~~~~~~
KeccakP-1600-AVX512.c: In file included from /usr/lib/gcc/x86_64-linux-gnu/11/include/immintrin.h:49,
KeccakP-1600-AVX512.c: from KeccakP-1600-AVX512.c:26:
KeccakP-1600-AVX512.c: /usr/lib/gcc/x86_64-linux-gnu/11/include/avx512fintrin.h:6440:1: error: inlining failed in call to 'always_inline' '_mm512_mask_storeu_epi64': target specific option mismatch
KeccakP-1600-AVX512.c: 6440 | _mm512_mask_storeu_epi64 (void *__P, __mmask8 __U, __m512i __A)
KeccakP-1600-AVX512.c: ...

Number of similar (compiler,implementation) pairs: 4, namely:
CompilerImplementations
gcc -march=native -mtune=native -O2 -fomit-frame-pointer -fwrapv -fPIC -fPIE T:KnightsLanding
gcc -march=native -mtune=native -O3 -fomit-frame-pointer -fwrapv -fPIC -fPIE T:KnightsLanding
gcc -march=native -mtune=native -O -fomit-frame-pointer -fwrapv -fPIC -fPIE T:KnightsLanding
gcc -march=native -mtune=native -Os -fomit-frame-pointer -fwrapv -fPIC -fPIE T:KnightsLanding

Compiler output

Implementation: T:SandyBridge
Security model: timingleaks
Compiler: clang -mcpu=native -O3 -fomit-frame-pointer -fwrapv -Qunused-arguments -fPIC -fPIE
KeccakP-1600-times2-SIMD128.c: KeccakP-1600-times2-SIMD128.c:801:5: error: always_inline function '_mm_shuffle_epi8' requires target feature 'ssse3', but would be inlined into function 'KeccakP1600times2_PermuteAll_24rounds' that is compiled without support for 'ssse3'
KeccakP-1600-times2-SIMD128.c: rounds24
KeccakP-1600-times2-SIMD128.c: ^
KeccakP-1600-times2-SIMD128.c: ./KeccakP-1600-unrolling.macros:19:5: note: expanded from macro 'rounds24'
KeccakP-1600-times2-SIMD128.c: thetaRhoPiChiIotaPrepareTheta( 0, A, E) \
KeccakP-1600-times2-SIMD128.c: ^
KeccakP-1600-times2-SIMD128.c: KeccakP-1600-times2-SIMD128.c:532:11: note: expanded from macro 'thetaRhoPiChiIotaPrepareTheta'
KeccakP-1600-times2-SIMD128.c: Bko = ROL64in128_8(A##mu); \
KeccakP-1600-times2-SIMD128.c: ^
KeccakP-1600-times2-SIMD128.c: KeccakP-1600-times2-SIMD128.c:48:37: note: expanded from macro 'ROL64in128_8'
KeccakP-1600-times2-SIMD128.c: #define ROL64in128_8(a) _mm_shuffle_epi8(a, CONST128(rho8))
KeccakP-1600-times2-SIMD128.c: ^
KeccakP-1600-times2-SIMD128.c: KeccakP-1600-times2-SIMD128.c:801:5: error: always_inline function '_mm_shuffle_epi8' requires target feature 'ssse3', but would be inlined into function 'KeccakP1600times2_PermuteAll_24rounds' that is compiled without support for 'ssse3'
KeccakP-1600-times2-SIMD128.c: ./KeccakP-1600-unrolling.macros:19:5: note: expanded from macro 'rounds24'
KeccakP-1600-times2-SIMD128.c: thetaRhoPiChiIotaPrepareTheta( 0, A, E) \
KeccakP-1600-times2-SIMD128.c: ^
KeccakP-1600-times2-SIMD128.c: KeccakP-1600-times2-SIMD128.c:557:11: note: expanded from macro 'thetaRhoPiChiIotaPrepareTheta'
KeccakP-1600-times2-SIMD128.c: Bmu = ROL64in128_56(A##so); \
KeccakP-1600-times2-SIMD128.c: ^
KeccakP-1600-times2-SIMD128.c: KeccakP-1600-times2-SIMD128.c:49:37: note: expanded from macro 'ROL64in128_56'
KeccakP-1600-times2-SIMD128.c: #define ROL64in128_56(a) _mm_shuffle_epi8(a, CONST128(rho56))
KeccakP-1600-times2-SIMD128.c: ^
KeccakP-1600-times2-SIMD128.c: KeccakP-1600-times2-SIMD128.c:801:5: error: always_inline function '_mm_shuffle_epi8' requires target feature 'ssse3', but would be inlined into function 'KeccakP1600times2_PermuteAll_24rounds' that is compiled without support for 'ssse3'
KeccakP-1600-times2-SIMD128.c: ./KeccakP-1600-unrolling.macros:20:5: note: expanded from macro 'rounds24'
KeccakP-1600-times2-SIMD128.c: thetaRhoPiChiIotaPrepareTheta( 1, E, A) \
KeccakP-1600-times2-SIMD128.c: ...

Number of similar (compiler,implementation) pairs: 1, namely:
CompilerImplementations
clang -mcpu=native -O3 -fomit-frame-pointer -fwrapv -Qunused-arguments -fPIC -fPIE T:SandyBridge

Compiler output

Implementation: T:asmX86-64
Security model: timingleaks
Compiler: clang -march=native -O2 -fomit-frame-pointer -fwrapv -Qunused-arguments -fPIC -fPIE
try.c: /usr/bin/ld: libcrypto_aead_seakeyakv2.a(KeccakP-1600-x86-64-gas.o): relocation R_X86_64_32S against `.text' can not be used when making a PIE object; recompile with -fPIE
try.c: /usr/bin/ld: failed to set dynamic section sizes: bad value
try.c: clang: error: linker command failed with exit code 1 (use -v to see invocation)

Number of similar (compiler,implementation) pairs: 5, namely:
CompilerImplementations
clang -march=native -O2 -fomit-frame-pointer -fwrapv -Qunused-arguments -fPIC -fPIE T:asmX86-64
clang -march=native -O3 -fomit-frame-pointer -fwrapv -Qunused-arguments -fPIC -fPIE T:asmX86-64
clang -march=native -O -fomit-frame-pointer -fwrapv -Qunused-arguments -fPIC -fPIE T:asmX86-64
clang -march=native -Os -fomit-frame-pointer -fwrapv -Qunused-arguments -fPIC -fPIE T:asmX86-64
clang -mcpu=native -O3 -fomit-frame-pointer -fwrapv -Qunused-arguments -fPIC -fPIE T:asmX86-64

Compiler output

Implementation: T:asmX86-64
Security model: timingleaks
Compiler: gcc -march=native -mtune=native -O2 -fomit-frame-pointer -fwrapv -fPIC -fPIE
try.c: /usr/bin/ld: libcrypto_aead_seakeyakv2.a(KeccakP-1600-x86-64-gas.o): relocation R_X86_64_32S against `.text' can not be used when making a PIE object; recompile with -fPIE
try.c: /usr/bin/ld: failed to set dynamic section sizes: bad value
try.c: collect2: error: ld returned 1 exit status

Number of similar (compiler,implementation) pairs: 4, namely:
CompilerImplementations
gcc -march=native -mtune=native -O2 -fomit-frame-pointer -fwrapv -fPIC -fPIE T:asmX86-64
gcc -march=native -mtune=native -O3 -fomit-frame-pointer -fwrapv -fPIC -fPIE T:asmX86-64
gcc -march=native -mtune=native -O -fomit-frame-pointer -fwrapv -fPIC -fPIE T:asmX86-64
gcc -march=native -mtune=native -Os -fomit-frame-pointer -fwrapv -fPIC -fPIE T:asmX86-64

Compiler output

Implementation: T:asmX86-64shld
Security model: timingleaks
Compiler: clang -march=native -O2 -fomit-frame-pointer -fwrapv -Qunused-arguments -fPIC -fPIE
try.c: /usr/bin/ld: libcrypto_aead_seakeyakv2.a(KeccakP-1600-x86-64-shld-gas.o): relocation R_X86_64_32S against `.text' can not be used when making a PIE object; recompile with -fPIE
try.c: /usr/bin/ld: failed to set dynamic section sizes: bad value
try.c: clang: error: linker command failed with exit code 1 (use -v to see invocation)

Number of similar (compiler,implementation) pairs: 5, namely:
CompilerImplementations
clang -march=native -O2 -fomit-frame-pointer -fwrapv -Qunused-arguments -fPIC -fPIE T:asmX86-64shld
clang -march=native -O3 -fomit-frame-pointer -fwrapv -Qunused-arguments -fPIC -fPIE T:asmX86-64shld
clang -march=native -O -fomit-frame-pointer -fwrapv -Qunused-arguments -fPIC -fPIE T:asmX86-64shld
clang -march=native -Os -fomit-frame-pointer -fwrapv -Qunused-arguments -fPIC -fPIE T:asmX86-64shld
clang -mcpu=native -O3 -fomit-frame-pointer -fwrapv -Qunused-arguments -fPIC -fPIE T:asmX86-64shld

Compiler output

Implementation: T:asmX86-64shld
Security model: timingleaks
Compiler: gcc -march=native -mtune=native -O2 -fomit-frame-pointer -fwrapv -fPIC -fPIE
try.c: /usr/bin/ld: libcrypto_aead_seakeyakv2.a(KeccakP-1600-x86-64-shld-gas.o): relocation R_X86_64_32S against `.text' can not be used when making a PIE object; recompile with -fPIE
try.c: /usr/bin/ld: failed to set dynamic section sizes: bad value
try.c: collect2: error: ld returned 1 exit status

Number of similar (compiler,implementation) pairs: 4, namely:
CompilerImplementations
gcc -march=native -mtune=native -O2 -fomit-frame-pointer -fwrapv -fPIC -fPIE T:asmX86-64shld
gcc -march=native -mtune=native -O3 -fomit-frame-pointer -fwrapv -fPIC -fPIE T:asmX86-64shld
gcc -march=native -mtune=native -O -fomit-frame-pointer -fwrapv -fPIC -fPIE T:asmX86-64shld
gcc -march=native -mtune=native -Os -fomit-frame-pointer -fwrapv -fPIC -fPIE T:asmX86-64shld

Compiler output

Implementation: T:compact
Security model: timingleaks
Compiler: clang -march=native -O2 -fomit-frame-pointer -fwrapv -Qunused-arguments -fPIC -fPIE
KeccakP-200-compact.c: KeccakP-200-compact.c:20:36: warning: '/*' within block comment [-Wcomment]
KeccakP-200-compact.c: /* #define DIVISION_INSTRUCTION /* comment if no division instruction or more compact when not using division */
KeccakP-200-compact.c: ^
KeccakP-200-compact.c: 1 warning generated.
KeccakP-800-compact.c: KeccakP-800-compact.c:27:36: warning: '/*' within block comment [-Wcomment]
KeccakP-800-compact.c: /* #define DIVISION_INSTRUCTION /* comment if no division instruction or more compact when not using division */
KeccakP-800-compact.c: ^
KeccakP-800-compact.c: 1 warning generated.

Number of similar (compiler,implementation) pairs: 5, namely:
CompilerImplementations
clang -march=native -O2 -fomit-frame-pointer -fwrapv -Qunused-arguments -fPIC -fPIE T:compact
clang -march=native -O3 -fomit-frame-pointer -fwrapv -Qunused-arguments -fPIC -fPIE T:compact
clang -march=native -O -fomit-frame-pointer -fwrapv -Qunused-arguments -fPIC -fPIE T:compact
clang -march=native -Os -fomit-frame-pointer -fwrapv -Qunused-arguments -fPIC -fPIE T:compact
clang -mcpu=native -O3 -fomit-frame-pointer -fwrapv -Qunused-arguments -fPIC -fPIE T:compact

Compiler output

Implementation: T:ref
Security model: timingleaks
Compiler: clang++ -march=native -O2 -fomit-frame-pointer -fwrapv -Qunused-arguments -fPIC -fPIE
Keyakv2.cpp: In file included from Keyakv2.cpp:16:
Keyakv2.cpp: In file included from ./Keyakv2.h:21:
Keyakv2.cpp: ./Motorist.h:31:5: warning: 'auto_ptr<unsigned char>' is deprecated: use 'std::unique_ptr' instead [-Wdeprecated-declarations]
Keyakv2.cpp: auto_ptr<UINT8> state;
Keyakv2.cpp: ^
Keyakv2.cpp: /usr/bin/../lib/gcc/x86_64-linux-gnu/11/../../../../include/c++/11/backward/auto_ptr.h:287:7: note: 'auto_ptr<unsigned char>' has been explicitly marked deprecated here
Keyakv2.cpp: } _GLIBCXX11_DEPRECATED_SUGGEST("std::unique_ptr");
Keyakv2.cpp: ^
Keyakv2.cpp: /usr/bin/../lib/gcc/x86_64-linux-gnu/11/../../../../include/x86_64-linux-gnu/c++/11/bits/c++config.h:102:45: note: expanded from macro '_GLIBCXX11_DEPRECATED_SUGGEST'
Keyakv2.cpp: # define _GLIBCXX11_DEPRECATED_SUGGEST(ALT) _GLIBCXX_DEPRECATED_SUGGEST(ALT)
Keyakv2.cpp: ^
Keyakv2.cpp: /usr/bin/../lib/gcc/x86_64-linux-gnu/11/../../../../include/x86_64-linux-gnu/c++/11/bits/c++config.h:94:19: note: expanded from macro '_GLIBCXX_DEPRECATED_SUGGEST'
Keyakv2.cpp: __attribute__ ((__deprecated__ ("use '" ALT "' instead")))
Keyakv2.cpp: ^
Keyakv2.cpp: 1 warning generated.
Motorist.cpp: In file included from Motorist.cpp:17:
Motorist.cpp: ./Motorist.h:31:5: warning: 'auto_ptr<unsigned char>' is deprecated: use 'std::unique_ptr' instead [-Wdeprecated-declarations]
Motorist.cpp: auto_ptr<UINT8> state;
Motorist.cpp: ^
Motorist.cpp: /usr/bin/../lib/gcc/x86_64-linux-gnu/11/../../../../include/c++/11/backward/auto_ptr.h:287:7: note: 'auto_ptr<unsigned char>' has been explicitly marked deprecated here
Motorist.cpp: } _GLIBCXX11_DEPRECATED_SUGGEST("std::unique_ptr");
Motorist.cpp: ^
Motorist.cpp: /usr/bin/../lib/gcc/x86_64-linux-gnu/11/../../../../include/x86_64-linux-gnu/c++/11/bits/c++config.h:102:45: note: expanded from macro '_GLIBCXX11_DEPRECATED_SUGGEST'
Motorist.cpp: # define _GLIBCXX11_DEPRECATED_SUGGEST(ALT) _GLIBCXX_DEPRECATED_SUGGEST(ALT)
Motorist.cpp: ^
Motorist.cpp: /usr/bin/../lib/gcc/x86_64-linux-gnu/11/../../../../include/x86_64-linux-gnu/c++/11/bits/c++config.h:94:19: note: expanded from macro '_GLIBCXX_DEPRECATED_SUGGEST'
Motorist.cpp: __attribute__ ((__deprecated__ ("use '" ALT "' instead")))
Motorist.cpp: ^
Motorist.cpp: 1 warning generated.
encrypt.cpp: In file included from encrypt.cpp:22:
encrypt.cpp: In file included from ./Keyakv2.h:21:
encrypt.cpp: ./Motorist.h:31:5: warning: 'auto_ptr<unsigned char>' is deprecated: use 'std::unique_ptr' instead [-Wdeprecated-declarations]
encrypt.cpp: auto_ptr<UINT8> state;
encrypt.cpp: ^
encrypt.cpp: /usr/bin/../lib/gcc/x86_64-linux-gnu/11/../../../../include/c++/11/backward/auto_ptr.h:287:7: note: 'auto_ptr<unsigned char>' has been explicitly marked deprecated here
encrypt.cpp: } _GLIBCXX11_DEPRECATED_SUGGEST("std::unique_ptr");
encrypt.cpp: ^
encrypt.cpp: /usr/bin/../lib/gcc/x86_64-linux-gnu/11/../../../../include/x86_64-linux-gnu/c++/11/bits/c++config.h:102:45: note: expanded from macro '_GLIBCXX11_DEPRECATED_SUGGEST'
encrypt.cpp: # define _GLIBCXX11_DEPRECATED_SUGGEST(ALT) _GLIBCXX_DEPRECATED_SUGGEST(ALT)
encrypt.cpp: ^
encrypt.cpp: /usr/bin/../lib/gcc/x86_64-linux-gnu/11/../../../../include/x86_64-linux-gnu/c++/11/bits/c++config.h:94:19: note: expanded from macro '_GLIBCXX_DEPRECATED_SUGGEST'
encrypt.cpp: __attribute__ ((__deprecated__ ("use '" ALT "' instead")))
encrypt.cpp: ^
encrypt.cpp: 1 warning generated.

Number of similar (compiler,implementation) pairs: 8, namely:
CompilerImplementations
clang++ -march=native -O2 -fomit-frame-pointer -fwrapv -Qunused-arguments -fPIC -fPIE T:ref
clang++ -march=native -O3 -fomit-frame-pointer -fwrapv -Qunused-arguments -fPIC -fPIE T:ref
clang++ -march=native -O -fomit-frame-pointer -fwrapv -Qunused-arguments -fPIC -fPIE T:ref
clang++ -march=native -Os -fomit-frame-pointer -fwrapv -Qunused-arguments -fPIC -fPIE T:ref
clang++ -march=native -O2 -fomit-frame-pointer -fwrapv -Qunused-arguments -fPIC -fPIE T:refnew
clang++ -march=native -O3 -fomit-frame-pointer -fwrapv -Qunused-arguments -fPIC -fPIE T:refnew
clang++ -march=native -O -fomit-frame-pointer -fwrapv -Qunused-arguments -fPIC -fPIE T:refnew
clang++ -march=native -Os -fomit-frame-pointer -fwrapv -Qunused-arguments -fPIC -fPIE T:refnew

Compiler output

Implementation: T:ref
Security model: timingleaks
Compiler: g++ -march=native -mtune=native -O2 -fomit-frame-pointer -fwrapv -fPIC -fPIE
Keyakv2.cpp: In file included from Keyakv2.h:21,
Keyakv2.cpp: from Keyakv2.cpp:16:
Keyakv2.cpp: Motorist.h:31:5: warning: 'template<class> class std::auto_ptr' is deprecated: use 'std::unique_ptr' instead [-Wdeprecated-declarations]
Keyakv2.cpp: 31 | auto_ptr<UINT8> state;
Keyakv2.cpp: | ^~~~~~~~
Keyakv2.cpp: In file included from /usr/include/c++/11/memory:76,
Keyakv2.cpp: from Motorist.h:20,
Keyakv2.cpp: from Keyakv2.h:21,
Keyakv2.cpp: from Keyakv2.cpp:16:
Keyakv2.cpp: /usr/include/c++/11/bits/unique_ptr.h:57:28: note: declared here
Keyakv2.cpp: 57 | template<typename> class auto_ptr;
Keyakv2.cpp: | ^~~~~~~~
Motorist.cpp: In file included from Motorist.cpp:17:
Motorist.cpp: Motorist.h:31:5: warning: 'template<class> class std::auto_ptr' is deprecated: use 'std::unique_ptr' instead [-Wdeprecated-declarations]
Motorist.cpp: 31 | auto_ptr<UINT8> state;
Motorist.cpp: | ^~~~~~~~
Motorist.cpp: In file included from /usr/include/c++/11/memory:76,
Motorist.cpp: from Motorist.h:20,
Motorist.cpp: from Motorist.cpp:17:
Motorist.cpp: /usr/include/c++/11/bits/unique_ptr.h:57:28: note: declared here
Motorist.cpp: 57 | template<typename> class auto_ptr;
Motorist.cpp: | ^~~~~~~~
encrypt.cpp: In file included from Keyakv2.h:21,
encrypt.cpp: from encrypt.cpp:22:
encrypt.cpp: Motorist.h:31:5: warning: 'template<class> class std::auto_ptr' is deprecated: use 'std::unique_ptr' instead [-Wdeprecated-declarations]
encrypt.cpp: 31 | auto_ptr<UINT8> state;
encrypt.cpp: | ^~~~~~~~
encrypt.cpp: In file included from /usr/include/c++/11/memory:76,
encrypt.cpp: from Motorist.h:20,
encrypt.cpp: from Keyakv2.h:21,
encrypt.cpp: from encrypt.cpp:22:
encrypt.cpp: /usr/include/c++/11/bits/unique_ptr.h:57:28: note: declared here
encrypt.cpp: 57 | template<typename> class auto_ptr;
encrypt.cpp: | ^~~~~~~~

Number of similar (compiler,implementation) pairs: 8, namely:
CompilerImplementations
g++ -march=native -mtune=native -O2 -fomit-frame-pointer -fwrapv -fPIC -fPIE T:ref
g++ -march=native -mtune=native -O3 -fomit-frame-pointer -fwrapv -fPIC -fPIE T:ref
g++ -march=native -mtune=native -O -fomit-frame-pointer -fwrapv -fPIC -fPIE T:ref
g++ -march=native -mtune=native -Os -fomit-frame-pointer -fwrapv -fPIC -fPIE T:ref
g++ -march=native -mtune=native -O2 -fomit-frame-pointer -fwrapv -fPIC -fPIE T:refnew
g++ -march=native -mtune=native -O3 -fomit-frame-pointer -fwrapv -fPIC -fPIE T:refnew
g++ -march=native -mtune=native -O -fomit-frame-pointer -fwrapv -fPIC -fPIE T:refnew
g++ -march=native -mtune=native -Os -fomit-frame-pointer -fwrapv -fPIC -fPIE T:refnew