Implementation notes: amd64, h6sandy, crypto_aead/paeq128tnm

Computer: h6sandy
Architecture: amd64
CPU ID: GenuineIntel-000206a7-bfebfbff
SUPERCOP version: 20200618
Operation: crypto_aead
Primitive: paeq128tnm
TimeObject sizeTest sizeImplementationCompilerBenchmark dateSUPERCOP version
382474815183 32 6553630486 848 66416refclang++_-march=native_-O_-fomit-frame-pointer_-fwrapv_-Qunused-arguments_-fPIC_-fPIE2020041120200409
402724415816 32 6553632638 848 66416refclang++_-march=native_-O3_-fomit-frame-pointer_-fwrapv_-Qunused-arguments_-fPIC_-fPIE2020041120200409
428894415183 32 6553630486 848 66416refclang++_-march=native_-O2_-fomit-frame-pointer_-fwrapv_-Qunused-arguments_-fPIC_-fPIE2020041120200409
698194414553 28 6553629694 812 66496refg++_-march=native_-mtune=native_-O3_-fomit-frame-pointer_-fwrapv_-fPIC_-fPIE2020041120200409
133245125651 32 6553617236 840 66400refclang++_-march=native_-Os_-fomit-frame-pointer_-fwrapv_-Qunused-arguments_-fPIC_-fPIE2020041120200409
168124126717 28 6553619533 804 66496refg++_-march=native_-mtune=native_-O2_-fomit-frame-pointer_-fwrapv_-fPIC_-fPIE2020041120200409
188337366969 28 6553619813 804 66496refg++_-march=native_-mtune=native_-O_-fomit-frame-pointer_-fwrapv_-fPIC_-fPIE2020041120200409
300522925389 28 6553617225 788 66464refg++_-march=native_-mtune=native_-Os_-fomit-frame-pointer_-fwrapv_-fPIC_-fPIE2020041120200409

Compiler output

Implementation: aesni
Security model: unknown
Compiler: clang++ -march=native -O2 -fomit-frame-pointer -fwrapv -Qunused-arguments -fPIC -fPIE
encrypt.cpp: encrypt.cpp:166:11: error: always_inline function '_mm_aesenc_si128' requires target feature 'aes', but would be inlined into function 'DoubleFPermAsm' that is compiled without support for 'aes'
encrypt.cpp: acc0 = _mm_aesenc_si128(acc0, roundkey0);
encrypt.cpp: ^
encrypt.cpp: encrypt.cpp:167:11: error: always_inline function '_mm_aesenc_si128' requires target feature 'aes', but would be inlined into function 'DoubleFPermAsm' that is compiled without support for 'aes'
encrypt.cpp: acc1 = _mm_aesenc_si128(acc1, roundkey1);
encrypt.cpp: ^
encrypt.cpp: encrypt.cpp:168:11: error: always_inline function '_mm_aesenc_si128' requires target feature 'aes', but would be inlined into function 'DoubleFPermAsm' that is compiled without support for 'aes'
encrypt.cpp: acc2 = _mm_aesenc_si128(acc2, roundkey2);
encrypt.cpp: ^
encrypt.cpp: encrypt.cpp:169:11: error: always_inline function '_mm_aesenc_si128' requires target feature 'aes', but would be inlined into function 'DoubleFPermAsm' that is compiled without support for 'aes'
encrypt.cpp: acc3 = _mm_aesenc_si128(acc3, roundkey3);
encrypt.cpp: ^
encrypt.cpp: encrypt.cpp:171:11: error: always_inline function '_mm_aesenc_si128' requires target feature 'aes', but would be inlined into function 'DoubleFPermAsm' that is compiled without support for 'aes'
encrypt.cpp: acc4 = _mm_aesenc_si128(acc4, roundkey0);
encrypt.cpp: ^
encrypt.cpp: encrypt.cpp:172:11: error: always_inline function '_mm_aesenc_si128' requires target feature 'aes', but would be inlined into function 'DoubleFPermAsm' that is compiled without support for 'aes'
encrypt.cpp: acc5 = _mm_aesenc_si128(acc5, roundkey1);
encrypt.cpp: ^
encrypt.cpp: encrypt.cpp:173:11: error: always_inline function '_mm_aesenc_si128' requires target feature 'aes', but would be inlined into function 'DoubleFPermAsm' that is compiled without support for 'aes'
encrypt.cpp: acc6 = _mm_aesenc_si128(acc6, roundkey2);
encrypt.cpp: ^
encrypt.cpp: encrypt.cpp:174:11: error: always_inline function '_mm_aesenc_si128' requires target feature 'aes', but would be inlined into function 'DoubleFPermAsm' that is compiled without support for 'aes'
encrypt.cpp: acc7 = _mm_aesenc_si128(acc7, roundkey3);
encrypt.cpp: ^
encrypt.cpp: 8 errors generated.

Number of similar (compiler,implementation) pairs: 4, namely:
CompilerImplementations
clang++ -march=native -O2 -fomit-frame-pointer -fwrapv -Qunused-arguments -fPIC -fPIE aesni
clang++ -march=native -O3 -fomit-frame-pointer -fwrapv -Qunused-arguments -fPIC -fPIE aesni
clang++ -march=native -O -fomit-frame-pointer -fwrapv -Qunused-arguments -fPIC -fPIE aesni
clang++ -march=native -Os -fomit-frame-pointer -fwrapv -Qunused-arguments -fPIC -fPIE aesni

Compiler output

Implementation: aesni
Security model: unknown
Compiler: g++ -march=native -mtune=native -O2 -fomit-frame-pointer -fwrapv -fPIC -fPIE
encrypt.cpp: In file included from encrypt.cpp:13:0:
encrypt.cpp: /usr/lib/gcc/x86_64-linux-gnu/7/include/wmmintrin.h: In function 'void DoubleFPermAsm(const __m128i*, const __m128i*, __m128i*, __m128i*)':
encrypt.cpp: /usr/lib/gcc/x86_64-linux-gnu/7/include/wmmintrin.h:61:1: error: inlining failed in call to always_inline '__m128i _mm_aesenc_si128(__m128i, __m128i)': target specific option mismatch
encrypt.cpp: _mm_aesenc_si128 (__m128i __X, __m128i __Y)
encrypt.cpp: ^~~~~~~~~~~~~~~~
encrypt.cpp: encrypt.cpp:174:9: note: called from here
encrypt.cpp: acc7 = _mm_aesenc_si128(acc7, roundkey3);
encrypt.cpp: ~~~~~^~~~~~~~~~~~~~~~~~~~~~~~~~~~~~~~~~~
encrypt.cpp: In file included from encrypt.cpp:13:0:
encrypt.cpp: /usr/lib/gcc/x86_64-linux-gnu/7/include/wmmintrin.h:61:1: error: inlining failed in call to always_inline '__m128i _mm_aesenc_si128(__m128i, __m128i)': target specific option mismatch
encrypt.cpp: _mm_aesenc_si128 (__m128i __X, __m128i __Y)
encrypt.cpp: ^~~~~~~~~~~~~~~~
encrypt.cpp: encrypt.cpp:173:9: note: called from here
encrypt.cpp: acc6 = _mm_aesenc_si128(acc6, roundkey2);
encrypt.cpp: ~~~~~^~~~~~~~~~~~~~~~~~~~~~~~~~~~~~~~~~~
encrypt.cpp: In file included from encrypt.cpp:13:0:
encrypt.cpp: /usr/lib/gcc/x86_64-linux-gnu/7/include/wmmintrin.h:61:1: error: inlining failed in call to always_inline '__m128i _mm_aesenc_si128(__m128i, __m128i)': target specific option mismatch
encrypt.cpp: _mm_aesenc_si128 (__m128i __X, __m128i __Y)
encrypt.cpp: ^~~~~~~~~~~~~~~~
encrypt.cpp: encrypt.cpp:172:9: note: called from here
encrypt.cpp: acc5 = _mm_aesenc_si128(acc5, roundkey1);
encrypt.cpp: ~~~~~^~~~~~~~~~~~~~~~~~~~~~~~~~~~~~~~~~~
encrypt.cpp: In file included from encrypt.cpp:13:0:
encrypt.cpp: /usr/lib/gcc/x86_64-linux-gnu/7/include/wmmintrin.h:61:1: error: inlining failed in call to always_inline '__m128i _mm_aesenc_si128(__m128i, __m128i)': target specific option mismatch
encrypt.cpp: _mm_aesenc_si128 (__m128i __X, __m128i __Y)
encrypt.cpp: ...

Number of similar (compiler,implementation) pairs: 4, namely:
CompilerImplementations
g++ -march=native -mtune=native -O2 -fomit-frame-pointer -fwrapv -fPIC -fPIE aesni
g++ -march=native -mtune=native -O3 -fomit-frame-pointer -fwrapv -fPIC -fPIE aesni
g++ -march=native -mtune=native -O -fomit-frame-pointer -fwrapv -fPIC -fPIE aesni
g++ -march=native -mtune=native -Os -fomit-frame-pointer -fwrapv -fPIC -fPIE aesni

Compiler output

Implementation: opt-win-aes
Security model: unknown
Compiler: clang++ -march=native -O2 -fomit-frame-pointer -fwrapv -Qunused-arguments -fPIC -fPIE
encrypt.cpp: In file included from encrypt.cpp:13:
encrypt.cpp: /usr/include/clang/6.0.0/include/intrin.h:26:15: fatal error: 'intrin.h' file not found
encrypt.cpp: #include_next <intrin.h>
encrypt.cpp: ^~~~~~~~~~
encrypt.cpp: 1 error generated.

Number of similar (compiler,implementation) pairs: 4, namely:
CompilerImplementations
clang++ -march=native -O2 -fomit-frame-pointer -fwrapv -Qunused-arguments -fPIC -fPIE opt-win-aes
clang++ -march=native -O3 -fomit-frame-pointer -fwrapv -Qunused-arguments -fPIC -fPIE opt-win-aes
clang++ -march=native -O -fomit-frame-pointer -fwrapv -Qunused-arguments -fPIC -fPIE opt-win-aes
clang++ -march=native -Os -fomit-frame-pointer -fwrapv -Qunused-arguments -fPIC -fPIE opt-win-aes

Compiler output

Implementation: opt-win-aes
Security model: unknown
Compiler: g++ -march=native -mtune=native -O2 -fomit-frame-pointer -fwrapv -fPIC -fPIE
encrypt.cpp: encrypt.cpp:13:10: fatal error: intrin.h: No such file or directory
encrypt.cpp: #include <intrin.h>
encrypt.cpp: ^~~~~~~~~~
encrypt.cpp: compilation terminated.

Number of similar (compiler,implementation) pairs: 4, namely:
CompilerImplementations
g++ -march=native -mtune=native -O2 -fomit-frame-pointer -fwrapv -fPIC -fPIE opt-win-aes
g++ -march=native -mtune=native -O3 -fomit-frame-pointer -fwrapv -fPIC -fPIE opt-win-aes
g++ -march=native -mtune=native -O -fomit-frame-pointer -fwrapv -fPIC -fPIE opt-win-aes
g++ -march=native -mtune=native -Os -fomit-frame-pointer -fwrapv -fPIC -fPIE opt-win-aes

Compiler output

Implementation: ref
Security model: unknown
Compiler: clang++ -march=native -O2 -fomit-frame-pointer -fwrapv -Qunused-arguments -fPIC -fPIE
encrypt.cpp: encrypt.cpp:355:27: warning: implicit conversion from 'int' to 'unsigned char' changes value from 256 to 0 [-Wconstant-conversion]
encrypt.cpp: D0[0] = CRYPTO_NPUBBYTES*8; //nonce length in bits, zero for 256-bit nonce
encrypt.cpp: ~ ~~~~~~~~~~~~~~~~^~
encrypt.cpp: encrypt.cpp:610:27: warning: implicit conversion from 'int' to 'unsigned char' changes value from 256 to 0 [-Wconstant-conversion]
encrypt.cpp: D0[0] = CRYPTO_NPUBBYTES*8; //nonce length in bits, zero for 256-bit nonce
encrypt.cpp: ~ ~~~~~~~~~~~~~~~~^~
encrypt.cpp: encrypt.cpp:864:27: warning: implicit conversion from 'int' to 'unsigned char' changes value from 256 to 0 [-Wconstant-conversion]
encrypt.cpp: D0[0] = CRYPTO_NPUBBYTES*8; //nonce length in bits
encrypt.cpp: ~ ~~~~~~~~~~~~~~~~^~
encrypt.cpp: 3 warnings generated.

Number of similar (compiler,implementation) pairs: 4, namely:
CompilerImplementations
clang++ -march=native -O2 -fomit-frame-pointer -fwrapv -Qunused-arguments -fPIC -fPIE ref
clang++ -march=native -O3 -fomit-frame-pointer -fwrapv -Qunused-arguments -fPIC -fPIE ref
clang++ -march=native -O -fomit-frame-pointer -fwrapv -Qunused-arguments -fPIC -fPIE ref
clang++ -march=native -Os -fomit-frame-pointer -fwrapv -Qunused-arguments -fPIC -fPIE ref

Compiler output

Implementation: ref
Security model: unknown
Compiler: g++ -march=native -mtune=native -O2 -fomit-frame-pointer -fwrapv -fPIC -fPIE
encrypt.cpp: encrypt.cpp: In function 'int crypto_aead_paeq128tnm_ref_encrypt(unsigned char*, long long unsigned int*, const unsigned char*, long long unsigned int, const unsigned char*, long long unsigned int, const unsigned char*, const unsigned char*, const unsigned char*)':
encrypt.cpp: encrypt.cpp:355:27: warning: large integer implicitly truncated to unsigned type [-Woverflow]
encrypt.cpp: D0[0] = CRYPTO_NPUBBYTES*8; //nonce length in bits, zero for 256-bit nonce
encrypt.cpp: encrypt.cpp: In function 'int crypto_aead_encrypt_no_nonce(unsigned char*, long long unsigned int*, const unsigned char*, long long unsigned int, const unsigned char*, long long unsigned int, const unsigned char*, unsigned char*, const unsigned char*)':
encrypt.cpp: encrypt.cpp:610:27: warning: large integer implicitly truncated to unsigned type [-Woverflow]
encrypt.cpp: D0[0] = CRYPTO_NPUBBYTES*8; //nonce length in bits, zero for 256-bit nonce
encrypt.cpp: encrypt.cpp: In function 'int crypto_aead_paeq128tnm_ref_decrypt(unsigned char*, long long unsigned int*, unsigned char*, const unsigned char*, long long unsigned int, const unsigned char*, long long unsigned int, const unsigned char*, const unsigned char*)':
encrypt.cpp: encrypt.cpp:864:27: warning: large integer implicitly truncated to unsigned type [-Woverflow]
encrypt.cpp: D0[0] = CRYPTO_NPUBBYTES*8; //nonce length in bits

Number of similar (compiler,implementation) pairs: 4, namely:
CompilerImplementations
g++ -march=native -mtune=native -O2 -fomit-frame-pointer -fwrapv -fPIC -fPIE ref
g++ -march=native -mtune=native -O3 -fomit-frame-pointer -fwrapv -fPIC -fPIE ref
g++ -march=native -mtune=native -O -fomit-frame-pointer -fwrapv -fPIC -fPIE ref
g++ -march=native -mtune=native -Os -fomit-frame-pointer -fwrapv -fPIC -fPIE ref