Implementation notes: amd64, h6sandy, crypto_aead/morus1280128v2

Computer: h6sandy
Architecture: amd64
CPU ID: GenuineIntel-000206a7-bfebfbff
SUPERCOP version: 20200618
Operation: crypto_aead
Primitive: morus1280128v2
TimeObject sizeTest sizeImplementationCompilerBenchmark dateSUPERCOP version
1053213305 0 027697 776 856sse2clang_-mcpu=native_-O3_-fomit-frame-pointer_-fwrapv_-Qunused-arguments_-fPIC_-fPIE2020041120200409
128686798 0 018311 768 856sse2clang_-march=native_-Os_-fomit-frame-pointer_-fwrapv_-Qunused-arguments_-fPIC_-fPIE2020041120200409
1324410956 0 026129 776 872sse2clang_-march=native_-O2_-fomit-frame-pointer_-fwrapv_-Qunused-arguments_-fPIC_-fPIE2020041120200409
1329610956 0 027649 776 872sse2clang_-march=native_-O3_-fomit-frame-pointer_-fwrapv_-Qunused-arguments_-fPIC_-fPIE2020041120200409
1362010956 0 026129 776 872sse2clang_-march=native_-O_-fomit-frame-pointer_-fwrapv_-Qunused-arguments_-fPIC_-fPIE2020041120200409
148567466 0 020429 784 928sse2gcc_-march=native_-mtune=native_-O_-fomit-frame-pointer_-fwrapv_-fPIC_-fPIE2020041120200409
152569083 0 024269 784 928sse2gcc_-march=native_-mtune=native_-O3_-fomit-frame-pointer_-fwrapv_-fPIC_-fPIE2020041120200409
155607564 0 020501 784 928sse2gcc_-march=native_-mtune=native_-O2_-fomit-frame-pointer_-fwrapv_-fPIC_-fPIE2020041120200409
239685847 0 018716 776 928ref64gcc_-march=native_-mtune=native_-O2_-fomit-frame-pointer_-fwrapv_-fPIC_-fPIE2020041120200409
2858818129 0 033349 784 928ref64gcc_-march=native_-mtune=native_-O3_-fomit-frame-pointer_-fwrapv_-fPIC_-fPIE2020041120200409
2919618129 0 033349 784 928refgcc_-march=native_-mtune=native_-O3_-fomit-frame-pointer_-fwrapv_-fPIC_-fPIE2020041120200409
347646883 0 021393 776 856refclang_-mcpu=native_-O3_-fomit-frame-pointer_-fwrapv_-Qunused-arguments_-fPIC_-fPIE2020041120200409
352525516 0 017071 768 856refclang_-march=native_-Os_-fomit-frame-pointer_-fwrapv_-Qunused-arguments_-fPIC_-fPIE2020041120200409
360246883 0 021393 776 856ref64clang_-mcpu=native_-O3_-fomit-frame-pointer_-fwrapv_-Qunused-arguments_-fPIC_-fPIE2020041120200409
373686883 0 022177 776 872ref64clang_-march=native_-O2_-fomit-frame-pointer_-fwrapv_-Qunused-arguments_-fPIC_-fPIE2020041120200409
374365516 0 017071 768 856ref64clang_-march=native_-Os_-fomit-frame-pointer_-fwrapv_-Qunused-arguments_-fPIC_-fPIE2020041120200409
376086883 0 022177 776 872ref64clang_-march=native_-O_-fomit-frame-pointer_-fwrapv_-Qunused-arguments_-fPIC_-fPIE2020041120200409
380726931 0 023745 776 872ref64clang_-march=native_-O3_-fomit-frame-pointer_-fwrapv_-Qunused-arguments_-fPIC_-fPIE2020041120200409
389005921 0 018820 776 928ref64gcc_-march=native_-mtune=native_-O_-fomit-frame-pointer_-fwrapv_-fPIC_-fPIE2020041120200409
395846931 0 023745 776 872refclang_-march=native_-O3_-fomit-frame-pointer_-fwrapv_-Qunused-arguments_-fPIC_-fPIE2020041120200409
396886883 0 022177 776 872refclang_-march=native_-O2_-fomit-frame-pointer_-fwrapv_-Qunused-arguments_-fPIC_-fPIE2020041120200409
398326883 0 022177 776 872refclang_-march=native_-O_-fomit-frame-pointer_-fwrapv_-Qunused-arguments_-fPIC_-fPIE2020041120200409
404525921 0 018820 776 928refgcc_-march=native_-mtune=native_-O_-fomit-frame-pointer_-fwrapv_-fPIC_-fPIE2020041120200409
417445413 0 017304 760 896refgcc_-march=native_-mtune=native_-Os_-fomit-frame-pointer_-fwrapv_-fPIC_-fPIE2020041120200409
424365847 0 018716 776 928refgcc_-march=native_-mtune=native_-O2_-fomit-frame-pointer_-fwrapv_-fPIC_-fPIE2020041120200409
440605413 0 017304 760 896ref64gcc_-march=native_-mtune=native_-Os_-fomit-frame-pointer_-fwrapv_-fPIC_-fPIE2020041120200409

Compiler output

Implementation: avx2
Security model: unknown
Compiler: clang -march=native -O2 -fomit-frame-pointer -fwrapv -Qunused-arguments -fPIC -fPIE
encrypt.c: encrypt.c:52:13: error: always_inline function '_mm256_xor_si256' requires target feature 'avx2', but would be inlined into function 'morus_stateupdate' that is compiled without support for 'avx2'
encrypt.c: state[0] = XOR256(state[0], state[3]);
encrypt.c: ^
encrypt.c: encrypt.c:22:27: note: expanded from macro 'XOR256'
encrypt.c: #define XOR256(x,y) _mm256_xor_si256((x),(y)) /*XOR256(x,y) = x ^ y, where x and y are two 256-bit word*/
encrypt.c: ^
encrypt.c: encrypt.c:53:13: error: always_inline function '_mm256_xor_si256' requires target feature 'avx2', but would be inlined into function 'morus_stateupdate' that is compiled without support for 'avx2'
encrypt.c: state[0] = XOR256(state[0], AND256(state[1], state[2]));
encrypt.c: ^
encrypt.c: encrypt.c:22:27: note: expanded from macro 'XOR256'
encrypt.c: #define XOR256(x,y) _mm256_xor_si256((x),(y)) /*XOR256(x,y) = x ^ y, where x and y are two 256-bit word*/
encrypt.c: ^
encrypt.c: encrypt.c:53:30: error: always_inline function '_mm256_and_si256' requires target feature 'avx2', but would be inlined into function 'morus_stateupdate' that is compiled without support for 'avx2'
encrypt.c: state[0] = XOR256(state[0], AND256(state[1], state[2]));
encrypt.c: ^
encrypt.c: encrypt.c:23:27: note: expanded from macro 'AND256'
encrypt.c: #define AND256(x,y) _mm256_and_si256((x),(y)) /*AND(x,y) = x & y, where x and y are two 256-bit word*/
encrypt.c: ^
encrypt.c: encrypt.c:54:13: error: always_inline function '_mm256_or_si256' requires target feature 'avx2', but would be inlined into function 'morus_stateupdate' that is compiled without support for 'avx2'
encrypt.c: state[0] = ROTL256(state[0], n1);
encrypt.c: ^
encrypt.c: encrypt.c:36:27: note: expanded from macro 'ROTL256'
encrypt.c: #define ROTL256(x,n) OR256( _mm256_slli_epi64((x), (n)), _mm256_srli_epi64((x),(64-n)) ) /*Rotate 4 64-bit unsigned integers in x to the left by n-bit positions*/
encrypt.c: ^
encrypt.c: encrypt.c:25:27: note: expanded from macro 'OR256'
encrypt.c: ...

Number of similar (compiler,implementation) pairs: 5, namely:
CompilerImplementations
clang -march=native -O2 -fomit-frame-pointer -fwrapv -Qunused-arguments -fPIC -fPIE avx2
clang -march=native -O3 -fomit-frame-pointer -fwrapv -Qunused-arguments -fPIC -fPIE avx2
clang -march=native -O -fomit-frame-pointer -fwrapv -Qunused-arguments -fPIC -fPIE avx2
clang -march=native -Os -fomit-frame-pointer -fwrapv -Qunused-arguments -fPIC -fPIE avx2
clang -mcpu=native -O3 -fomit-frame-pointer -fwrapv -Qunused-arguments -fPIC -fPIE avx2

Compiler output

Implementation: avx2
Security model: unknown
Compiler: gcc -march=native -mtune=native -O2 -fomit-frame-pointer -fwrapv -fPIC -fPIE
encrypt.c: In file included from /usr/lib/gcc/x86_64-linux-gnu/7/include/immintrin.h:43:0,
encrypt.c: from encrypt.c:2:
encrypt.c: encrypt.c: In function 'morus_enc_aut_step':
encrypt.c: /usr/lib/gcc/x86_64-linux-gnu/7/include/avx2intrin.h:1068:1: error: inlining failed in call to always_inline '_mm256_permute4x64_epi64': target specific option mismatch
encrypt.c: _mm256_permute4x64_epi64 (__m256i __X, const int __M)
encrypt.c: ^~~~~~~~~~~~~~~~~~~~~~~~
encrypt.c: encrypt.c:38:27: note: called from here
encrypt.c: #define ROTL256_64(x) _mm256_permute4x64_epi64((x), _MM_SHUFFLE(2,1,0,3)) /*Rotate x by 64-bit positions to the left*/
encrypt.c: ^~~~~~~~~~~~~~~~~~~~~~~~~~~~~~~~~~~~~~~~~~~~~~~~~~~
encrypt.c: encrypt.c:204:13: note: in expansion of macro 'ROTL256_64'
encrypt.c: state[2] = ROTL256_64(state[2]);
encrypt.c: ^~~~~~~~~~
encrypt.c: In file included from /usr/lib/gcc/x86_64-linux-gnu/7/include/immintrin.h:43:0,
encrypt.c: from encrypt.c:2:
encrypt.c: /usr/lib/gcc/x86_64-linux-gnu/7/include/avx2intrin.h:574:1: error: inlining failed in call to always_inline '_mm256_or_si256': target specific option mismatch
encrypt.c: _mm256_or_si256 (__m256i __A, __m256i __B)
encrypt.c: ^~~~~~~~~~~~~~~
encrypt.c: encrypt.c:25:27: note: called from here
encrypt.c: #define OR256(x,y) _mm256_or_si256((x),(y)) /*OR(x,y) = x | y, where x and y are two 256-bit word*/
encrypt.c: ^~~~~~~~~~~~~~~~~~~~~~~~
encrypt.c: encrypt.c:36:27: note: in expansion of macro 'OR256'
encrypt.c: #define ROTL256(x,n) OR256( _mm256_slli_epi64((x), (n)), _mm256_srli_epi64((x),(64-n)) ) /*Rotate 4 64-bit unsigned integers in x to the left by n-bit positions*/
encrypt.c: ^~~~~
encrypt.c: encrypt.c:203:13: note: in expansion of macro 'ROTL256'
encrypt.c: state[4] = ROTL256(state[4], n5);
encrypt.c: ...

Number of similar (compiler,implementation) pairs: 4, namely:
CompilerImplementations
gcc -march=native -mtune=native -O2 -fomit-frame-pointer -fwrapv -fPIC -fPIE avx2
gcc -march=native -mtune=native -O3 -fomit-frame-pointer -fwrapv -fPIC -fPIE avx2
gcc -march=native -mtune=native -O -fomit-frame-pointer -fwrapv -fPIC -fPIE avx2
gcc -march=native -mtune=native -Os -fomit-frame-pointer -fwrapv -fPIC -fPIE avx2

Compiler output

Implementation: sse2
Security model: unknown
Compiler: gcc -march=native -mtune=native -Os -fomit-frame-pointer -fwrapv -fPIC -fPIE
try.c: crypto_aead_morus1280128v2.a(encrypt.o): In function `morus_initialization':
try.c: encrypt.c:(.text+0x...): undefined reference to `morus_stateupdate'
try.c: crypto_aead_morus1280128v2.a(encrypt.o): In function `morus_initialization_key_256':
try.c: encrypt.c:(.text+0x...): undefined reference to `morus_stateupdate'
try.c: crypto_aead_morus1280128v2.a(encrypt.o): In function `morus_tag_generation':
try.c: encrypt.c:(.text+0x...): undefined reference to `morus_stateupdate'
try.c: crypto_aead_morus1280128v2.a(encrypt.o): In function `morus_tag_verification':
try.c: encrypt.c:(.text+0x...): undefined reference to `morus_stateupdate'
try.c: crypto_aead_morus1280128v2.a(encrypt.o): In function `morus_enc_aut_partialblock':
try.c: encrypt.c:(.text+0x...): undefined reference to `morus_stateupdate'
try.c: crypto_aead_morus1280128v2.a(encrypt.o):encrypt.c:(.text+0x...): more undefined references to `morus_stateupdate' follow
try.c: crypto_aead_morus1280128v2.a(encrypt.o): In function `crypto_aead_morus1280128v2_sse2_encrypt':
try.c: encrypt.c:(.text+0x...): undefined reference to `morus_enc_aut_step'
try.c: encrypt.c:(.text+0x...): undefined reference to `morus_enc_aut_step'
try.c: crypto_aead_morus1280128v2.a(encrypt.o): In function `crypto_aead_morus1280128v2_sse2_decrypt':
try.c: encrypt.c:(.text+0x...): undefined reference to `morus_enc_aut_step'
try.c: encrypt.c:(.text+0x...): undefined reference to `morus_dec_aut_step'
try.c: collect2: error: ld returned 1 exit status

Number of similar (compiler,implementation) pairs: 1, namely:
CompilerImplementations
gcc -march=native -mtune=native -Os -fomit-frame-pointer -fwrapv -fPIC -fPIE sse2

Namespace violations

Implementation: ref
Security model: unknown
Compiler: clang -march=native -O2 -fomit-frame-pointer -fwrapv -Qunused-arguments -fPIC -fPIE
encrypt.o morus_dec_aut_partialblock T
encrypt.o morus_dec_aut_step T
encrypt.o morus_enc_aut_partialblock T
encrypt.o morus_enc_aut_step T
encrypt.o morus_initialization T
encrypt.o morus_stateupdate T
encrypt.o morus_tag_generation T
encrypt.o morus_tag_verification T

Number of similar (compiler,implementation) pairs: 18, namely:
CompilerImplementations
clang -march=native -O2 -fomit-frame-pointer -fwrapv -Qunused-arguments -fPIC -fPIE ref
clang -march=native -O3 -fomit-frame-pointer -fwrapv -Qunused-arguments -fPIC -fPIE ref
clang -march=native -O -fomit-frame-pointer -fwrapv -Qunused-arguments -fPIC -fPIE ref
clang -march=native -Os -fomit-frame-pointer -fwrapv -Qunused-arguments -fPIC -fPIE ref
clang -mcpu=native -O3 -fomit-frame-pointer -fwrapv -Qunused-arguments -fPIC -fPIE ref
gcc -march=native -mtune=native -O2 -fomit-frame-pointer -fwrapv -fPIC -fPIE ref
gcc -march=native -mtune=native -O3 -fomit-frame-pointer -fwrapv -fPIC -fPIE ref
gcc -march=native -mtune=native -O -fomit-frame-pointer -fwrapv -fPIC -fPIE ref
gcc -march=native -mtune=native -Os -fomit-frame-pointer -fwrapv -fPIC -fPIE ref
clang -march=native -O2 -fomit-frame-pointer -fwrapv -Qunused-arguments -fPIC -fPIE ref64
clang -march=native -O3 -fomit-frame-pointer -fwrapv -Qunused-arguments -fPIC -fPIE ref64
clang -march=native -O -fomit-frame-pointer -fwrapv -Qunused-arguments -fPIC -fPIE ref64
clang -march=native -Os -fomit-frame-pointer -fwrapv -Qunused-arguments -fPIC -fPIE ref64
clang -mcpu=native -O3 -fomit-frame-pointer -fwrapv -Qunused-arguments -fPIC -fPIE ref64
gcc -march=native -mtune=native -O2 -fomit-frame-pointer -fwrapv -fPIC -fPIE ref64
gcc -march=native -mtune=native -O3 -fomit-frame-pointer -fwrapv -fPIC -fPIE ref64
gcc -march=native -mtune=native -O -fomit-frame-pointer -fwrapv -fPIC -fPIE ref64
gcc -march=native -mtune=native -Os -fomit-frame-pointer -fwrapv -fPIC -fPIE ref64

Namespace violations

Implementation: sse2
Security model: unknown
Compiler: clang -march=native -O2 -fomit-frame-pointer -fwrapv -Qunused-arguments -fPIC -fPIE
encrypt.o morus_dec_aut_partialblock T
encrypt.o morus_enc_aut_partialblock T
encrypt.o morus_initialization T
encrypt.o morus_initialization_key_256 T
encrypt.o morus_tag_generation T
encrypt.o morus_tag_verification T

Number of similar (compiler,implementation) pairs: 8, namely:
CompilerImplementations
clang -march=native -O2 -fomit-frame-pointer -fwrapv -Qunused-arguments -fPIC -fPIE sse2
clang -march=native -O3 -fomit-frame-pointer -fwrapv -Qunused-arguments -fPIC -fPIE sse2
clang -march=native -O -fomit-frame-pointer -fwrapv -Qunused-arguments -fPIC -fPIE sse2
clang -march=native -Os -fomit-frame-pointer -fwrapv -Qunused-arguments -fPIC -fPIE sse2
clang -mcpu=native -O3 -fomit-frame-pointer -fwrapv -Qunused-arguments -fPIC -fPIE sse2
gcc -march=native -mtune=native -O2 -fomit-frame-pointer -fwrapv -fPIC -fPIE sse2
gcc -march=native -mtune=native -O3 -fomit-frame-pointer -fwrapv -fPIC -fPIE sse2
gcc -march=native -mtune=native -O -fomit-frame-pointer -fwrapv -fPIC -fPIE sse2