Implementation notes: amd64, h3neo, crypto_aead/paeq128

Computer: h3neo
Architecture: amd64
CPU ID: AuthenticAMD-00100f63-078bfbff
SUPERCOP version: 20170105
Operation: crypto_aead
Primitive: paeq128
TimeObject sizeTest sizeImplementationCompilerBenchmark dateSUPERCOP version
4778384? ? ?? ? ?refg++_-march=k8_-O3_-fomit-frame-pointer2016110520161009
4786093? ? ?? ? ?refg++_-march=native_-mtune=native_-O3_-fomit-frame-pointer_-fwrapv2016110520161009
4791297? ? ?? ? ?refg++_-m64_-march=barcelona_-O3_-fomit-frame-pointer2016110520161009
4795654? ? ?? ? ?refg++_-funroll-loops_-fno-schedule-insns_-O3_-fomit-frame-pointer2016110520161009
4803425? ? ?? ? ?refg++_-march=barcelona_-O3_-fomit-frame-pointer2016110520161009
4808683? ? ?? ? ?refg++_-m64_-march=k8_-O3_-fomit-frame-pointer2016110520161009
4846103? ? ?? ? ?refg++_-m64_-march=native_-mtune=native_-O3_-fomit-frame-pointer2016110520161009
4909442? ? ?? ? ?refg++_-O3_-fomit-frame-pointer2016110520161009
4935027? ? ?? ? ?refg++_-fno-schedule-insns_-O3_-fomit-frame-pointer2016110520161009
4948124? ? ?? ? ?refg++_-m64_-O3_-fomit-frame-pointer2016110520161009
4983237? ? ?? ? ?refg++_-funroll-loops_-fno-schedule-insns_-O2_-fomit-frame-pointer2016110520161009
4998283? ? ?? ? ?refclang++_-O3_-fwrapv_-march=native_-fomit-frame-pointer_-Qunused-arguments2016110520161009
5022702? ? ?? ? ?refclang++_-O3_-fomit-frame-pointer_-Qunused-arguments2016110520161009
5027192? ? ?? ? ?refclang++_-march=native_-O3_-fomit-frame-pointer_-fwrapv_-Qunused-arguments2016110520161009
5029037? ? ?? ? ?refclang++_-mcpu=cortex-a9_-mfpu=neon_-O3_-fomit-frame-pointer_-fwrapv_-Qunused-arguments2016110520161009
5031138? ? ?? ? ?refclang++_-mcpu=cortex-a8_-mfpu=neon_-O3_-fomit-frame-pointer_-fwrapv_-Qunused-arguments2016110520161009
5036403? ? ?? ? ?refclang++_-mcpu=native_-mfpu=neon_-O3_-fomit-frame-pointer_-fwrapv_-Qunused-arguments2016110520161009
5042886? ? ?? ? ?refg++_-m64_-march=nocona_-O3_-fomit-frame-pointer2016110520161009
5160222? ? ?? ? ?refg++_-march=nocona_-O3_-fomit-frame-pointer2016110520161009
8414308? ? ?? ? ?refg++_-funroll-loops_-fno-schedule-insns_-O_-fomit-frame-pointer2016110520161009
11676532? ? ?? ? ?refg++_-m64_-march=nocona_-O2_-fomit-frame-pointer2016110520161009
11705338? ? ?? ? ?refg++_-m64_-march=barcelona_-O2_-fomit-frame-pointer2016110520161009
11710777? ? ?? ? ?refg++_-march=barcelona_-O2_-fomit-frame-pointer2016110520161009
11711628? ? ?? ? ?refg++_-m64_-march=native_-mtune=native_-O2_-fomit-frame-pointer2016110520161009
11775290? ? ?? ? ?refg++_-funroll-loops_-fno-schedule-insns_-Os_-fomit-frame-pointer2016110520161009
11794794? ? ?? ? ?refg++_-march=native_-mtune=native_-O2_-fomit-frame-pointer_-fwrapv2016110520161009
11869647? ? ?? ? ?refg++_-m64_-march=corei7_-O2_-fomit-frame-pointer2016110520161009
11880292? ? ?? ? ?refg++_-m64_-march=core2_-msse4_-O2_-fomit-frame-pointer2016110520161009
11888448? ? ?? ? ?refg++_-m64_-march=core2_-O2_-fomit-frame-pointer2016110520161009
11901291? ? ?? ? ?refg++_-fno-schedule-insns_-O2_-fomit-frame-pointer2016110520161009
11906067? ? ?? ? ?refg++_-m64_-O2_-fomit-frame-pointer2016110520161009
11947569? ? ?? ? ?refg++_-m64_-march=core2_-msse4.1_-O2_-fomit-frame-pointer2016110520161009
11952180? ? ?? ? ?refg++_-march=nocona_-O2_-fomit-frame-pointer2016110520161009
11992045? ? ?? ? ?refg++_-O2_-fomit-frame-pointer2016110520161009
12169237? ? ?? ? ?refg++_-march=k8_-O2_-fomit-frame-pointer2016110520161009
12206517? ? ?? ? ?refg++_-m64_-march=k8_-O2_-fomit-frame-pointer2016110520161009
12882202? ? ?? ? ?refg++_-march=nocona_-O_-fomit-frame-pointer2016110520161009
12908779? ? ?? ? ?refg++_-m64_-march=nocona_-O_-fomit-frame-pointer2016110520161009
13039495? ? ?? ? ?refg++_-m64_-march=nocona_-Os_-fomit-frame-pointer2016110520161009
13145297? ? ?? ? ?refg++_-m64_-march=native_-mtune=native_-O_-fomit-frame-pointer2016110520161009
13150330? ? ?? ? ?refg++_-march=nocona_-Os_-fomit-frame-pointer2016110520161009
13152599? ? ?? ? ?refg++_-march=native_-mtune=native_-O_-fomit-frame-pointer_-fwrapv2016110520161009
13168764? ? ?? ? ?refg++_-O_-fomit-frame-pointer2016110520161009
13183874? ? ?? ? ?refg++_-march=barcelona_-O_-fomit-frame-pointer2016110520161009
13189210? ? ?? ? ?refg++_-m64_-march=barcelona_-O_-fomit-frame-pointer2016110520161009
13292331? ? ?? ? ?refg++_-march=k8_-O_-fomit-frame-pointer2016110520161009
13315816? ? ?? ? ?refg++_-m64_-march=k8_-O_-fomit-frame-pointer2016110520161009
13663058? ? ?? ? ?refg++_-fno-schedule-insns_-O_-fomit-frame-pointer2016110520161009
13798813? ? ?? ? ?refg++_-m64_-O_-fomit-frame-pointer2016110520161009
13854075? ? ?? ? ?refg++_-m64_-march=core2_-msse4.1_-O_-fomit-frame-pointer2016110520161009
13938234? ? ?? ? ?refg++_-m64_-march=core2_-msse4_-O_-fomit-frame-pointer2016110520161009
13946535? ? ?? ? ?refg++_-m64_-march=corei7_-O_-fomit-frame-pointer2016110520161009
13974760? ? ?? ? ?refg++_-m64_-march=core2_-O_-fomit-frame-pointer2016110520161009
17956581? ? ?? ? ?refg++_-m64_-march=barcelona_-Os_-fomit-frame-pointer2016110520161009
18180686? ? ?? ? ?refg++_-m64_-march=native_-mtune=native_-Os_-fomit-frame-pointer2016110520161009
18255820? ? ?? ? ?refg++_-march=barcelona_-Os_-fomit-frame-pointer2016110520161009
18272102? ? ?? ? ?refg++_-m64_-march=corei7_-Os_-fomit-frame-pointer2016110520161009
18340715? ? ?? ? ?refg++_-m64_-march=core2_-Os_-fomit-frame-pointer2016110520161009
18374438? ? ?? ? ?refg++_-m64_-march=k8_-Os_-fomit-frame-pointer2016110520161009
18379434? ? ?? ? ?refg++_-march=k8_-Os_-fomit-frame-pointer2016110520161009
18390464? ? ?? ? ?refg++_-fno-schedule-insns_-Os_-fomit-frame-pointer2016110520161009
18421113? ? ?? ? ?refg++_-m64_-Os_-fomit-frame-pointer2016110520161009
18423923? ? ?? ? ?refg++_-Os_-fomit-frame-pointer2016110520161009
18564514? ? ?? ? ?refg++_-march=native_-mtune=native_-Os_-fomit-frame-pointer_-fwrapv2016110520161009
18585833? ? ?? ? ?refg++_-m64_-march=core2_-msse4.1_-Os_-fomit-frame-pointer2016110520161009
18657323? ? ?? ? ?refg++_-m64_-march=core2_-msse4_-Os_-fomit-frame-pointer2016110520161009
60607310? ? ?? ? ?refg++2016110520161009

Test failure

Implementation: crypto_aead/paeq128/ref
Compiler: g++ -m64 -march=core2 -O3 -fomit-frame-pointer
error 111

Number of similar (compiler,implementation) pairs: 1, namely:
CompilerImplementations
g++ -m64 -march=core2 -O3 -fomit-frame-pointer ref

Compiler output

Implementation: crypto_aead/paeq128/opt-win-aes
Compiler: clang++ -O3 -fomit-frame-pointer -Qunused-arguments
encrypt.cpp: In file included from encrypt.cpp:8:
encrypt.cpp: In file included from /usr/bin/../lib/gcc/x86_64-linux-gnu/5.4.0/../../../../include/c++/5.4.0/cstdint:35:
encrypt.cpp: /usr/bin/../lib/gcc/x86_64-linux-gnu/5.4.0/../../../../include/c++/5.4.0/bits/c++0x_warning.h:32:2: error: This file requires compiler and library support for the ISO C++ 2011 standard. This support must be enabled with the -std=c++11 or -std=gnu++11 compiler options.
encrypt.cpp: #error This file requires compiler and library support \
encrypt.cpp: ^
encrypt.cpp: encrypt.cpp:13:10: fatal error: 'intrin.h' file not found
encrypt.cpp: #include <intrin.h>
encrypt.cpp: ^
encrypt.cpp: 2 errors generated.

Number of similar (compiler,implementation) pairs: 6, namely:
CompilerImplementations
clang++ -O3 -fomit-frame-pointer -Qunused-arguments opt-win-aes
clang++ -O3 -fwrapv -march=native -fomit-frame-pointer -Qunused-arguments opt-win-aes
clang++ -march=native -O3 -fomit-frame-pointer -fwrapv -Qunused-arguments opt-win-aes
clang++ -mcpu=cortex-a8 -mfpu=neon -O3 -fomit-frame-pointer -fwrapv -Qunused-arguments opt-win-aes
clang++ -mcpu=cortex-a9 -mfpu=neon -O3 -fomit-frame-pointer -fwrapv -Qunused-arguments opt-win-aes
clang++ -mcpu=native -mfpu=neon -O3 -fomit-frame-pointer -fwrapv -Qunused-arguments opt-win-aes

Compiler output

Implementation: crypto_aead/paeq128/aesni
Compiler: clang++ -O3 -fomit-frame-pointer -Qunused-arguments
encrypt.cpp: encrypt.cpp:167:11: error: always_inline function '_mm_aesenc_si128' requires target feature 'aes', but would be inlined into function 'DoubleFPermAsm' that is compiled without support for 'aes'
encrypt.cpp: acc0 = _mm_aesenc_si128(acc0, roundkey0);
encrypt.cpp: ^
encrypt.cpp: encrypt.cpp:168:11: error: always_inline function '_mm_aesenc_si128' requires target feature 'aes', but would be inlined into function 'DoubleFPermAsm' that is compiled without support for 'aes'
encrypt.cpp: acc1 = _mm_aesenc_si128(acc1, roundkey1);
encrypt.cpp: ^
encrypt.cpp: encrypt.cpp:169:11: error: always_inline function '_mm_aesenc_si128' requires target feature 'aes', but would be inlined into function 'DoubleFPermAsm' that is compiled without support for 'aes'
encrypt.cpp: acc2 = _mm_aesenc_si128(acc2, roundkey2);
encrypt.cpp: ^
encrypt.cpp: encrypt.cpp:170:11: error: always_inline function '_mm_aesenc_si128' requires target feature 'aes', but would be inlined into function 'DoubleFPermAsm' that is compiled without support for 'aes'
encrypt.cpp: acc3 = _mm_aesenc_si128(acc3, roundkey3);
encrypt.cpp: ^
encrypt.cpp: encrypt.cpp:172:11: error: always_inline function '_mm_aesenc_si128' requires target feature 'aes', but would be inlined into function 'DoubleFPermAsm' that is compiled without support for 'aes'
encrypt.cpp: acc4 = _mm_aesenc_si128(acc4, roundkey0);
encrypt.cpp: ^
encrypt.cpp: encrypt.cpp:173:11: error: always_inline function '_mm_aesenc_si128' requires target feature 'aes', but would be inlined into function 'DoubleFPermAsm' that is compiled without support for 'aes'
encrypt.cpp: acc5 = _mm_aesenc_si128(acc5, roundkey1);
encrypt.cpp: ^
encrypt.cpp: encrypt.cpp:174:11: error: always_inline function '_mm_aesenc_si128' requires target feature 'aes', but would be inlined into function 'DoubleFPermAsm' that is compiled without support for 'aes'
encrypt.cpp: acc6 = _mm_aesenc_si128(acc6, roundkey2);
encrypt.cpp: ^
encrypt.cpp: encrypt.cpp:175:11: error: always_inline function '_mm_aesenc_si128' requires target feature 'aes', but would be inlined into function 'DoubleFPermAsm' that is compiled without support for 'aes'
encrypt.cpp: acc7 = _mm_aesenc_si128(acc7, roundkey3);
encrypt.cpp: ^
encrypt.cpp: 8 errors generated.

Number of similar (compiler,implementation) pairs: 6, namely:
CompilerImplementations
clang++ -O3 -fomit-frame-pointer -Qunused-arguments aesni
clang++ -O3 -fwrapv -march=native -fomit-frame-pointer -Qunused-arguments aesni
clang++ -march=native -O3 -fomit-frame-pointer -fwrapv -Qunused-arguments aesni
clang++ -mcpu=cortex-a8 -mfpu=neon -O3 -fomit-frame-pointer -fwrapv -Qunused-arguments aesni
clang++ -mcpu=cortex-a9 -mfpu=neon -O3 -fomit-frame-pointer -fwrapv -Qunused-arguments aesni
clang++ -mcpu=native -mfpu=neon -O3 -fomit-frame-pointer -fwrapv -Qunused-arguments aesni

Compiler output

Implementation: crypto_aead/paeq128/opt-win-aes
Compiler: g++
encrypt.cpp: In file included from /usr/include/c++/5/cstdint:35:0,
encrypt.cpp: from encrypt.cpp:8:
encrypt.cpp: /usr/include/c++/5/bits/c++0x_warning.h:32:2: error: #error This file requires compiler and library support for the ISO C++ 2011 standard. This support must be enabled with the -std=c++11 or -std=gnu++11 compiler options.
encrypt.cpp: #error This file requires compiler and library support \
encrypt.cpp: ^
encrypt.cpp: encrypt.cpp:13:20: fatal error: intrin.h: No such file or directory
encrypt.cpp: #include <intrin.h>
encrypt.cpp: ^
encrypt.cpp: compilation terminated.

Number of similar (compiler,implementation) pairs: 58, namely:
CompilerImplementations
g++ opt-win-aes
g++ -O2 -fomit-frame-pointer opt-win-aes
g++ -O3 -fomit-frame-pointer opt-win-aes
g++ -O -fomit-frame-pointer opt-win-aes
g++ -Os -fomit-frame-pointer opt-win-aes
g++ -fno-schedule-insns -O2 -fomit-frame-pointer opt-win-aes
g++ -fno-schedule-insns -O3 -fomit-frame-pointer opt-win-aes
g++ -fno-schedule-insns -O -fomit-frame-pointer opt-win-aes
g++ -fno-schedule-insns -Os -fomit-frame-pointer opt-win-aes
g++ -funroll-loops -fno-schedule-insns -O2 -fomit-frame-pointer opt-win-aes
g++ -funroll-loops -fno-schedule-insns -O3 -fomit-frame-pointer opt-win-aes
g++ -funroll-loops -fno-schedule-insns -O -fomit-frame-pointer opt-win-aes
g++ -funroll-loops -fno-schedule-insns -Os -fomit-frame-pointer opt-win-aes
g++ -m64 -O2 -fomit-frame-pointer opt-win-aes
g++ -m64 -O3 -fomit-frame-pointer opt-win-aes
g++ -m64 -O -fomit-frame-pointer opt-win-aes
g++ -m64 -Os -fomit-frame-pointer opt-win-aes
g++ -m64 -march=core2 -O2 -fomit-frame-pointer opt-win-aes
g++ -m64 -march=core2 -O3 -fomit-frame-pointer opt-win-aes
g++ -m64 -march=core2 -O -fomit-frame-pointer opt-win-aes
g++ -m64 -march=core2 -Os -fomit-frame-pointer opt-win-aes
g++ -m64 -march=core2 -msse4.1 -O2 -fomit-frame-pointer opt-win-aes
g++ -m64 -march=core2 -msse4.1 -O -fomit-frame-pointer opt-win-aes
g++ -m64 -march=core2 -msse4.1 -Os -fomit-frame-pointer opt-win-aes
g++ -m64 -march=core2 -msse4 -O2 -fomit-frame-pointer opt-win-aes
g++ -m64 -march=core2 -msse4 -O -fomit-frame-pointer opt-win-aes
g++ -m64 -march=core2 -msse4 -Os -fomit-frame-pointer opt-win-aes
g++ -m64 -march=corei7 -O2 -fomit-frame-pointer opt-win-aes
g++ -m64 -march=corei7 -O -fomit-frame-pointer opt-win-aes
g++ -m64 -march=corei7 -Os -fomit-frame-pointer opt-win-aes
g++ -m64 -march=k8 -O2 -fomit-frame-pointer opt-win-aes
g++ -m64 -march=k8 -O3 -fomit-frame-pointer opt-win-aes
g++ -m64 -march=k8 -O -fomit-frame-pointer opt-win-aes
g++ -m64 -march=k8 -Os -fomit-frame-pointer opt-win-aes
g++ -m64 -march=native -mtune=native -O2 -fomit-frame-pointer opt-win-aes
g++ -m64 -march=native -mtune=native -O3 -fomit-frame-pointer opt-win-aes
g++ -m64 -march=native -mtune=native -O -fomit-frame-pointer opt-win-aes
g++ -m64 -march=native -mtune=native -Os -fomit-frame-pointer opt-win-aes
g++ -m64 -march=nocona -O2 -fomit-frame-pointer opt-win-aes
g++ -m64 -march=nocona -O3 -fomit-frame-pointer opt-win-aes
g++ -m64 -march=nocona -O -fomit-frame-pointer opt-win-aes
g++ -m64 -march=nocona -Os -fomit-frame-pointer opt-win-aes
g++ -march=barcelona -O2 -fomit-frame-pointer opt-win-aes
g++ -march=barcelona -O3 -fomit-frame-pointer opt-win-aes
g++ -march=barcelona -O -fomit-frame-pointer opt-win-aes
g++ -march=barcelona -Os -fomit-frame-pointer opt-win-aes
g++ -march=k8 -O2 -fomit-frame-pointer opt-win-aes
g++ -march=k8 -O3 -fomit-frame-pointer opt-win-aes
g++ -march=k8 -O -fomit-frame-pointer opt-win-aes
g++ -march=k8 -Os -fomit-frame-pointer opt-win-aes
g++ -march=native -mtune=native -O2 -fomit-frame-pointer -fwrapv opt-win-aes
g++ -march=native -mtune=native -O3 -fomit-frame-pointer -fwrapv opt-win-aes
g++ -march=native -mtune=native -O -fomit-frame-pointer -fwrapv opt-win-aes
g++ -march=native -mtune=native -Os -fomit-frame-pointer -fwrapv opt-win-aes
g++ -march=nocona -O2 -fomit-frame-pointer opt-win-aes
g++ -march=nocona -O3 -fomit-frame-pointer opt-win-aes
g++ -march=nocona -O -fomit-frame-pointer opt-win-aes
g++ -march=nocona -Os -fomit-frame-pointer opt-win-aes

Compiler output

Implementation: crypto_aead/paeq128/aesni
Compiler: g++
encrypt.cpp: In file included from encrypt.cpp:13:0:
encrypt.cpp: /usr/lib/gcc/x86_64-linux-gnu/5/include/wmmintrin.h: In function 'void DoubleFPermAsm(const __m128i*, const __m128i*, __m128i*, __m128i*)':
encrypt.cpp: /usr/lib/gcc/x86_64-linux-gnu/5/include/wmmintrin.h:61:1: error: inlining failed in call to always_inline '__m128i _mm_aesenc_si128(__m128i, __m128i)': target specific option mismatch
encrypt.cpp: _mm_aesenc_si128 (__m128i __X, __m128i __Y)
encrypt.cpp: ^
encrypt.cpp: encrypt.cpp:175:44: error: called from here
encrypt.cpp: acc7 = _mm_aesenc_si128(acc7, roundkey3);
encrypt.cpp: ^
encrypt.cpp: In file included from encrypt.cpp:13:0:
encrypt.cpp: /usr/lib/gcc/x86_64-linux-gnu/5/include/wmmintrin.h:61:1: error: inlining failed in call to always_inline '__m128i _mm_aesenc_si128(__m128i, __m128i)': target specific option mismatch
encrypt.cpp: _mm_aesenc_si128 (__m128i __X, __m128i __Y)
encrypt.cpp: ^
encrypt.cpp: encrypt.cpp:174:44: error: called from here
encrypt.cpp: acc6 = _mm_aesenc_si128(acc6, roundkey2);
encrypt.cpp: ^
encrypt.cpp: In file included from encrypt.cpp:13:0:
encrypt.cpp: /usr/lib/gcc/x86_64-linux-gnu/5/include/wmmintrin.h:61:1: error: inlining failed in call to always_inline '__m128i _mm_aesenc_si128(__m128i, __m128i)': target specific option mismatch
encrypt.cpp: _mm_aesenc_si128 (__m128i __X, __m128i __Y)
encrypt.cpp: ^
encrypt.cpp: encrypt.cpp:173:44: error: called from here
encrypt.cpp: acc5 = _mm_aesenc_si128(acc5, roundkey1);
encrypt.cpp: ^
encrypt.cpp: In file included from encrypt.cpp:13:0:
encrypt.cpp: /usr/lib/gcc/x86_64-linux-gnu/5/include/wmmintrin.h:61:1: error: inlining failed in call to always_inline '__m128i _mm_aesenc_si128(__m128i, __m128i)': target specific option mismatch
encrypt.cpp: _mm_aesenc_si128 (__m128i __X, __m128i __Y)
encrypt.cpp: ...

Number of similar (compiler,implementation) pairs: 58, namely:
CompilerImplementations
g++ aesni
g++ -O2 -fomit-frame-pointer aesni
g++ -O3 -fomit-frame-pointer aesni
g++ -O -fomit-frame-pointer aesni
g++ -Os -fomit-frame-pointer aesni
g++ -fno-schedule-insns -O2 -fomit-frame-pointer aesni
g++ -fno-schedule-insns -O3 -fomit-frame-pointer aesni
g++ -fno-schedule-insns -O -fomit-frame-pointer aesni
g++ -fno-schedule-insns -Os -fomit-frame-pointer aesni
g++ -funroll-loops -fno-schedule-insns -O2 -fomit-frame-pointer aesni
g++ -funroll-loops -fno-schedule-insns -O3 -fomit-frame-pointer aesni
g++ -funroll-loops -fno-schedule-insns -O -fomit-frame-pointer aesni
g++ -funroll-loops -fno-schedule-insns -Os -fomit-frame-pointer aesni
g++ -m64 -O2 -fomit-frame-pointer aesni
g++ -m64 -O3 -fomit-frame-pointer aesni
g++ -m64 -O -fomit-frame-pointer aesni
g++ -m64 -Os -fomit-frame-pointer aesni
g++ -m64 -march=core2 -O2 -fomit-frame-pointer aesni
g++ -m64 -march=core2 -O3 -fomit-frame-pointer aesni
g++ -m64 -march=core2 -O -fomit-frame-pointer aesni
g++ -m64 -march=core2 -Os -fomit-frame-pointer aesni
g++ -m64 -march=core2 -msse4.1 -O2 -fomit-frame-pointer aesni
g++ -m64 -march=core2 -msse4.1 -O -fomit-frame-pointer aesni
g++ -m64 -march=core2 -msse4.1 -Os -fomit-frame-pointer aesni
g++ -m64 -march=core2 -msse4 -O2 -fomit-frame-pointer aesni
g++ -m64 -march=core2 -msse4 -O -fomit-frame-pointer aesni
g++ -m64 -march=core2 -msse4 -Os -fomit-frame-pointer aesni
g++ -m64 -march=corei7 -O2 -fomit-frame-pointer aesni
g++ -m64 -march=corei7 -O -fomit-frame-pointer aesni
g++ -m64 -march=corei7 -Os -fomit-frame-pointer aesni
g++ -m64 -march=k8 -O2 -fomit-frame-pointer aesni
g++ -m64 -march=k8 -O3 -fomit-frame-pointer aesni
g++ -m64 -march=k8 -O -fomit-frame-pointer aesni
g++ -m64 -march=k8 -Os -fomit-frame-pointer aesni
g++ -m64 -march=native -mtune=native -O2 -fomit-frame-pointer aesni
g++ -m64 -march=native -mtune=native -O3 -fomit-frame-pointer aesni
g++ -m64 -march=native -mtune=native -O -fomit-frame-pointer aesni
g++ -m64 -march=native -mtune=native -Os -fomit-frame-pointer aesni
g++ -m64 -march=nocona -O2 -fomit-frame-pointer aesni
g++ -m64 -march=nocona -O3 -fomit-frame-pointer aesni
g++ -m64 -march=nocona -O -fomit-frame-pointer aesni
g++ -m64 -march=nocona -Os -fomit-frame-pointer aesni
g++ -march=barcelona -O2 -fomit-frame-pointer aesni
g++ -march=barcelona -O3 -fomit-frame-pointer aesni
g++ -march=barcelona -O -fomit-frame-pointer aesni
g++ -march=barcelona -Os -fomit-frame-pointer aesni
g++ -march=k8 -O2 -fomit-frame-pointer aesni
g++ -march=k8 -O3 -fomit-frame-pointer aesni
g++ -march=k8 -O -fomit-frame-pointer aesni
g++ -march=k8 -Os -fomit-frame-pointer aesni
g++ -march=native -mtune=native -O2 -fomit-frame-pointer -fwrapv aesni
g++ -march=native -mtune=native -O3 -fomit-frame-pointer -fwrapv aesni
g++ -march=native -mtune=native -O -fomit-frame-pointer -fwrapv aesni
g++ -march=native -mtune=native -Os -fomit-frame-pointer -fwrapv aesni
g++ -march=nocona -O2 -fomit-frame-pointer aesni
g++ -march=nocona -O3 -fomit-frame-pointer aesni
g++ -march=nocona -O -fomit-frame-pointer aesni
g++ -march=nocona -Os -fomit-frame-pointer aesni

Compiler output

Implementation: crypto_aead/paeq128/opt-win-aes
Compiler: g++ -m64 -march=barcelona -O2 -fomit-frame-pointer
encrypt.cpp: In file included from /usr/include/c++/5/cstdint:35:0,
encrypt.cpp: from encrypt.cpp:8:
encrypt.cpp: /usr/include/c++/5/bits/c++0x_warning.h:32:2: error: #error This file requires compiler and library support for the ISO C++ 2011 standard. This support must be enabled with the -std=c++11 or -std=gnu++11 compiler options.
encrypt.cpp: #error This file requires compiler and library support \
encrypt.cpp: ^
encrypt.cpp: encrypt.cpp:13:20: fatal error: intrin.h: No such file or directory
encrypt.cpp: #include <intrin.h>
encrypt.cpp: ^
encrypt.cpp: compilation terminated.
encrypt.cpp: In file included from /usr/include/c++/5/cstdint:35:0,
encrypt.cpp: from encrypt.cpp:8:
encrypt.cpp: /usr/include/c++/5/bits/c++0x_warning.h:32:2: error: #error This file requires compiler and library support for the ISO C++ 2011 standard. This support must be enabled with the -std=c++11 or -std=gnu++11 compiler options.
encrypt.cpp: #error This file requires compiler and library support \
encrypt.cpp: ^
encrypt.cpp: encrypt.cpp:13:20: fatal error: intrin.h: No such file or directory
encrypt.cpp: #include <intrin.h>
encrypt.cpp: ^
encrypt.cpp: compilation terminated.

Number of similar (compiler,implementation) pairs: 4, namely:
CompilerImplementations
g++ -m64 -march=barcelona -O2 -fomit-frame-pointer opt-win-aes
g++ -m64 -march=barcelona -O3 -fomit-frame-pointer opt-win-aes
g++ -m64 -march=barcelona -O -fomit-frame-pointer opt-win-aes
g++ -m64 -march=barcelona -Os -fomit-frame-pointer opt-win-aes

Compiler output

Implementation: crypto_aead/paeq128/aesni
Compiler: g++ -m64 -march=barcelona -O2 -fomit-frame-pointer
encrypt.cpp: In file included from encrypt.cpp:13:0:
encrypt.cpp: /usr/lib/gcc/x86_64-linux-gnu/5/include/wmmintrin.h: In function 'void DoubleFPermAsm(const __m128i*, const __m128i*, __m128i*, __m128i*)':
encrypt.cpp: /usr/lib/gcc/x86_64-linux-gnu/5/include/wmmintrin.h:61:1: error: inlining failed in call to always_inline '__m128i _mm_aesenc_si128(__m128i, __m128i)': target specific option mismatch
encrypt.cpp: _mm_aesenc_si128 (__m128i __X, __m128i __Y)
encrypt.cpp: ^
encrypt.cpp: encrypt.cpp:175:44: error: called from here
encrypt.cpp: acc7 = _mm_aesenc_si128(acc7, roundkey3);
encrypt.cpp: ^
encrypt.cpp: In file included from encrypt.cpp:13:0:
encrypt.cpp: /usr/lib/gcc/x86_64-linux-gnu/5/include/wmmintrin.h:61:1: error: inlining failed in call to always_inline '__m128i _mm_aesenc_si128(__m128i, __m128i)': target specific option mismatch
encrypt.cpp: _mm_aesenc_si128 (__m128i __X, __m128i __Y)
encrypt.cpp: ^
encrypt.cpp: encrypt.cpp:174:44: error: called from here
encrypt.cpp: acc6 = _mm_aesenc_si128(acc6, roundkey2);
encrypt.cpp: ^
encrypt.cpp: In file included from encrypt.cpp:13:0:
encrypt.cpp: /usr/lib/gcc/x86_64-linux-gnu/5/include/wmmintrin.h:61:1: error: inlining failed in call to always_inline '__m128i _mm_aesenc_si128(__m128i, __m128i)': target specific option mismatch
encrypt.cpp: _mm_aesenc_si128 (__m128i __X, __m128i __Y)
encrypt.cpp: ^
encrypt.cpp: encrypt.cpp:173:44: error: called from here
encrypt.cpp: acc5 = _mm_aesenc_si128(acc5, roundkey1);
encrypt.cpp: ^
encrypt.cpp: In file included from encrypt.cpp:13:0:
encrypt.cpp: /usr/lib/gcc/x86_64-linux-gnu/5/include/wmmintrin.h:61:1: error: inlining failed in call to always_inline '__m128i _mm_aesenc_si128(__m128i, __m128i)': target specific option mismatch
encrypt.cpp: _mm_aesenc_si128 (__m128i __X, __m128i __Y)
encrypt.cpp: ...
encrypt.cpp: In file included from encrypt.cpp:13:0:
encrypt.cpp: /usr/lib/gcc/x86_64-linux-gnu/5/include/wmmintrin.h: In function 'void DoubleFPermAsm(const __m128i*, const __m128i*, __m128i*, __m128i*)':
encrypt.cpp: /usr/lib/gcc/x86_64-linux-gnu/5/include/wmmintrin.h:61:1: error: inlining failed in call to always_inline '__m128i _mm_aesenc_si128(__m128i, __m128i)': target specific option mismatch
encrypt.cpp: _mm_aesenc_si128 (__m128i __X, __m128i __Y)
encrypt.cpp: ^
encrypt.cpp: encrypt.cpp:175:44: error: called from here
encrypt.cpp: acc7 = _mm_aesenc_si128(acc7, roundkey3);
encrypt.cpp: ^
encrypt.cpp: In file included from encrypt.cpp:13:0:
encrypt.cpp: /usr/lib/gcc/x86_64-linux-gnu/5/include/wmmintrin.h:61:1: error: inlining failed in call to always_inline '__m128i _mm_aesenc_si128(__m128i, __m128i)': target specific option mismatch
encrypt.cpp: _mm_aesenc_si128 (__m128i __X, __m128i __Y)
encrypt.cpp: ^
encrypt.cpp: encrypt.cpp:174:44: error: called from here
encrypt.cpp: acc6 = _mm_aesenc_si128(acc6, roundkey2);
encrypt.cpp: ^
encrypt.cpp: In file included from encrypt.cpp:13:0:
encrypt.cpp: /usr/lib/gcc/x86_64-linux-gnu/5/include/wmmintrin.h:61:1: error: inlining failed in call to always_inline '__m128i _mm_aesenc_si128(__m128i, __m128i)': target specific option mismatch
encrypt.cpp: _mm_aesenc_si128 (__m128i __X, __m128i __Y)
encrypt.cpp: ^
encrypt.cpp: encrypt.cpp:173:44: error: called from here
encrypt.cpp: acc5 = _mm_aesenc_si128(acc5, roundkey1);
encrypt.cpp: ^
encrypt.cpp: In file included from encrypt.cpp:13:0:
encrypt.cpp: /usr/lib/gcc/x86_64-linux-gnu/5/include/wmmintrin.h:61:1: error: inlining failed in call to always_inline '__m128i _mm_aesenc_si128(__m128i, __m128i)': target specific option mismatch
encrypt.cpp: _mm_aesenc_si128 (__m128i __X, __m128i __Y)
encrypt.cpp: ...

Number of similar (compiler,implementation) pairs: 4, namely:
CompilerImplementations
g++ -m64 -march=barcelona -O2 -fomit-frame-pointer aesni
g++ -m64 -march=barcelona -O3 -fomit-frame-pointer aesni
g++ -m64 -march=barcelona -O -fomit-frame-pointer aesni
g++ -m64 -march=barcelona -Os -fomit-frame-pointer aesni