Test results for amd64, h2atom, crypto_stream/chacha20

[Page version: 20260919 18:54:16]

Measurements for amd64, h2atom, crypto_stream Test results for amd64, h2atom, crypto_stream Test results for crypto_stream/chacha20
Computer: h2atom
Microarchitecture: amd64; Bonnell (106ca)
Architecture: amd64
CPU ID: GenuineIntel-000106ca-bfe9fbff
SUPERCOP version: 20260330
Operation: crypto_stream
Primitive: chacha20
TimeObject sizeTest sizeImplementationCompilerBenchmark dateSUPERCOP version
97353952 0 028180 1240 1544moon/sse2/64clang -march=native -O2 -fwrapv -Qunused-arguments -fPIC -fPIE -gdwarf-4 -Wall2026051620260330
97353952 0 029388 1240 1544moon/sse2/64clang -march=native -O3 -fwrapv -Qunused-arguments -fPIC -fPIE -gdwarf-4 -Wall2026051620260330
97353952 0 026868 1240 1544moon/sse2/64clang -march=native -O -fwrapv -Qunused-arguments -fPIC -fPIE -gdwarf-4 -Wall2026051620260330
97383952 0 029388 1240 1544moon/sse2/64clang -mcpu=native -O3 -fwrapv -Qunused-arguments -fPIC -fPIE -gdwarf-4 -Wall2026051620260330
97413981 0 025953 1200 1608moon/sse2/64gcc -march=native -mtune=native -Os -fwrapv -fPIC -fPIE -gdwarf-4 -Wall2026051620260330
97424012 0 028139 1224 1640moon/sse2/64gcc -march=native -mtune=native -O2 -fwrapv -fPIC -fPIE -gdwarf-4 -Wall2026051620260330
97424012 0 029299 1224 1640moon/sse2/64gcc -march=native -mtune=native -O3 -fwrapv -fPIC -fPIE -gdwarf-4 -Wall2026051620260330
97453941 0 026270 1232 1544moon/sse2/64clang -march=native -Os -fwrapv -Qunused-arguments -fPIC -fPIE -gdwarf-4 -Wall2026051620260330
97504006 0 027362 1216 1640moon/sse2/64gcc -march=native -mtune=native -O -fwrapv -fPIC -fPIE -gdwarf-4 -Wall2026051620260330
102974621 0 128868 1240 1544e/amd64-xmm6clang -march=native -O2 -fwrapv -Qunused-arguments -fPIC -fPIE -gdwarf-4 -Wall2026051620260330
103004620 0 130044 1240 1544e/amd64-xmm6clang -mcpu=native -O3 -fwrapv -Qunused-arguments -fPIC -fPIE -gdwarf-4 -Wall2026051620260330
103044621 0 130044 1240 1544e/amd64-xmm6clang -march=native -O3 -fwrapv -Qunused-arguments -fPIC -fPIE -gdwarf-4 -Wall2026051620260330
103074661 0 426625 1200 1640e/amd64-xmm6gcc -march=native -mtune=native -Os -fwrapv -fPIC -fPIE -gdwarf-4 -Wall2026051620260330
103104884 0 429019 1224 1672e/amd64-xmm6gcc -march=native -mtune=native -O2 -fwrapv -fPIC -fPIE -gdwarf-4 -Wall2026051620260330
103104884 0 430179 1224 1672e/amd64-xmm6gcc -march=native -mtune=native -O3 -fwrapv -fPIC -fPIE -gdwarf-4 -Wall2026051620260330
103114621 0 127556 1240 1544e/amd64-xmm6clang -march=native -O -fwrapv -Qunused-arguments -fPIC -fPIE -gdwarf-4 -Wall2026051620260330
103224849 0 428242 1216 1672e/amd64-xmm6gcc -march=native -mtune=native -O -fwrapv -fPIC -fPIE -gdwarf-4 -Wall2026051620260330
103254564 0 126894 1232 1544e/amd64-xmm6clang -march=native -Os -fwrapv -Qunused-arguments -fPIC -fPIE -gdwarf-4 -Wall2026051620260330
158405876 0 429818 1216 1672dolbeau/amd64-avx2gcc -march=native -mtune=native -O -fwrapv -fPIC -fPIE -gdwarf-4 -Wall2026051620260330
161254429 0 128700 1240 1544amd64-ssse3clang -march=native -O2 -fwrapv -Qunused-arguments -fPIC -fPIE -gdwarf-4 -Wall2026051620260330
161254429 0 129876 1240 1544amd64-ssse3clang -march=native -O3 -fwrapv -Qunused-arguments -fPIC -fPIE -gdwarf-4 -Wall2026051620260330
161254429 0 127372 1240 1544amd64-ssse3clang -march=native -O -fwrapv -Qunused-arguments -fPIC -fPIE -gdwarf-4 -Wall2026051620260330
161284428 0 129876 1240 1544amd64-ssse3clang -mcpu=native -O3 -fwrapv -Qunused-arguments -fPIC -fPIE -gdwarf-4 -Wall2026051620260330
161324372 0 126694 1232 1544amd64-ssse3clang -march=native -Os -fwrapv -Qunused-arguments -fPIC -fPIE -gdwarf-4 -Wall2026051620260330
161364692 0 428835 1224 1672amd64-ssse3gcc -march=native -mtune=native -O2 -fwrapv -fPIC -fPIE -gdwarf-4 -Wall2026051620260330
161364692 0 429995 1224 1672amd64-ssse3gcc -march=native -mtune=native -O3 -fwrapv -fPIC -fPIE -gdwarf-4 -Wall2026051620260330
161374469 0 426433 1200 1640amd64-ssse3gcc -march=native -mtune=native -Os -fwrapv -fPIC -fPIE -gdwarf-4 -Wall2026051620260330
161464657 0 428050 1216 1672amd64-ssse3gcc -march=native -mtune=native -O -fwrapv -fPIC -fPIE -gdwarf-4 -Wall2026051620260330
168492816 0 427539 1224 1672e/mergedgcc -march=native -mtune=native -O2 -fwrapv -fPIC -fPIE -gdwarf-4 -Wall2026051620260330
168513753 0 027972 1240 1544moon/ssse3/64clang -march=native -O2 -fwrapv -Qunused-arguments -fPIC -fPIE -gdwarf-4 -Wall2026051620260330
168513753 0 026660 1240 1544moon/ssse3/64clang -march=native -O -fwrapv -Qunused-arguments -fPIC -fPIE -gdwarf-4 -Wall2026051620260330
168523753 0 029180 1240 1544moon/ssse3/64clang -march=native -O3 -fwrapv -Qunused-arguments -fPIC -fPIE -gdwarf-4 -Wall2026051620260330
168543753 0 029180 1240 1544moon/ssse3/64clang -mcpu=native -O3 -fwrapv -Qunused-arguments -fPIC -fPIE -gdwarf-4 -Wall2026051620260330
168573782 0 025745 1200 1608moon/ssse3/64gcc -march=native -mtune=native -Os -fwrapv -fPIC -fPIE -gdwarf-4 -Wall2026051620260330
168583813 0 027931 1224 1640moon/ssse3/64gcc -march=native -mtune=native -O2 -fwrapv -fPIC -fPIE -gdwarf-4 -Wall2026051620260330
168583813 0 029091 1224 1640moon/ssse3/64gcc -march=native -mtune=native -O3 -fwrapv -fPIC -fPIE -gdwarf-4 -Wall2026051620260330
168623742 0 026062 1232 1544moon/ssse3/64clang -march=native -Os -fwrapv -Qunused-arguments -fPIC -fPIE -gdwarf-4 -Wall2026051620260330
168663807 0 027154 1216 1640moon/ssse3/64gcc -march=native -mtune=native -O -fwrapv -fPIC -fPIE -gdwarf-4 -Wall2026051620260330
168874144 0 430027 1224 1672e/mergedgcc -march=native -mtune=native -O3 -fwrapv -fPIC -fPIE -gdwarf-4 -Wall2026051620260330
179926112 0 430835 1224 1672dolbeau/amd64-avx2gcc -march=native -mtune=native -O2 -fwrapv -fPIC -fPIE -gdwarf-4 -Wall2026051620260330
182765187 0 427689 1200 1640dolbeau/amd64-avx2gcc -march=native -mtune=native -Os -fwrapv -fPIC -fPIE -gdwarf-4 -Wall2026051620260330
182904887 0 127836 1240 1544dolbeau/amd64-avx2clang -march=native -O -fwrapv -Qunused-arguments -fPIC -fPIE -gdwarf-4 -Wall2026051620260330
184135859 0 431755 1224 1672e/regsgcc -march=native -mtune=native -O3 -fwrapv -fPIC -fPIE -gdwarf-4 -Wall2026051620260330
189495671 0 131116 1240 1544dolbeau/amd64-avx2clang -march=native -O3 -fwrapv -Qunused-arguments -fPIC -fPIE -gdwarf-4 -Wall2026051620260330
191084782 0 127118 1232 1544dolbeau/amd64-avx2clang -march=native -Os -fwrapv -Qunused-arguments -fPIC -fPIE -gdwarf-4 -Wall2026051620260330
192765127 0 129380 1240 1544dolbeau/amd64-avx2clang -march=native -O2 -fwrapv -Qunused-arguments -fPIC -fPIE -gdwarf-4 -Wall2026051620260330
193922688 0 126916 1240 1544e/amd64-3clang -march=native -O2 -fwrapv -Qunused-arguments -fPIC -fPIE -gdwarf-4 -Wall2026051620260330
193922688 0 128092 1240 1544e/amd64-3clang -march=native -O3 -fwrapv -Qunused-arguments -fPIC -fPIE -gdwarf-4 -Wall2026051620260330
193922688 0 125604 1240 1544e/amd64-3clang -march=native -O -fwrapv -Qunused-arguments -fPIC -fPIE -gdwarf-4 -Wall2026051620260330
193922635 0 124942 1232 1544e/amd64-3clang -march=native -Os -fwrapv -Qunused-arguments -fPIC -fPIE -gdwarf-4 -Wall2026051620260330
193962687 0 128092 1240 1544e/amd64-3clang -mcpu=native -O3 -fwrapv -Qunused-arguments -fPIC -fPIE -gdwarf-4 -Wall2026051620260330
194022730 0 424689 1200 1640e/amd64-3gcc -march=native -mtune=native -Os -fwrapv -fPIC -fPIE -gdwarf-4 -Wall2026051620260330
194052949 0 428243 1224 1672e/amd64-3gcc -march=native -mtune=native -O3 -fwrapv -fPIC -fPIE -gdwarf-4 -Wall2026051620260330
194122949 0 427083 1224 1672e/amd64-3gcc -march=native -mtune=native -O2 -fwrapv -fPIC -fPIE -gdwarf-4 -Wall2026051620260330
194142914 0 426306 1216 1672e/amd64-3gcc -march=native -mtune=native -O -fwrapv -fPIC -fPIE -gdwarf-4 -Wall2026051620260330
194633339 0 429243 1224 1672e/refgcc -march=native -mtune=native -O3 -fwrapv -fPIC -fPIE -gdwarf-4 -Wall2026051620260330
207782343 0 126580 1240 1544e/refclang -march=native -O2 -fwrapv -Qunused-arguments -fPIC -fPIE -gdwarf-4 -Wall2026051620260330
2101913798 3232 01782541 148544 10888T:cryptoppclang++ -march=native -O -fwrapv -Qunused-arguments -fPIC -fPIE -gdwarf-4 -Wall2026051620260330
210946838 2880 01775060 148264 10984T:cryptoppg++ -march=native -mtune=native -Os -fwrapv -fPIC -fPIE -gdwarf-4 -Wall2026051620260330
211077864 976 01774045 146336 10888T:cryptoppclang++ -march=native -O3 -fwrapv -Qunused-arguments -fPIC -fPIE -gdwarf-4 -Wall2026051620260330
2112614879 2240 01785544 147616 11016T:cryptoppg++ -march=native -mtune=native -O3 -fwrapv -fPIC -fPIE -gdwarf-4 -Wall2026051620260330
2113214492 2240 01782498 147616 11016T:cryptoppg++ -march=native -mtune=native -O -fwrapv -fPIC -fPIE -gdwarf-4 -Wall2026051620260330
214842791 0 125716 1240 1544e/mergedclang -march=native -O -fwrapv -Qunused-arguments -fPIC -fPIE -gdwarf-4 -Wall2026051620260330
215844939 976 01768334 146328 10888T:cryptoppclang++ -march=native -Os -fwrapv -Qunused-arguments -fPIC -fPIE -gdwarf-4 -Wall2026051620260330
216947184 976 01771941 146336 10888T:cryptoppclang++ -march=native -O2 -fwrapv -Qunused-arguments -fPIC -fPIE -gdwarf-4 -Wall2026051620260330
2173014879 2240 01783936 147616 11016T:cryptoppg++ -march=native -mtune=native -O2 -fwrapv -fPIC -fPIE -gdwarf-4 -Wall2026051620260330
217722647 0 124974 1232 1544e/mergedclang -march=native -Os -fwrapv -Qunused-arguments -fPIC -fPIE -gdwarf-4 -Wall2026051620260330
222283047 0 127284 1240 1544e/mergedclang -march=native -O2 -fwrapv -Qunused-arguments -fPIC -fPIE -gdwarf-4 -Wall2026051620260330
222293079 0 128508 1240 1544e/mergedclang -march=native -O3 -fwrapv -Qunused-arguments -fPIC -fPIE -gdwarf-4 -Wall2026051620260330
226232791 0 128220 1240 1544e/refclang -march=native -O3 -fwrapv -Qunused-arguments -fPIC -fPIE -gdwarf-4 -Wall2026051620260330
226242775 0 127012 1240 1544e/regsclang -march=native -O2 -fwrapv -Qunused-arguments -fPIC -fPIE -gdwarf-4 -Wall2026051620260330
226242775 0 128204 1240 1544e/regsclang -march=native -O3 -fwrapv -Qunused-arguments -fPIC -fPIE -gdwarf-4 -Wall2026051620260330
232842779 0 427523 1224 1672e/regsgcc -march=native -mtune=native -O2 -fwrapv -fPIC -fPIE -gdwarf-4 -Wall2026051620260330
244416320 0 432203 1224 1672dolbeau/amd64-avx2gcc -march=native -mtune=native -O3 -fwrapv -fPIC -fPIE -gdwarf-4 -Wall2026051620260330
250853099 0 427843 1224 1672e/refgcc -march=native -mtune=native -O2 -fwrapv -fPIC -fPIE -gdwarf-4 -Wall2026051620260330
293682886 0 128300 1240 1544e/refclang -mcpu=native -O3 -fwrapv -Qunused-arguments -fPIC -fPIE -gdwarf-4 -Wall2026051620260330
297033270 0 128684 1240 1544e/mergedclang -mcpu=native -O3 -fwrapv -Qunused-arguments -fPIC -fPIE -gdwarf-4 -Wall2026051620260330
301791909 0 124238 1232 1544e/refclang -march=native -Os -fwrapv -Qunused-arguments -fPIC -fPIE -gdwarf-4 -Wall2026051620260330
304242599 0 125524 1240 1544e/regsclang -march=native -O -fwrapv -Qunused-arguments -fPIC -fPIE -gdwarf-4 -Wall2026051620260330
307852460 0 124782 1232 1544e/regsclang -march=native -Os -fwrapv -Qunused-arguments -fPIC -fPIE -gdwarf-4 -Wall2026051620260330
308452103 0 125028 1240 1544e/refclang -march=native -O -fwrapv -Qunused-arguments -fPIC -fPIE -gdwarf-4 -Wall2026051620260330
312932809 0 425329 1200 1640e/mergedgcc -march=native -mtune=native -Os -fwrapv -fPIC -fPIE -gdwarf-4 -Wall2026051620260330
315214168 0 428106 1216 1672e/mergedgcc -march=native -mtune=native -O -fwrapv -fPIC -fPIE -gdwarf-4 -Wall2026051620260330
345753686 0 427626 1216 1672e/regsgcc -march=native -mtune=native -O -fwrapv -fPIC -fPIE -gdwarf-4 -Wall2026051620260330
379082637 0 425153 1200 1640e/regsgcc -march=native -mtune=native -Os -fwrapv -fPIC -fPIE -gdwarf-4 -Wall2026051620260330
383653024 0 426954 1216 1672e/refgcc -march=native -mtune=native -O -fwrapv -fPIC -fPIE -gdwarf-4 -Wall2026051620260330
405762301 0 424809 1200 1640e/refgcc -march=native -mtune=native -Os -fwrapv -fPIC -fPIE -gdwarf-4 -Wall2026051620260330
423942886 0 128300 1240 1544e/regsclang -mcpu=native -O3 -fwrapv -Qunused-arguments -fPIC -fPIE -gdwarf-4 -Wall2026051620260330

Test failure


error 139
timeout: the monitored command dumped core
Segmentation fault

Number of similar (implementation,compiler) pairs: 27, namely:
ImplementationCompiler
dolbeau/generic-gccsimd128clang -march=native -O2 -fwrapv -Qunused-arguments -fPIC -fPIE -gdwarf-4 -Wall (Ubuntu_Clang_18.1.3_(1ubuntu1))
dolbeau/generic-gccsimd128clang -march=native -O3 -fwrapv -Qunused-arguments -fPIC -fPIE -gdwarf-4 -Wall (Ubuntu_Clang_18.1.3_(1ubuntu1))
dolbeau/generic-gccsimd128clang -march=native -O -fwrapv -Qunused-arguments -fPIC -fPIE -gdwarf-4 -Wall (Ubuntu_Clang_18.1.3_(1ubuntu1))
dolbeau/generic-gccsimd128clang -march=native -Os -fwrapv -Qunused-arguments -fPIC -fPIE -gdwarf-4 -Wall (Ubuntu_Clang_18.1.3_(1ubuntu1))
dolbeau/generic-gccsimd128clang -mcpu=native -O3 -fwrapv -Qunused-arguments -fPIC -fPIE -gdwarf-4 -Wall (Ubuntu_Clang_18.1.3_(1ubuntu1))
dolbeau/generic-gccsimd128gcc -march=native -mtune=native -O2 -fwrapv -fPIC -fPIE -gdwarf-4 -Wall (13.3.0)
dolbeau/generic-gccsimd128gcc -march=native -mtune=native -O3 -fwrapv -fPIC -fPIE -gdwarf-4 -Wall (13.3.0)
dolbeau/generic-gccsimd128gcc -march=native -mtune=native -O -fwrapv -fPIC -fPIE -gdwarf-4 -Wall (13.3.0)
dolbeau/generic-gccsimd128gcc -march=native -mtune=native -Os -fwrapv -fPIC -fPIE -gdwarf-4 -Wall (13.3.0)
dolbeau/generic-gccsimd256clang -march=native -O2 -fwrapv -Qunused-arguments -fPIC -fPIE -gdwarf-4 -Wall (Ubuntu_Clang_18.1.3_(1ubuntu1))
dolbeau/generic-gccsimd256clang -march=native -O3 -fwrapv -Qunused-arguments -fPIC -fPIE -gdwarf-4 -Wall (Ubuntu_Clang_18.1.3_(1ubuntu1))
dolbeau/generic-gccsimd256clang -march=native -O -fwrapv -Qunused-arguments -fPIC -fPIE -gdwarf-4 -Wall (Ubuntu_Clang_18.1.3_(1ubuntu1))
dolbeau/generic-gccsimd256clang -march=native -Os -fwrapv -Qunused-arguments -fPIC -fPIE -gdwarf-4 -Wall (Ubuntu_Clang_18.1.3_(1ubuntu1))
dolbeau/generic-gccsimd256clang -mcpu=native -O3 -fwrapv -Qunused-arguments -fPIC -fPIE -gdwarf-4 -Wall (Ubuntu_Clang_18.1.3_(1ubuntu1))
dolbeau/generic-gccsimd256gcc -march=native -mtune=native -O2 -fwrapv -fPIC -fPIE -gdwarf-4 -Wall (13.3.0)
dolbeau/generic-gccsimd256gcc -march=native -mtune=native -O3 -fwrapv -fPIC -fPIE -gdwarf-4 -Wall (13.3.0)
dolbeau/generic-gccsimd256gcc -march=native -mtune=native -O -fwrapv -fPIC -fPIE -gdwarf-4 -Wall (13.3.0)
dolbeau/generic-gccsimd256gcc -march=native -mtune=native -Os -fwrapv -fPIC -fPIE -gdwarf-4 -Wall (13.3.0)
krovetz/vec128clang -march=native -O2 -fwrapv -Qunused-arguments -fPIC -fPIE -gdwarf-4 -Wall (Ubuntu_Clang_18.1.3_(1ubuntu1))
krovetz/vec128clang -march=native -O3 -fwrapv -Qunused-arguments -fPIC -fPIE -gdwarf-4 -Wall (Ubuntu_Clang_18.1.3_(1ubuntu1))
krovetz/vec128clang -march=native -O -fwrapv -Qunused-arguments -fPIC -fPIE -gdwarf-4 -Wall (Ubuntu_Clang_18.1.3_(1ubuntu1))
krovetz/vec128clang -march=native -Os -fwrapv -Qunused-arguments -fPIC -fPIE -gdwarf-4 -Wall (Ubuntu_Clang_18.1.3_(1ubuntu1))
krovetz/vec128clang -mcpu=native -O3 -fwrapv -Qunused-arguments -fPIC -fPIE -gdwarf-4 -Wall (Ubuntu_Clang_18.1.3_(1ubuntu1))
krovetz/vec128gcc -march=native -mtune=native -O2 -fwrapv -fPIC -fPIE -gdwarf-4 -Wall (13.3.0)
krovetz/vec128gcc -march=native -mtune=native -O3 -fwrapv -fPIC -fPIE -gdwarf-4 -Wall (13.3.0)
krovetz/vec128gcc -march=native -mtune=native -O -fwrapv -fPIC -fPIE -gdwarf-4 -Wall (13.3.0)
krovetz/vec128gcc -march=native -mtune=native -Os -fwrapv -fPIC -fPIE -gdwarf-4 -Wall (13.3.0)

Test failure


error 132
timeout: the monitored command dumped core
Illegal instruction

Number of similar (implementation,compiler) pairs: 27, namely:
ImplementationCompiler
moon/avx/64clang -march=native -O2 -fwrapv -Qunused-arguments -fPIC -fPIE -gdwarf-4 -Wall (Ubuntu_Clang_18.1.3_(1ubuntu1))
moon/avx/64clang -march=native -O3 -fwrapv -Qunused-arguments -fPIC -fPIE -gdwarf-4 -Wall (Ubuntu_Clang_18.1.3_(1ubuntu1))
moon/avx/64clang -march=native -O -fwrapv -Qunused-arguments -fPIC -fPIE -gdwarf-4 -Wall (Ubuntu_Clang_18.1.3_(1ubuntu1))
moon/avx/64clang -march=native -Os -fwrapv -Qunused-arguments -fPIC -fPIE -gdwarf-4 -Wall (Ubuntu_Clang_18.1.3_(1ubuntu1))
moon/avx/64clang -mcpu=native -O3 -fwrapv -Qunused-arguments -fPIC -fPIE -gdwarf-4 -Wall (Ubuntu_Clang_18.1.3_(1ubuntu1))
moon/avx/64gcc -march=native -mtune=native -O2 -fwrapv -fPIC -fPIE -gdwarf-4 -Wall (13.3.0)
moon/avx/64gcc -march=native -mtune=native -O3 -fwrapv -fPIC -fPIE -gdwarf-4 -Wall (13.3.0)
moon/avx/64gcc -march=native -mtune=native -O -fwrapv -fPIC -fPIE -gdwarf-4 -Wall (13.3.0)
moon/avx/64gcc -march=native -mtune=native -Os -fwrapv -fPIC -fPIE -gdwarf-4 -Wall (13.3.0)
moon/avx2/64clang -march=native -O2 -fwrapv -Qunused-arguments -fPIC -fPIE -gdwarf-4 -Wall (Ubuntu_Clang_18.1.3_(1ubuntu1))
moon/avx2/64clang -march=native -O3 -fwrapv -Qunused-arguments -fPIC -fPIE -gdwarf-4 -Wall (Ubuntu_Clang_18.1.3_(1ubuntu1))
moon/avx2/64clang -march=native -O -fwrapv -Qunused-arguments -fPIC -fPIE -gdwarf-4 -Wall (Ubuntu_Clang_18.1.3_(1ubuntu1))
moon/avx2/64clang -march=native -Os -fwrapv -Qunused-arguments -fPIC -fPIE -gdwarf-4 -Wall (Ubuntu_Clang_18.1.3_(1ubuntu1))
moon/avx2/64clang -mcpu=native -O3 -fwrapv -Qunused-arguments -fPIC -fPIE -gdwarf-4 -Wall (Ubuntu_Clang_18.1.3_(1ubuntu1))
moon/avx2/64gcc -march=native -mtune=native -O2 -fwrapv -fPIC -fPIE -gdwarf-4 -Wall (13.3.0)
moon/avx2/64gcc -march=native -mtune=native -O3 -fwrapv -fPIC -fPIE -gdwarf-4 -Wall (13.3.0)
moon/avx2/64gcc -march=native -mtune=native -O -fwrapv -fPIC -fPIE -gdwarf-4 -Wall (13.3.0)
moon/avx2/64gcc -march=native -mtune=native -Os -fwrapv -fPIC -fPIE -gdwarf-4 -Wall (13.3.0)
moon/xop/64clang -march=native -O2 -fwrapv -Qunused-arguments -fPIC -fPIE -gdwarf-4 -Wall (Ubuntu_Clang_18.1.3_(1ubuntu1))
moon/xop/64clang -march=native -O3 -fwrapv -Qunused-arguments -fPIC -fPIE -gdwarf-4 -Wall (Ubuntu_Clang_18.1.3_(1ubuntu1))
moon/xop/64clang -march=native -O -fwrapv -Qunused-arguments -fPIC -fPIE -gdwarf-4 -Wall (Ubuntu_Clang_18.1.3_(1ubuntu1))
moon/xop/64clang -march=native -Os -fwrapv -Qunused-arguments -fPIC -fPIE -gdwarf-4 -Wall (Ubuntu_Clang_18.1.3_(1ubuntu1))
moon/xop/64clang -mcpu=native -O3 -fwrapv -Qunused-arguments -fPIC -fPIE -gdwarf-4 -Wall (Ubuntu_Clang_18.1.3_(1ubuntu1))
moon/xop/64gcc -march=native -mtune=native -O2 -fwrapv -fPIC -fPIE -gdwarf-4 -Wall (13.3.0)
moon/xop/64gcc -march=native -mtune=native -O3 -fwrapv -fPIC -fPIE -gdwarf-4 -Wall (13.3.0)
moon/xop/64gcc -march=native -mtune=native -O -fwrapv -fPIC -fPIE -gdwarf-4 -Wall (13.3.0)
moon/xop/64gcc -march=native -mtune=native -Os -fwrapv -fPIC -fPIE -gdwarf-4 -Wall (13.3.0)

Compiler output


try.cpp: In file included from try-anything.cpp:22:
try.cpp: .../supercop-data/h2atom/amd64/include/stq.h:32:13: warning: unused function 'stq_sort' [-Wunused-function]
try.cpp:    32 | static void stq_sort(stq_doublearray S,long long n)
try.cpp:       |             ^~~~~~~~
try.cpp: 1 warning generated.
try.cpp: In file included from try-anything.cpp:22:
try.cpp: .../supercop-data/h2atom/amd64/include/stq.h:32:13: warning: unused function 'stq_sort' [-Wunused-function]
try.cpp:    32 | static void stq_sort(stq_doublearray S,long long n)
try.cpp:       |             ^~~~~~~~
try.cpp: 1 warning generated.
measure.cpp: In file included from measure-anything.cpp:19:
measure.cpp: .../supercop-data/h2atom/amd64/include/stq.h:32:13: warning: unused function 'stq_sort' [-Wunused-function]
measure.cpp:    32 | static void stq_sort(stq_doublearray S,long long n)
measure.cpp:       |             ^~~~~~~~
measure.cpp: 1 warning generated.

Number of similar (implementation,compiler) pairs: 4, namely:
ImplementationCompiler
T:cryptoppclang++ -march=native -O2 -fwrapv -Qunused-arguments -fPIC -fPIE -gdwarf-4 -Wall (Ubuntu_Clang_18.1.3_(1ubuntu1))
T:cryptoppclang++ -march=native -O3 -fwrapv -Qunused-arguments -fPIC -fPIE -gdwarf-4 -Wall (Ubuntu_Clang_18.1.3_(1ubuntu1))
T:cryptoppclang++ -march=native -O -fwrapv -Qunused-arguments -fPIC -fPIE -gdwarf-4 -Wall (Ubuntu_Clang_18.1.3_(1ubuntu1))
T:cryptoppclang++ -march=native -Os -fwrapv -Qunused-arguments -fPIC -fPIE -gdwarf-4 -Wall (Ubuntu_Clang_18.1.3_(1ubuntu1))

Compiler output


try.cpp: In file included from try-anything.cpp:22:
try.cpp: .../supercop-data/h2atom/amd64/include/stq.h:32:13: warning: 'void stq_sort(std::vector<double>, long long int)' defined but not used [-Wunused-function]
try.cpp:    32 | static void stq_sort(stq_doublearray S,long long n)
try.cpp:       |             ^~~~~~~~
try.cpp: In file included from try-anything.cpp:22:
try.cpp: .../supercop-data/h2atom/amd64/include/stq.h:32:13: warning: 'void stq_sort(std::vector<double>, long long int)' defined but not used [-Wunused-function]
try.cpp:    32 | static void stq_sort(stq_doublearray S,long long n)
try.cpp:       |             ^~~~~~~~
measure.cpp: In file included from measure-anything.cpp:19:
measure.cpp: .../supercop-data/h2atom/amd64/include/stq.h:32:13: warning: 'void stq_sort(std::vector<double>, long long int)' defined but not used [-Wunused-function]
measure.cpp:    32 | static void stq_sort(stq_doublearray S,long long n)
measure.cpp:       |             ^~~~~~~~

Number of similar (implementation,compiler) pairs: 4, namely:
ImplementationCompiler
T:cryptoppg++ -march=native -mtune=native -O2 -fwrapv -fPIC -fPIE -gdwarf-4 -Wall (13.3.0)
T:cryptoppg++ -march=native -mtune=native -O3 -fwrapv -fPIC -fPIE -gdwarf-4 -Wall (13.3.0)
T:cryptoppg++ -march=native -mtune=native -O -fwrapv -fPIC -fPIE -gdwarf-4 -Wall (13.3.0)
T:cryptoppg++ -march=native -mtune=native -Os -fwrapv -fPIC -fPIE -gdwarf-4 -Wall (13.3.0)

Compiler output


chacha.c: In file included from chacha.c:103:
chacha.c: ./u4.h:122:7: error: always_inline function '_mm_shuffle_epi8' requires target feature 'ssse3', but would be inlined into function 'crypto_stream_chacha20_dolbeau_amd64_avx2_constbranchindex_ECRYPT_encrypt_bytes' that is compiled without support for 'ssse3'
chacha.c:   122 |       VEC4_QUARTERROUND( 0, 4, 8,12);
chacha.c:       |       ^
chacha.c: ./u4.h:17:36: note: expanded from macro 'VEC4_QUARTERROUND'
chacha.c:    17 | #define VEC4_QUARTERROUND(a,b,c,d) VEC4_QUARTERROUND_SHUFFLE(a,b,c,d)
chacha.c:       |                                    ^
chacha.c: ./u4.h:12:86: note: expanded from macro 'VEC4_QUARTERROUND_SHUFFLE'
chacha.c:    12 |    x_##a = _mm_add_epi32(x_##a, x_##b); t_##a = _mm_xor_si128(x_##d, x_##a); x_##d = _mm_shuffle_epi8(t_##a, rot16); \
chacha.c:       |                                                                                      ^
chacha.c: ./u4.h:122:7: error: always_inline function '_mm_shuffle_epi8' requires target feature 'ssse3', but would be inlined into function 'crypto_stream_chacha20_dolbeau_amd64_avx2_constbranchindex_ECRYPT_encrypt_bytes' that is compiled without support for 'ssse3'
chacha.c: ./u4.h:17:36: note: expanded from macro 'VEC4_QUARTERROUND'
chacha.c:    17 | #define VEC4_QUARTERROUND(a,b,c,d) VEC4_QUARTERROUND_SHUFFLE(a,b,c,d)
chacha.c:       |                                    ^
chacha.c: ./u4.h:14:86: note: expanded from macro 'VEC4_QUARTERROUND_SHUFFLE'
chacha.c:    14 |    x_##a = _mm_add_epi32(x_##a, x_##b); t_##a = _mm_xor_si128(x_##d, x_##a); x_##d = _mm_shuffle_epi8(t_##a, rot8); \
chacha.c:       |                                                                                      ^
chacha.c: ./u4.h:123:7: error: always_inline function '_mm_shuffle_epi8' requires target feature 'ssse3', but would be inlined into function 'crypto_stream_chacha20_dolbeau_amd64_avx2_constbranchindex_ECRYPT_encrypt_bytes' that is compiled without support for 'ssse3'
chacha.c:   123 |       VEC4_QUARTERROUND( 1, 5, 9,13);
chacha.c:       |       ^
chacha.c: ./u4.h:17:36: note: expanded from macro 'VEC4_QUARTERROUND'
chacha.c:    17 | #define VEC4_QUARTERROUND(a,b,c,d) VEC4_QUARTERROUND_SHUFFLE(a,b,c,d)
chacha.c:       |                                    ^
chacha.c: ./u4.h:12:86: note: expanded from macro 'VEC4_QUARTERROUND_SHUFFLE'
chacha.c:    12 |    x_##a = _mm_add_epi32(x_##a, x_##b); t_##a = _mm_xor_si128(x_##d, x_##a); x_##d = _mm_shuffle_epi8(t_##a, rot16); \
chacha.c: ...

Number of similar (implementation,compiler) pairs: 1, namely:
ImplementationCompiler
dolbeau/amd64-avx2clang -mcpu=native -O3 -fwrapv -Qunused-arguments -fPIC -fPIE -gdwarf-4 -Wall (Ubuntu_Clang_18.1.3_(1ubuntu1))

Compiler output


chacha.c: In file included from chacha.c:93:
chacha.c: ./u4.h:73:5: warning: unused variable 't_4' [-Wunused-variable]
chacha.c:    73 |   V t_4;
chacha.c:       |     ^~~
chacha.c: ./u4.h:74:5: warning: unused variable 't_5' [-Wunused-variable]
chacha.c:    74 |   V t_5;
chacha.c:       |     ^~~
chacha.c: ./u4.h:75:5: warning: unused variable 't_6' [-Wunused-variable]
chacha.c:    75 |   V t_6;
chacha.c:       |     ^~~
chacha.c: ./u4.h:76:5: warning: unused variable 't_7' [-Wunused-variable]
chacha.c:    76 |   V t_7;
chacha.c:       |     ^~~
chacha.c: ./u4.h:81:5: warning: unused variable 't_12' [-Wunused-variable]
chacha.c:    81 |   V t_12;
chacha.c:       |     ^~~~
chacha.c: ./u4.h:82:5: warning: unused variable 't_13' [-Wunused-variable]
chacha.c:    82 |   V t_13;
chacha.c:       |     ^~~~
chacha.c: ./u4.h:83:5: warning: unused variable 't_14' [-Wunused-variable]
chacha.c:    83 |   V t_14;
chacha.c:       |     ^~~~
chacha.c: ./u4.h:84:5: warning: unused variable 't_15' [-Wunused-variable]
chacha.c:    84 |   V t_15;
chacha.c:       |     ^~~~
chacha.c: ...

Number of similar (implementation,compiler) pairs: 5, namely:
ImplementationCompiler
dolbeau/generic-gccsimd128clang -march=native -O2 -fwrapv -Qunused-arguments -fPIC -fPIE -gdwarf-4 -Wall (Ubuntu_Clang_18.1.3_(1ubuntu1))
dolbeau/generic-gccsimd128clang -march=native -O3 -fwrapv -Qunused-arguments -fPIC -fPIE -gdwarf-4 -Wall (Ubuntu_Clang_18.1.3_(1ubuntu1))
dolbeau/generic-gccsimd128clang -march=native -O -fwrapv -Qunused-arguments -fPIC -fPIE -gdwarf-4 -Wall (Ubuntu_Clang_18.1.3_(1ubuntu1))
dolbeau/generic-gccsimd128clang -march=native -Os -fwrapv -Qunused-arguments -fPIC -fPIE -gdwarf-4 -Wall (Ubuntu_Clang_18.1.3_(1ubuntu1))
dolbeau/generic-gccsimd128clang -mcpu=native -O3 -fwrapv -Qunused-arguments -fPIC -fPIE -gdwarf-4 -Wall (Ubuntu_Clang_18.1.3_(1ubuntu1))

Compiler output


chacha.c: In file included from chacha.c:93:
chacha.c: u4.h: In function 'crypto_stream_chacha20_dolbeau_generic_gccsimd128_constbranchindex_ECRYPT_encrypt_bytes':
chacha.c: u4.h:84:5: warning: unused variable 't_15' [-Wunused-variable]
chacha.c:    84 |   V t_15;
chacha.c:       |     ^~~~
chacha.c: u4.h:83:5: warning: unused variable 't_14' [-Wunused-variable]
chacha.c:    83 |   V t_14;
chacha.c:       |     ^~~~
chacha.c: u4.h:82:5: warning: unused variable 't_13' [-Wunused-variable]
chacha.c:    82 |   V t_13;
chacha.c:       |     ^~~~
chacha.c: u4.h:81:5: warning: unused variable 't_12' [-Wunused-variable]
chacha.c:    81 |   V t_12;
chacha.c:       |     ^~~~
chacha.c: u4.h:76:5: warning: unused variable 't_7' [-Wunused-variable]
chacha.c:    76 |   V t_7;
chacha.c:       |     ^~~
chacha.c: u4.h:75:5: warning: unused variable 't_6' [-Wunused-variable]
chacha.c:    75 |   V t_6;
chacha.c:       |     ^~~
chacha.c: u4.h:74:5: warning: unused variable 't_5' [-Wunused-variable]
chacha.c:    74 |   V t_5;
chacha.c:       |     ^~~
chacha.c: u4.h:73:5: warning: unused variable 't_4' [-Wunused-variable]
chacha.c:    73 |   V t_4;
chacha.c: ...

Number of similar (implementation,compiler) pairs: 4, namely:
ImplementationCompiler
dolbeau/generic-gccsimd128gcc -march=native -mtune=native -O2 -fwrapv -fPIC -fPIE -gdwarf-4 -Wall (13.3.0)
dolbeau/generic-gccsimd128gcc -march=native -mtune=native -O3 -fwrapv -fPIC -fPIE -gdwarf-4 -Wall (13.3.0)
dolbeau/generic-gccsimd128gcc -march=native -mtune=native -O -fwrapv -fPIC -fPIE -gdwarf-4 -Wall (13.3.0)
dolbeau/generic-gccsimd128gcc -march=native -mtune=native -Os -fwrapv -fPIC -fPIE -gdwarf-4 -Wall (13.3.0)

Compiler output


chacha.c: In file included from chacha.c:93:
chacha.c: ./u8.h:76:5: warning: unused variable 't_4' [-Wunused-variable]
chacha.c:    76 |   V t_4;
chacha.c:       |     ^~~
chacha.c: ./u8.h:77:5: warning: unused variable 't_5' [-Wunused-variable]
chacha.c:    77 |   V t_5;
chacha.c:       |     ^~~
chacha.c: ./u8.h:78:5: warning: unused variable 't_6' [-Wunused-variable]
chacha.c:    78 |   V t_6;
chacha.c:       |     ^~~
chacha.c: ./u8.h:79:5: warning: unused variable 't_7' [-Wunused-variable]
chacha.c:    79 |   V t_7;
chacha.c:       |     ^~~
chacha.c: ./u8.h:84:5: warning: unused variable 't_12' [-Wunused-variable]
chacha.c:    84 |   V t_12;
chacha.c:       |     ^~~~
chacha.c: ./u8.h:85:5: warning: unused variable 't_13' [-Wunused-variable]
chacha.c:    85 |   V t_13;
chacha.c:       |     ^~~~
chacha.c: ./u8.h:86:5: warning: unused variable 't_14' [-Wunused-variable]
chacha.c:    86 |   V t_14;
chacha.c:       |     ^~~~
chacha.c: ./u8.h:87:5: warning: unused variable 't_15' [-Wunused-variable]
chacha.c:    87 |   V t_15;
chacha.c:       |     ^~~~
chacha.c: ...

Number of similar (implementation,compiler) pairs: 5, namely:
ImplementationCompiler
dolbeau/generic-gccsimd256clang -march=native -O2 -fwrapv -Qunused-arguments -fPIC -fPIE -gdwarf-4 -Wall (Ubuntu_Clang_18.1.3_(1ubuntu1))
dolbeau/generic-gccsimd256clang -march=native -O3 -fwrapv -Qunused-arguments -fPIC -fPIE -gdwarf-4 -Wall (Ubuntu_Clang_18.1.3_(1ubuntu1))
dolbeau/generic-gccsimd256clang -march=native -O -fwrapv -Qunused-arguments -fPIC -fPIE -gdwarf-4 -Wall (Ubuntu_Clang_18.1.3_(1ubuntu1))
dolbeau/generic-gccsimd256clang -march=native -Os -fwrapv -Qunused-arguments -fPIC -fPIE -gdwarf-4 -Wall (Ubuntu_Clang_18.1.3_(1ubuntu1))
dolbeau/generic-gccsimd256clang -mcpu=native -O3 -fwrapv -Qunused-arguments -fPIC -fPIE -gdwarf-4 -Wall (Ubuntu_Clang_18.1.3_(1ubuntu1))

Compiler output


chacha.c: In file included from chacha.c:93:
chacha.c: u8.h: In function 'crypto_stream_chacha20_dolbeau_generic_gccsimd256_constbranchindex_ECRYPT_encrypt_bytes':
chacha.c: u8.h:87:5: warning: unused variable 't_15' [-Wunused-variable]
chacha.c:    87 |   V t_15;
chacha.c:       |     ^~~~
chacha.c: u8.h:86:5: warning: unused variable 't_14' [-Wunused-variable]
chacha.c:    86 |   V t_14;
chacha.c:       |     ^~~~
chacha.c: u8.h:85:5: warning: unused variable 't_13' [-Wunused-variable]
chacha.c:    85 |   V t_13;
chacha.c:       |     ^~~~
chacha.c: u8.h:84:5: warning: unused variable 't_12' [-Wunused-variable]
chacha.c:    84 |   V t_12;
chacha.c:       |     ^~~~
chacha.c: u8.h:79:5: warning: unused variable 't_7' [-Wunused-variable]
chacha.c:    79 |   V t_7;
chacha.c:       |     ^~~
chacha.c: u8.h:78:5: warning: unused variable 't_6' [-Wunused-variable]
chacha.c:    78 |   V t_6;
chacha.c:       |     ^~~
chacha.c: u8.h:77:5: warning: unused variable 't_5' [-Wunused-variable]
chacha.c:    77 |   V t_5;
chacha.c:       |     ^~~
chacha.c: u8.h:76:5: warning: unused variable 't_4' [-Wunused-variable]
chacha.c:    76 |   V t_4;
chacha.c: ...

Number of similar (implementation,compiler) pairs: 4, namely:
ImplementationCompiler
dolbeau/generic-gccsimd256gcc -march=native -mtune=native -O2 -fwrapv -fPIC -fPIE -gdwarf-4 -Wall (13.3.0)
dolbeau/generic-gccsimd256gcc -march=native -mtune=native -O3 -fwrapv -fPIC -fPIE -gdwarf-4 -Wall (13.3.0)
dolbeau/generic-gccsimd256gcc -march=native -mtune=native -O -fwrapv -fPIC -fPIE -gdwarf-4 -Wall (13.3.0)
dolbeau/generic-gccsimd256gcc -march=native -mtune=native -Os -fwrapv -fPIC -fPIE -gdwarf-4 -Wall (13.3.0)

Compiler output


chacha.c: In file included from chacha.c:1:
chacha.c: e/chacha.c: In function 'crypto_stream_chacha20_e_merged_constbranchindex_ECRYPT_encrypt_bytes':
chacha.c: e/chacha.c:179:46: warning: 'ctarget' may be used uninitialized [-Wmaybe-uninitialized]
chacha.c:   179 |         for (i = 0;i < bytes;++i) ctarget[i] = c[i];
chacha.c:       |                                   ~~~~~~~~~~~^~~~~~
chacha.c: e/chacha.c:64:7: note: 'ctarget' was declared here
chacha.c:    64 |   u8 *ctarget;
chacha.c:       |       ^~~~~~~

Number of similar (implementation,compiler) pairs: 3, namely:
ImplementationCompiler
e/mergedgcc -march=native -mtune=native -O2 -fwrapv -fPIC -fPIE -gdwarf-4 -Wall (13.3.0)
e/mergedgcc -march=native -mtune=native -O -fwrapv -fPIC -fPIE -gdwarf-4 -Wall (13.3.0)
e/mergedgcc -march=native -mtune=native -Os -fwrapv -fPIC -fPIE -gdwarf-4 -Wall (13.3.0)

Compiler output


chacha.c: In file included from chacha.c:1:
chacha.c: e/chacha.c: In function 'crypto_stream_chacha20_e_merged_constbranchindex_ECRYPT_encrypt_bytes':
chacha.c: e/chacha.c:64:7: warning: 'ctarget' may be used uninitialized [-Wmaybe-uninitialized]
chacha.c:    64 |   u8 *ctarget;
chacha.c:       |       ^~~~~~~

Number of similar (implementation,compiler) pairs: 1, namely:
ImplementationCompiler
e/mergedgcc -march=native -mtune=native -O3 -fwrapv -fPIC -fPIE -gdwarf-4 -Wall (13.3.0)

Compiler output


stream.c: stream.c:126:2: error: -- Implementation supports only microarchitectures with support for Advanced Vector Extensions (AVX2 or AVX512).
stream.c:   126 | #error -- Implementation supports only microarchitectures with support for Advanced Vector Extensions (AVX2 or AVX512).
stream.c:       |  ^
stream.c: 1 error generated.

Number of similar (implementation,compiler) pairs: 5, namely:
ImplementationCompiler
goll_gueronclang -march=native -O2 -fwrapv -Qunused-arguments -fPIC -fPIE -gdwarf-4 -Wall (Ubuntu_Clang_18.1.3_(1ubuntu1))
goll_gueronclang -march=native -O3 -fwrapv -Qunused-arguments -fPIC -fPIE -gdwarf-4 -Wall (Ubuntu_Clang_18.1.3_(1ubuntu1))
goll_gueronclang -march=native -O -fwrapv -Qunused-arguments -fPIC -fPIE -gdwarf-4 -Wall (Ubuntu_Clang_18.1.3_(1ubuntu1))
goll_gueronclang -march=native -Os -fwrapv -Qunused-arguments -fPIC -fPIE -gdwarf-4 -Wall (Ubuntu_Clang_18.1.3_(1ubuntu1))
goll_gueronclang -mcpu=native -O3 -fwrapv -Qunused-arguments -fPIC -fPIE -gdwarf-4 -Wall (Ubuntu_Clang_18.1.3_(1ubuntu1))

Compiler output


stream.c: stream.c:126:2: error: #error -- Implementation supports only microarchitectures with support for Advanced Vector Extensions (AVX2 or AVX512).
stream.c:   126 | #error -- Implementation supports only microarchitectures with support for Advanced Vector Extensions (AVX2 or AVX512).
stream.c:       |  ^~~~~

Number of similar (implementation,compiler) pairs: 4, namely:
ImplementationCompiler
goll_guerongcc -march=native -mtune=native -O2 -fwrapv -fPIC -fPIE -gdwarf-4 -Wall (13.3.0)
goll_guerongcc -march=native -mtune=native -O3 -fwrapv -fPIC -fPIE -gdwarf-4 -Wall (13.3.0)
goll_guerongcc -march=native -mtune=native -O -fwrapv -fPIC -fPIE -gdwarf-4 -Wall (13.3.0)
goll_guerongcc -march=native -mtune=native -Os -fwrapv -fPIC -fPIE -gdwarf-4 -Wall (13.3.0)

Compiler output


stream.c: stream.c:56:18: error: always_inline function '_mm256_broadcastsi128_si256' requires target feature 'avx2', but would be inlined into function 'crypto_stream_chacha20_krovetz_avx2_constbranchindex_xor' that is compiled without support for 'avx2'
stream.c:    56 |     __m256i s0 = _mm_broadcastsi128_si256(*(__m128i *)sigma);
stream.c:       |                  ^
stream.c: /usr/lib/llvm-18/lib/clang/18/include/avx2intrin.h:3076:37: note: expanded from macro '_mm_broadcastsi128_si256'
stream.c:  3076 | #define _mm_broadcastsi128_si256(X) _mm256_broadcastsi128_si256(X)
stream.c:       |                                     ^
stream.c: stream.c:56:18: error: AVX vector return of type '__m256i' (vector of 4 'long long' values) without 'avx' enabled changes the ABI
stream.c: /usr/lib/llvm-18/lib/clang/18/include/avx2intrin.h:3076:37: note: expanded from macro '_mm_broadcastsi128_si256'
stream.c:  3076 | #define _mm_broadcastsi128_si256(X) _mm256_broadcastsi128_si256(X)
stream.c:       |                                     ^
stream.c: stream.c:60:18: error: always_inline function '_mm256_loadu_si256' requires target feature 'avx', but would be inlined into function 'crypto_stream_chacha20_krovetz_avx2_constbranchindex_xor' that is compiled without support for 'avx'
stream.c:    60 |     __m256i s1 = _mm256_loadu_si256((__m256i *)k);
stream.c:       |                  ^
stream.c: stream.c:60:18: error: AVX vector return of type '__m256i' (vector of 4 'long long' values) without 'avx' enabled changes the ABI
stream.c: stream.c:61:18: error: '__builtin_ia32_permti256' needs target feature avx2
stream.c:    61 |     __m256i s2 = _mm256_permute2x128_si256(s1,s1,0x11);
stream.c:       |                  ^
stream.c: /usr/lib/llvm-18/lib/clang/18/include/avx2intrin.h:3440:13: note: expanded from macro '_mm256_permute2x128_si256'
stream.c:  3440 |   ((__m256i)__builtin_ia32_permti256((__m256i)(V1), (__m256i)(V2), (int)(M)))
stream.c:       |             ^
stream.c: stream.c:62:10: error: '__builtin_ia32_permti256' needs target feature avx2
stream.c:    62 |     s1 = _mm256_permute2x128_si256(s1,s1,0x00);
stream.c:       |          ^
stream.c: /usr/lib/llvm-18/lib/clang/18/include/avx2intrin.h:3440:13: note: expanded from macro '_mm256_permute2x128_si256'
stream.c:  3440 |   ((__m256i)__builtin_ia32_permti256((__m256i)(V1), (__m256i)(V2), (int)(M)))
stream.c: ...

Number of similar (implementation,compiler) pairs: 5, namely:
ImplementationCompiler
krovetz/avx2clang -march=native -O2 -fwrapv -Qunused-arguments -fPIC -fPIE -gdwarf-4 -Wall (Ubuntu_Clang_18.1.3_(1ubuntu1))
krovetz/avx2clang -march=native -O3 -fwrapv -Qunused-arguments -fPIC -fPIE -gdwarf-4 -Wall (Ubuntu_Clang_18.1.3_(1ubuntu1))
krovetz/avx2clang -march=native -O -fwrapv -Qunused-arguments -fPIC -fPIE -gdwarf-4 -Wall (Ubuntu_Clang_18.1.3_(1ubuntu1))
krovetz/avx2clang -march=native -Os -fwrapv -Qunused-arguments -fPIC -fPIE -gdwarf-4 -Wall (Ubuntu_Clang_18.1.3_(1ubuntu1))
krovetz/avx2clang -mcpu=native -O3 -fwrapv -Qunused-arguments -fPIC -fPIE -gdwarf-4 -Wall (Ubuntu_Clang_18.1.3_(1ubuntu1))

Compiler output


stream.c: stream.c: In function 'crypto_stream_chacha20_krovetz_avx2_constbranchindex_xor':
stream.c: stream.c:58:13: warning: AVX vector return without AVX enabled changes the ABI [-Wpsabi]
stream.c:    58 |     __m256i s0 = _mm256_broadcastsi128_si256(*(__m128i *)sigma);
stream.c:       |             ^~
stream.c: In file included from /usr/lib/gcc/x86_64-linux-gnu/13/include/immintrin.h:51,
stream.c:                  from stream.c:8:
stream.c: /usr/lib/gcc/x86_64-linux-gnu/13/include/avx2intrin.h:574:1: error: inlining failed in call to 'always_inline' '_mm256_or_si256': target specific option mismatch
stream.c:   574 | _mm256_or_si256 (__m256i __A, __m256i __B)
stream.c:       | ^~~~~~~~~~~~~~~
stream.c: stream.c:63:18: note: called from here
stream.c:    63 |     __m256i s3 = _mm256_or_si256(
stream.c:       |                  ^~~~~~~~~~~~~~~~
stream.c:    64 |         _mm256_slli_si256(_mm256_broadcastq_epi64(*(__m128i *)n), 8),
stream.c:       |         ~~~~~~~~~~~~~~~~~~~~~~~~~~~~~~~~~~~~~~~~~~~~~~~~~~~~~~~~~~~~~
stream.c:    65 |         _mm256_set_epi32(0,0,0,1,0,0,0,0)
stream.c:       |         ~~~~~~~~~~~~~~~~~~~~~~~~~~~~~~~~~
stream.c:    66 |     );
stream.c:       |     ~
stream.c: /usr/lib/gcc/x86_64-linux-gnu/13/include/avx2intrin.h:655:1: error: inlining failed in call to 'always_inline' '_mm256_slli_si256': target specific option mismatch
stream.c:   655 | _mm256_slli_si256 (__m256i __A, const int __N)
stream.c:       | ^~~~~~~~~~~~~~~~~
stream.c: stream.c:63:18: note: called from here
stream.c:    63 |     __m256i s3 = _mm256_or_si256(
stream.c:       |                  ^~~~~~~~~~~~~~~~
stream.c:    64 |         _mm256_slli_si256(_mm256_broadcastq_epi64(*(__m128i *)n), 8),
stream.c: ...

Number of similar (implementation,compiler) pairs: 4, namely:
ImplementationCompiler
krovetz/avx2gcc -march=native -mtune=native -O2 -fwrapv -fPIC -fPIE -gdwarf-4 -Wall (13.3.0)
krovetz/avx2gcc -march=native -mtune=native -O3 -fwrapv -fPIC -fPIE -gdwarf-4 -Wall (13.3.0)
krovetz/avx2gcc -march=native -mtune=native -O -fwrapv -fPIC -fPIE -gdwarf-4 -Wall (13.3.0)
krovetz/avx2gcc -march=native -mtune=native -Os -fwrapv -fPIC -fPIE -gdwarf-4 -Wall (13.3.0)

Compiler output


stream.c: stream.c:133:45: warning: unused variable 'key' [-Wunused-variable]
stream.c:   133 |     __attribute__ ((aligned (16))) unsigned key[8], nonce[2];
stream.c:       |                                             ^~~
stream.c: stream.c:133:53: warning: unused variable 'nonce' [-Wunused-variable]
stream.c:   133 |     __attribute__ ((aligned (16))) unsigned key[8], nonce[2];
stream.c:       |                                                     ^~~~~
stream.c: 2 warnings generated.

Number of similar (implementation,compiler) pairs: 5, namely:
ImplementationCompiler
krovetz/vec128clang -march=native -O2 -fwrapv -Qunused-arguments -fPIC -fPIE -gdwarf-4 -Wall (Ubuntu_Clang_18.1.3_(1ubuntu1))
krovetz/vec128clang -march=native -O3 -fwrapv -Qunused-arguments -fPIC -fPIE -gdwarf-4 -Wall (Ubuntu_Clang_18.1.3_(1ubuntu1))
krovetz/vec128clang -march=native -O -fwrapv -Qunused-arguments -fPIC -fPIE -gdwarf-4 -Wall (Ubuntu_Clang_18.1.3_(1ubuntu1))
krovetz/vec128clang -march=native -Os -fwrapv -Qunused-arguments -fPIC -fPIE -gdwarf-4 -Wall (Ubuntu_Clang_18.1.3_(1ubuntu1))
krovetz/vec128clang -mcpu=native -O3 -fwrapv -Qunused-arguments -fPIC -fPIE -gdwarf-4 -Wall (Ubuntu_Clang_18.1.3_(1ubuntu1))

Compiler output


stream.c: stream.c: In function 'crypto_stream_chacha20_krovetz_vec128_constbranchindex_xor':
stream.c: stream.c:133:53: warning: unused variable 'nonce' [-Wunused-variable]
stream.c:   133 |     __attribute__ ((aligned (16))) unsigned key[8], nonce[2];
stream.c:       |                                                     ^~~~~
stream.c: stream.c:133:45: warning: unused variable 'key' [-Wunused-variable]
stream.c:   133 |     __attribute__ ((aligned (16))) unsigned key[8], nonce[2];
stream.c:       |                                             ^~~

Number of similar (implementation,compiler) pairs: 4, namely:
ImplementationCompiler
krovetz/vec128gcc -march=native -mtune=native -O2 -fwrapv -fPIC -fPIE -gdwarf-4 -Wall (13.3.0)
krovetz/vec128gcc -march=native -mtune=native -O3 -fwrapv -fPIC -fPIE -gdwarf-4 -Wall (13.3.0)
krovetz/vec128gcc -march=native -mtune=native -O -fwrapv -fPIC -fPIE -gdwarf-4 -Wall (13.3.0)
krovetz/vec128gcc -march=native -mtune=native -Os -fwrapv -fPIC -fPIE -gdwarf-4 -Wall (13.3.0)

Compiler output


stream.c: stream.c:2:10: fatal error: 'openssl/evp.h' file not found
stream.c:     2 | #include <openssl/evp.h>
stream.c:       |          ^~~~~~~~~~~~~~~
stream.c: 1 error generated.

Number of similar (implementation,compiler) pairs: 5, namely:
ImplementationCompiler
opensslclang -march=native -O2 -fwrapv -Qunused-arguments -fPIC -fPIE -gdwarf-4 -Wall (Ubuntu_Clang_18.1.3_(1ubuntu1))
opensslclang -march=native -O3 -fwrapv -Qunused-arguments -fPIC -fPIE -gdwarf-4 -Wall (Ubuntu_Clang_18.1.3_(1ubuntu1))
opensslclang -march=native -O -fwrapv -Qunused-arguments -fPIC -fPIE -gdwarf-4 -Wall (Ubuntu_Clang_18.1.3_(1ubuntu1))
opensslclang -march=native -Os -fwrapv -Qunused-arguments -fPIC -fPIE -gdwarf-4 -Wall (Ubuntu_Clang_18.1.3_(1ubuntu1))
opensslclang -mcpu=native -O3 -fwrapv -Qunused-arguments -fPIC -fPIE -gdwarf-4 -Wall (Ubuntu_Clang_18.1.3_(1ubuntu1))

Compiler output


stream.c: stream.c:2:10: fatal error: openssl/evp.h: No such file or directory
stream.c:     2 | #include <openssl/evp.h>
stream.c:       |          ^~~~~~~~~~~~~~~
stream.c: compilation terminated.

Number of similar (implementation,compiler) pairs: 4, namely:
ImplementationCompiler
opensslgcc -march=native -mtune=native -O2 -fwrapv -fPIC -fPIE -gdwarf-4 -Wall (13.3.0)
opensslgcc -march=native -mtune=native -O3 -fwrapv -fPIC -fPIE -gdwarf-4 -Wall (13.3.0)
opensslgcc -march=native -mtune=native -O -fwrapv -fPIC -fPIE -gdwarf-4 -Wall (13.3.0)
opensslgcc -march=native -mtune=native -Os -fwrapv -fPIC -fPIE -gdwarf-4 -Wall (13.3.0)

Passed TIMECOP


TIMECOP iterations: 10

Number of similar (implementation,compiler) pairs: 80, namely:
ImplementationCompiler
amd64-ssse3clang -march=native -O2 -fwrapv -Qunused-arguments -fPIC -fPIE -gdwarf-4 -Wall (Ubuntu_Clang_18.1.3_(1ubuntu1))
amd64-ssse3clang -march=native -O3 -fwrapv -Qunused-arguments -fPIC -fPIE -gdwarf-4 -Wall (Ubuntu_Clang_18.1.3_(1ubuntu1))
amd64-ssse3clang -march=native -O -fwrapv -Qunused-arguments -fPIC -fPIE -gdwarf-4 -Wall (Ubuntu_Clang_18.1.3_(1ubuntu1))
amd64-ssse3clang -march=native -Os -fwrapv -Qunused-arguments -fPIC -fPIE -gdwarf-4 -Wall (Ubuntu_Clang_18.1.3_(1ubuntu1))
amd64-ssse3clang -mcpu=native -O3 -fwrapv -Qunused-arguments -fPIC -fPIE -gdwarf-4 -Wall (Ubuntu_Clang_18.1.3_(1ubuntu1))
amd64-ssse3gcc -march=native -mtune=native -O2 -fwrapv -fPIC -fPIE -gdwarf-4 -Wall (13.3.0)
amd64-ssse3gcc -march=native -mtune=native -O3 -fwrapv -fPIC -fPIE -gdwarf-4 -Wall (13.3.0)
amd64-ssse3gcc -march=native -mtune=native -O -fwrapv -fPIC -fPIE -gdwarf-4 -Wall (13.3.0)
amd64-ssse3gcc -march=native -mtune=native -Os -fwrapv -fPIC -fPIE -gdwarf-4 -Wall (13.3.0)
dolbeau/amd64-avx2clang -march=native -O2 -fwrapv -Qunused-arguments -fPIC -fPIE -gdwarf-4 -Wall (Ubuntu_Clang_18.1.3_(1ubuntu1))
dolbeau/amd64-avx2clang -march=native -O3 -fwrapv -Qunused-arguments -fPIC -fPIE -gdwarf-4 -Wall (Ubuntu_Clang_18.1.3_(1ubuntu1))
dolbeau/amd64-avx2clang -march=native -O -fwrapv -Qunused-arguments -fPIC -fPIE -gdwarf-4 -Wall (Ubuntu_Clang_18.1.3_(1ubuntu1))
dolbeau/amd64-avx2clang -march=native -Os -fwrapv -Qunused-arguments -fPIC -fPIE -gdwarf-4 -Wall (Ubuntu_Clang_18.1.3_(1ubuntu1))
dolbeau/amd64-avx2gcc -march=native -mtune=native -O2 -fwrapv -fPIC -fPIE -gdwarf-4 -Wall (13.3.0)
dolbeau/amd64-avx2gcc -march=native -mtune=native -O3 -fwrapv -fPIC -fPIE -gdwarf-4 -Wall (13.3.0)
dolbeau/amd64-avx2gcc -march=native -mtune=native -O -fwrapv -fPIC -fPIE -gdwarf-4 -Wall (13.3.0)
dolbeau/amd64-avx2gcc -march=native -mtune=native -Os -fwrapv -fPIC -fPIE -gdwarf-4 -Wall (13.3.0)
e/amd64-3clang -march=native -O2 -fwrapv -Qunused-arguments -fPIC -fPIE -gdwarf-4 -Wall (Ubuntu_Clang_18.1.3_(1ubuntu1))
e/amd64-3clang -march=native -O3 -fwrapv -Qunused-arguments -fPIC -fPIE -gdwarf-4 -Wall (Ubuntu_Clang_18.1.3_(1ubuntu1))
e/amd64-3clang -march=native -O -fwrapv -Qunused-arguments -fPIC -fPIE -gdwarf-4 -Wall (Ubuntu_Clang_18.1.3_(1ubuntu1))
e/amd64-3clang -march=native -Os -fwrapv -Qunused-arguments -fPIC -fPIE -gdwarf-4 -Wall (Ubuntu_Clang_18.1.3_(1ubuntu1))
e/amd64-3clang -mcpu=native -O3 -fwrapv -Qunused-arguments -fPIC -fPIE -gdwarf-4 -Wall (Ubuntu_Clang_18.1.3_(1ubuntu1))
e/amd64-3gcc -march=native -mtune=native -O2 -fwrapv -fPIC -fPIE -gdwarf-4 -Wall (13.3.0)
e/amd64-3gcc -march=native -mtune=native -O3 -fwrapv -fPIC -fPIE -gdwarf-4 -Wall (13.3.0)
e/amd64-3gcc -march=native -mtune=native -O -fwrapv -fPIC -fPIE -gdwarf-4 -Wall (13.3.0)
e/amd64-3gcc -march=native -mtune=native -Os -fwrapv -fPIC -fPIE -gdwarf-4 -Wall (13.3.0)
e/amd64-xmm6clang -march=native -O2 -fwrapv -Qunused-arguments -fPIC -fPIE -gdwarf-4 -Wall (Ubuntu_Clang_18.1.3_(1ubuntu1))
e/amd64-xmm6clang -march=native -O3 -fwrapv -Qunused-arguments -fPIC -fPIE -gdwarf-4 -Wall (Ubuntu_Clang_18.1.3_(1ubuntu1))
e/amd64-xmm6clang -march=native -O -fwrapv -Qunused-arguments -fPIC -fPIE -gdwarf-4 -Wall (Ubuntu_Clang_18.1.3_(1ubuntu1))
e/amd64-xmm6clang -march=native -Os -fwrapv -Qunused-arguments -fPIC -fPIE -gdwarf-4 -Wall (Ubuntu_Clang_18.1.3_(1ubuntu1))
e/amd64-xmm6clang -mcpu=native -O3 -fwrapv -Qunused-arguments -fPIC -fPIE -gdwarf-4 -Wall (Ubuntu_Clang_18.1.3_(1ubuntu1))
e/amd64-xmm6gcc -march=native -mtune=native -O2 -fwrapv -fPIC -fPIE -gdwarf-4 -Wall (13.3.0)
e/amd64-xmm6gcc -march=native -mtune=native -O3 -fwrapv -fPIC -fPIE -gdwarf-4 -Wall (13.3.0)
e/amd64-xmm6gcc -march=native -mtune=native -O -fwrapv -fPIC -fPIE -gdwarf-4 -Wall (13.3.0)
e/amd64-xmm6gcc -march=native -mtune=native -Os -fwrapv -fPIC -fPIE -gdwarf-4 -Wall (13.3.0)
e/mergedclang -march=native -O2 -fwrapv -Qunused-arguments -fPIC -fPIE -gdwarf-4 -Wall (Ubuntu_Clang_18.1.3_(1ubuntu1))
e/mergedclang -march=native -O3 -fwrapv -Qunused-arguments -fPIC -fPIE -gdwarf-4 -Wall (Ubuntu_Clang_18.1.3_(1ubuntu1))
e/mergedclang -march=native -O -fwrapv -Qunused-arguments -fPIC -fPIE -gdwarf-4 -Wall (Ubuntu_Clang_18.1.3_(1ubuntu1))
e/mergedclang -march=native -Os -fwrapv -Qunused-arguments -fPIC -fPIE -gdwarf-4 -Wall (Ubuntu_Clang_18.1.3_(1ubuntu1))
e/mergedclang -mcpu=native -O3 -fwrapv -Qunused-arguments -fPIC -fPIE -gdwarf-4 -Wall (Ubuntu_Clang_18.1.3_(1ubuntu1))
e/mergedgcc -march=native -mtune=native -O2 -fwrapv -fPIC -fPIE -gdwarf-4 -Wall (13.3.0)
e/mergedgcc -march=native -mtune=native -O3 -fwrapv -fPIC -fPIE -gdwarf-4 -Wall (13.3.0)
e/mergedgcc -march=native -mtune=native -O -fwrapv -fPIC -fPIE -gdwarf-4 -Wall (13.3.0)
e/mergedgcc -march=native -mtune=native -Os -fwrapv -fPIC -fPIE -gdwarf-4 -Wall (13.3.0)
e/refclang -march=native -O2 -fwrapv -Qunused-arguments -fPIC -fPIE -gdwarf-4 -Wall (Ubuntu_Clang_18.1.3_(1ubuntu1))
e/refclang -march=native -O3 -fwrapv -Qunused-arguments -fPIC -fPIE -gdwarf-4 -Wall (Ubuntu_Clang_18.1.3_(1ubuntu1))
e/refclang -march=native -O -fwrapv -Qunused-arguments -fPIC -fPIE -gdwarf-4 -Wall (Ubuntu_Clang_18.1.3_(1ubuntu1))
e/refclang -march=native -Os -fwrapv -Qunused-arguments -fPIC -fPIE -gdwarf-4 -Wall (Ubuntu_Clang_18.1.3_(1ubuntu1))
e/refclang -mcpu=native -O3 -fwrapv -Qunused-arguments -fPIC -fPIE -gdwarf-4 -Wall (Ubuntu_Clang_18.1.3_(1ubuntu1))
e/refgcc -march=native -mtune=native -O2 -fwrapv -fPIC -fPIE -gdwarf-4 -Wall (13.3.0)
e/refgcc -march=native -mtune=native -O3 -fwrapv -fPIC -fPIE -gdwarf-4 -Wall (13.3.0)
e/refgcc -march=native -mtune=native -O -fwrapv -fPIC -fPIE -gdwarf-4 -Wall (13.3.0)
e/refgcc -march=native -mtune=native -Os -fwrapv -fPIC -fPIE -gdwarf-4 -Wall (13.3.0)
e/regsclang -march=native -O2 -fwrapv -Qunused-arguments -fPIC -fPIE -gdwarf-4 -Wall (Ubuntu_Clang_18.1.3_(1ubuntu1))
e/regsclang -march=native -O3 -fwrapv -Qunused-arguments -fPIC -fPIE -gdwarf-4 -Wall (Ubuntu_Clang_18.1.3_(1ubuntu1))
e/regsclang -march=native -O -fwrapv -Qunused-arguments -fPIC -fPIE -gdwarf-4 -Wall (Ubuntu_Clang_18.1.3_(1ubuntu1))
e/regsclang -march=native -Os -fwrapv -Qunused-arguments -fPIC -fPIE -gdwarf-4 -Wall (Ubuntu_Clang_18.1.3_(1ubuntu1))
e/regsclang -mcpu=native -O3 -fwrapv -Qunused-arguments -fPIC -fPIE -gdwarf-4 -Wall (Ubuntu_Clang_18.1.3_(1ubuntu1))
e/regsgcc -march=native -mtune=native -O2 -fwrapv -fPIC -fPIE -gdwarf-4 -Wall (13.3.0)
e/regsgcc -march=native -mtune=native -O3 -fwrapv -fPIC -fPIE -gdwarf-4 -Wall (13.3.0)
e/regsgcc -march=native -mtune=native -O -fwrapv -fPIC -fPIE -gdwarf-4 -Wall (13.3.0)
e/regsgcc -march=native -mtune=native -Os -fwrapv -fPIC -fPIE -gdwarf-4 -Wall (13.3.0)
moon/sse2/64clang -march=native -O2 -fwrapv -Qunused-arguments -fPIC -fPIE -gdwarf-4 -Wall (Ubuntu_Clang_18.1.3_(1ubuntu1))
moon/sse2/64clang -march=native -O3 -fwrapv -Qunused-arguments -fPIC -fPIE -gdwarf-4 -Wall (Ubuntu_Clang_18.1.3_(1ubuntu1))
moon/sse2/64clang -march=native -O -fwrapv -Qunused-arguments -fPIC -fPIE -gdwarf-4 -Wall (Ubuntu_Clang_18.1.3_(1ubuntu1))
moon/sse2/64clang -march=native -Os -fwrapv -Qunused-arguments -fPIC -fPIE -gdwarf-4 -Wall (Ubuntu_Clang_18.1.3_(1ubuntu1))
moon/sse2/64clang -mcpu=native -O3 -fwrapv -Qunused-arguments -fPIC -fPIE -gdwarf-4 -Wall (Ubuntu_Clang_18.1.3_(1ubuntu1))
moon/sse2/64gcc -march=native -mtune=native -O2 -fwrapv -fPIC -fPIE -gdwarf-4 -Wall (13.3.0)
moon/sse2/64gcc -march=native -mtune=native -O3 -fwrapv -fPIC -fPIE -gdwarf-4 -Wall (13.3.0)
moon/sse2/64gcc -march=native -mtune=native -O -fwrapv -fPIC -fPIE -gdwarf-4 -Wall (13.3.0)
moon/sse2/64gcc -march=native -mtune=native -Os -fwrapv -fPIC -fPIE -gdwarf-4 -Wall (13.3.0)
moon/ssse3/64clang -march=native -O2 -fwrapv -Qunused-arguments -fPIC -fPIE -gdwarf-4 -Wall (Ubuntu_Clang_18.1.3_(1ubuntu1))
moon/ssse3/64clang -march=native -O3 -fwrapv -Qunused-arguments -fPIC -fPIE -gdwarf-4 -Wall (Ubuntu_Clang_18.1.3_(1ubuntu1))
moon/ssse3/64clang -march=native -O -fwrapv -Qunused-arguments -fPIC -fPIE -gdwarf-4 -Wall (Ubuntu_Clang_18.1.3_(1ubuntu1))
moon/ssse3/64clang -march=native -Os -fwrapv -Qunused-arguments -fPIC -fPIE -gdwarf-4 -Wall (Ubuntu_Clang_18.1.3_(1ubuntu1))
moon/ssse3/64clang -mcpu=native -O3 -fwrapv -Qunused-arguments -fPIC -fPIE -gdwarf-4 -Wall (Ubuntu_Clang_18.1.3_(1ubuntu1))
moon/ssse3/64gcc -march=native -mtune=native -O2 -fwrapv -fPIC -fPIE -gdwarf-4 -Wall (13.3.0)
moon/ssse3/64gcc -march=native -mtune=native -O3 -fwrapv -fPIC -fPIE -gdwarf-4 -Wall (13.3.0)
moon/ssse3/64gcc -march=native -mtune=native -O -fwrapv -fPIC -fPIE -gdwarf-4 -Wall (13.3.0)
moon/ssse3/64gcc -march=native -mtune=native -Os -fwrapv -fPIC -fPIE -gdwarf-4 -Wall (13.3.0)