Test results for amd64, h2atom, crypto_kem/sikep434

[Page version: 20260919 18:54:16]

Measurements for amd64, h2atom, crypto_kem Test results for amd64, h2atom, crypto_kem Test results for crypto_kem/sikep434
Computer: h2atom
Microarchitecture: amd64; Bonnell (106ca)
Architecture: amd64
CPU ID: GenuineIntel-000106ca-bfe9fbff
SUPERCOP version: 20260330
Operation: crypto_kem
Primitive: sikep434
TimeObject sizeTest sizeImplementationCompilerBenchmark dateSUPERCOP version
-69007701123498 0 050612 1224 2344T:amd64gcc -march=native -mtune=native -Os -fwrapv -fPIC -fPIE -gdwarf-4 -Wall2026082520260330
-10641386634463 0 063593 1232 2376T:amd64gcc -march=native -mtune=native -O -fwrapv -fPIC -fPIE -gdwarf-4 -Wall2026082520260330
12047604045082 0 075098 1240 2376T:amd64gcc -march=native -mtune=native -O2 -fwrapv -fPIC -fPIE -gdwarf-4 -Wall2026082520260330
17682195880052 0 0111194 1240 2376T:amd64gcc -march=native -mtune=native -O3 -fwrapv -fPIC -fPIE -gdwarf-4 -Wall2026082520260330
28843529379596 0 0109971 1256 2312T:amd64clang -mcpu=native -O3 -fwrapv -Qunused-arguments -fPIC -fPIE -gdwarf-4 -Wall2026082520260330
30731812936624 0 063981 1248 2312T:amd64clang -march=native -Os -fwrapv -Qunused-arguments -fPIC -fPIE -gdwarf-4 -Wall2026082520260330
51138113851161 0 079091 1256 2312T:amd64clang -march=native -O -fwrapv -Qunused-arguments -fPIC -fPIE -gdwarf-4 -Wall2026082520260330
59098427180790 0 0111195 1256 2312T:amd64clang -march=native -O3 -fwrapv -Qunused-arguments -fPIC -fPIE -gdwarf-4 -Wall2026082520260330
60105576966085 0 095283 1256 2312T:amd64clang -march=native -O2 -fwrapv -Qunused-arguments -fPIC -fPIE -gdwarf-4 -Wall2026082520260330

Test failure


error 132
timeout: the monitored command dumped core
Illegal instruction

Number of similar (implementation,compiler) pairs: 18, namely:
ImplementationCompiler
T:mulxclang -march=native -O2 -fwrapv -Qunused-arguments -fPIC -fPIE -gdwarf-4 -Wall (Ubuntu_Clang_18.1.3_(1ubuntu1))
T:mulxclang -march=native -O3 -fwrapv -Qunused-arguments -fPIC -fPIE -gdwarf-4 -Wall (Ubuntu_Clang_18.1.3_(1ubuntu1))
T:mulxclang -march=native -O -fwrapv -Qunused-arguments -fPIC -fPIE -gdwarf-4 -Wall (Ubuntu_Clang_18.1.3_(1ubuntu1))
T:mulxclang -march=native -Os -fwrapv -Qunused-arguments -fPIC -fPIE -gdwarf-4 -Wall (Ubuntu_Clang_18.1.3_(1ubuntu1))
T:mulxclang -mcpu=native -O3 -fwrapv -Qunused-arguments -fPIC -fPIE -gdwarf-4 -Wall (Ubuntu_Clang_18.1.3_(1ubuntu1))
T:mulxgcc -march=native -mtune=native -O2 -fwrapv -fPIC -fPIE -gdwarf-4 -Wall (13.3.0)
T:mulxgcc -march=native -mtune=native -O3 -fwrapv -fPIC -fPIE -gdwarf-4 -Wall (13.3.0)
T:mulxgcc -march=native -mtune=native -O -fwrapv -fPIC -fPIE -gdwarf-4 -Wall (13.3.0)
T:mulxgcc -march=native -mtune=native -Os -fwrapv -fPIC -fPIE -gdwarf-4 -Wall (13.3.0)
T:mulxadxclang -march=native -O2 -fwrapv -Qunused-arguments -fPIC -fPIE -gdwarf-4 -Wall (Ubuntu_Clang_18.1.3_(1ubuntu1))
T:mulxadxclang -march=native -O3 -fwrapv -Qunused-arguments -fPIC -fPIE -gdwarf-4 -Wall (Ubuntu_Clang_18.1.3_(1ubuntu1))
T:mulxadxclang -march=native -O -fwrapv -Qunused-arguments -fPIC -fPIE -gdwarf-4 -Wall (Ubuntu_Clang_18.1.3_(1ubuntu1))
T:mulxadxclang -march=native -Os -fwrapv -Qunused-arguments -fPIC -fPIE -gdwarf-4 -Wall (Ubuntu_Clang_18.1.3_(1ubuntu1))
T:mulxadxclang -mcpu=native -O3 -fwrapv -Qunused-arguments -fPIC -fPIE -gdwarf-4 -Wall (Ubuntu_Clang_18.1.3_(1ubuntu1))
T:mulxadxgcc -march=native -mtune=native -O2 -fwrapv -fPIC -fPIE -gdwarf-4 -Wall (13.3.0)
T:mulxadxgcc -march=native -mtune=native -O3 -fwrapv -fPIC -fPIE -gdwarf-4 -Wall (13.3.0)
T:mulxadxgcc -march=native -mtune=native -O -fwrapv -fPIC -fPIE -gdwarf-4 -Wall (13.3.0)
T:mulxadxgcc -march=native -mtune=native -Os -fwrapv -fPIC -fPIE -gdwarf-4 -Wall (13.3.0)

Compiler output


fp_x64_asm.S: fp_x64_asm.S:635:3: error: "CONFIGURATION NOT SUPPORTED. TRY USE_MULX=TRUE"
fp_x64_asm.S:   635 | # error "CONFIGURATION NOT SUPPORTED. TRY USE_MULX=TRUE"
fp_x64_asm.S:       |   ^
fp_x64_asm.S: fp_x64_asm.S:826:5: error: "CONFIGURATION NOT SUPPORTED. TRY USE_MULX=TRUE"
fp_x64_asm.S:   826 |   # error "CONFIGURATION NOT SUPPORTED. TRY USE_MULX=TRUE"
fp_x64_asm.S:       |     ^
fp_x64_asm.S: 2 errors generated.

Number of similar (implementation,compiler) pairs: 5, namely:
ImplementationCompiler
T:amd64asmclang -march=native -O2 -fwrapv -Qunused-arguments -fPIC -fPIE -gdwarf-4 -Wall (Ubuntu_Clang_18.1.3_(1ubuntu1))
T:amd64asmclang -march=native -O3 -fwrapv -Qunused-arguments -fPIC -fPIE -gdwarf-4 -Wall (Ubuntu_Clang_18.1.3_(1ubuntu1))
T:amd64asmclang -march=native -O -fwrapv -Qunused-arguments -fPIC -fPIE -gdwarf-4 -Wall (Ubuntu_Clang_18.1.3_(1ubuntu1))
T:amd64asmclang -march=native -Os -fwrapv -Qunused-arguments -fPIC -fPIE -gdwarf-4 -Wall (Ubuntu_Clang_18.1.3_(1ubuntu1))
T:amd64asmclang -mcpu=native -O3 -fwrapv -Qunused-arguments -fPIC -fPIE -gdwarf-4 -Wall (Ubuntu_Clang_18.1.3_(1ubuntu1))

Compiler output


fp_x64_asm.S: fp_x64_asm.S:635:3: error: #error "CONFIGURATION NOT SUPPORTED. TRY USE_MULX=TRUE"
fp_x64_asm.S:   635 | # error "CONFIGURATION NOT SUPPORTED. TRY USE_MULX=TRUE"
fp_x64_asm.S:       |   ^~~~~
fp_x64_asm.S: fp_x64_asm.S:826:5: error: #error "CONFIGURATION NOT SUPPORTED. TRY USE_MULX=TRUE"
fp_x64_asm.S:   826 |   # error "CONFIGURATION NOT SUPPORTED. TRY USE_MULX=TRUE"
fp_x64_asm.S:       |     ^~~~~

Number of similar (implementation,compiler) pairs: 4, namely:
ImplementationCompiler
T:amd64asmgcc -march=native -mtune=native -O2 -fwrapv -fPIC -fPIE -gdwarf-4 -Wall (13.3.0)
T:amd64asmgcc -march=native -mtune=native -O3 -fwrapv -fPIC -fPIE -gdwarf-4 -Wall (13.3.0)
T:amd64asmgcc -march=native -mtune=native -O -fwrapv -fPIC -fPIE -gdwarf-4 -Wall (13.3.0)
T:amd64asmgcc -march=native -mtune=native -Os -fwrapv -fPIC -fPIE -gdwarf-4 -Wall (13.3.0)

Compiler output


api.c: In file included from api.c:9:
api.c: In file included from ./sike_params.h:15:
api.c: In file included from ./montgomery.h:15:
api.c: In file included from ./fp2.h:16:
api.c: ./fp.h:15:10: fatal error: 'gmp.h' file not found
api.c:    15 | #include <gmp.h>
api.c:       |          ^~~~~~~
api.c: 1 error generated.

Number of similar (implementation,compiler) pairs: 5, namely:
ImplementationCompiler
T:refclang -march=native -O2 -fwrapv -Qunused-arguments -fPIC -fPIE -gdwarf-4 -Wall (Ubuntu_Clang_18.1.3_(1ubuntu1))
T:refclang -march=native -O3 -fwrapv -Qunused-arguments -fPIC -fPIE -gdwarf-4 -Wall (Ubuntu_Clang_18.1.3_(1ubuntu1))
T:refclang -march=native -O -fwrapv -Qunused-arguments -fPIC -fPIE -gdwarf-4 -Wall (Ubuntu_Clang_18.1.3_(1ubuntu1))
T:refclang -march=native -Os -fwrapv -Qunused-arguments -fPIC -fPIE -gdwarf-4 -Wall (Ubuntu_Clang_18.1.3_(1ubuntu1))
T:refclang -mcpu=native -O3 -fwrapv -Qunused-arguments -fPIC -fPIE -gdwarf-4 -Wall (Ubuntu_Clang_18.1.3_(1ubuntu1))

Compiler output


api.c: In file included from ./fp2.h:16,
api.c:                  from ./montgomery.h:15,
api.c:                  from ./sike_params.h:15,
api.c:                  from api.c:9:
api.c: ./fp.h:15:10: fatal error: gmp.h: No such file or directory
api.c:    15 | #include <gmp.h>
api.c:       |          ^~~~~~~
api.c: compilation terminated.

Number of similar (implementation,compiler) pairs: 4, namely:
ImplementationCompiler
T:refgcc -march=native -mtune=native -O2 -fwrapv -fPIC -fPIE -gdwarf-4 -Wall (13.3.0)
T:refgcc -march=native -mtune=native -O3 -fwrapv -fPIC -fPIE -gdwarf-4 -Wall (13.3.0)
T:refgcc -march=native -mtune=native -O -fwrapv -fPIC -fPIE -gdwarf-4 -Wall (13.3.0)
T:refgcc -march=native -mtune=native -Os -fwrapv -fPIC -fPIE -gdwarf-4 -Wall (13.3.0)

Namespace violations


P434.o A_gen R
P434.o Alice_order R
P434.o B_gen R
P434.o Bob_order R
P434.o EphemeralKeyGeneration_A_SIDHp434 T
P434.o EphemeralKeyGeneration_B_SIDHp434 T
P434.o EphemeralSecretAgreement_A_SIDHp434 T
P434.o EphemeralSecretAgreement_B_SIDHp434 T
P434.o Montgomery_R2 R
P434.o Montgomery_one R
P434.o clear_words T
P434.o copy_words T
P434.o ct_cmov T
P434.o ct_compare T
P434.o eval_3_isog T
P434.o eval_4_isog T
P434.o fp2add434 T
P434.o fp2copy434 T
P434.o fp2correction434 T
P434.o fp2div2_434 T
P434.o fp2inv434_mont T
P434.o fp2mul434_mont T
P434.o fp2neg434 T
P434.o fp2sqr434_mont T
P434.o fp2sub434 T
P434.o fp2zero434 T
P434.o fpcopy434 T
P434.o fpinv434_chain_mont T
P434.o fpinv434_mont T
P434.o fpmul434_mont T
P434.o fpsqr434_mont T
P434.o fpzero434 T
P434.o from_fp2mont T
P434.o from_mont T
P434.o get_3_isog T
P434.o get_4_isog T
P434.o get_A T
P434.o inv_3_way T
P434.o j_inv T
P434.o mp_add T
P434.o mp_shiftl1 T
P434.o mp_shiftleft T
P434.o mp_shiftr1 T
P434.o mp_sub T
P434.o p434 R
P434.o p434p1 R
P434.o p434x16p R
P434.o p434x2 R
P434.o p434x4 R
P434.o random_mod_order_A_SIDHp434 T
P434.o random_mod_order_B_SIDHp434 T
P434.o strat_Alice R
P434.o strat_Bob R
P434.o to_fp2mont T
P434.o to_mont T
P434.o xDBL T
P434.o xDBLADD T
P434.o xDBLe T
P434.o xTPL T
P434.o xTPLe T
fips202.o KeccakF1600_StatePermute T
fips202.o shake128 T
fips202.o shake128_absorb T
fips202.o shake128_squeezeblocks T
fips202.o shake256 T
fips202.o shake256_absorb T
fips202.o shake256_squeezeblocks T
fp_generic.o digit_x_digit T
fp_generic.o fpadd434 T
fp_generic.o fpcorrection434 T
fp_generic.o fpdiv2_434 T
fp_generic.o fpneg434 T
fp_generic.o fpsub434 T
fp_generic.o mp_mul T
fp_generic.o mp_sub434_p2 T
fp_generic.o mp_sub434_p4 T
fp_generic.o rdc_mont T

Number of similar (implementation,compiler) pairs: 9, namely:
ImplementationCompiler
T:amd64clang -march=native -O2 -fwrapv -Qunused-arguments -fPIC -fPIE -gdwarf-4 -Wall (Ubuntu_Clang_18.1.3_(1ubuntu1))
T:amd64clang -march=native -O3 -fwrapv -Qunused-arguments -fPIC -fPIE -gdwarf-4 -Wall (Ubuntu_Clang_18.1.3_(1ubuntu1))
T:amd64clang -march=native -O -fwrapv -Qunused-arguments -fPIC -fPIE -gdwarf-4 -Wall (Ubuntu_Clang_18.1.3_(1ubuntu1))
T:amd64clang -march=native -Os -fwrapv -Qunused-arguments -fPIC -fPIE -gdwarf-4 -Wall (Ubuntu_Clang_18.1.3_(1ubuntu1))
T:amd64clang -mcpu=native -O3 -fwrapv -Qunused-arguments -fPIC -fPIE -gdwarf-4 -Wall (Ubuntu_Clang_18.1.3_(1ubuntu1))
T:amd64gcc -march=native -mtune=native -O2 -fwrapv -fPIC -fPIE -gdwarf-4 -Wall (13.3.0)
T:amd64gcc -march=native -mtune=native -O3 -fwrapv -fPIC -fPIE -gdwarf-4 -Wall (13.3.0)
T:amd64gcc -march=native -mtune=native -O -fwrapv -fPIC -fPIE -gdwarf-4 -Wall (13.3.0)
T:amd64gcc -march=native -mtune=native -Os -fwrapv -fPIC -fPIE -gdwarf-4 -Wall (13.3.0)