Test results for amd64, h2atom, crypto_aead/omdsha512k256n256tau256v1
[Page version: 20260919 18:54:16]
Measurements for amd64, h2atom, crypto_aead
Test results for amd64, h2atom, crypto_aead
Test results for crypto_aead/omdsha512k256n256tau256v1
Computer: h2atom
Microarchitecture: amd64; Bonnell (106ca)
Architecture: amd64
CPU ID: GenuineIntel-000106ca-bfe9fbff
SUPERCOP version: 20260330
Operation: crypto_aead
Primitive: omdsha512k256n256tau256v1
| Time | Object size | Test size | Implementation | Compiler | Benchmark date | SUPERCOP version |
| 355566 | 20940 0 0 | 53772 1240 1608 | T:ref | clang -march=native -O3 -fwrapv -Qunused-arguments -fPIC -fPIE -gdwarf-4 -Wall | 20260521 | 20260330 |
| 359403 | 17600 0 0 | 49260 1240 1608 | T:ref | clang -march=native -O2 -fwrapv -Qunused-arguments -fPIC -fPIE -gdwarf-4 -Wall | 20260521 | 20260330 |
| 407979 | 5942 0 0 | 35742 1232 1608 | T:ref | clang -march=native -Os -fwrapv -Qunused-arguments -fPIC -fPIE -gdwarf-4 -Wall | 20260521 | 20260330 |
| 415806 | 26921 0 0 | 60394 1232 1704 | T:ref | gcc -march=native -mtune=native -O3 -fwrapv -fPIC -fPIE -gdwarf-4 -Wall | 20260521 | 20260330 |
| 435509 | 22812 0 0 | 55356 1240 1608 | T:ref | clang -mcpu=native -O3 -fwrapv -Qunused-arguments -fPIC -fPIE -gdwarf-4 -Wall | 20260521 | 20260330 |
| 464208 | 8273 0 0 | 38612 1240 1608 | T:ref | clang -march=native -O -fwrapv -Qunused-arguments -fPIC -fPIE -gdwarf-4 -Wall | 20260521 | 20260330 |
| 491790 | 10217 0 0 | 42586 1232 1704 | T:ref | gcc -march=native -mtune=native -O2 -fwrapv -fPIC -fPIE -gdwarf-4 -Wall | 20260521 | 20260330 |
| 598046 | 8160 0 0 | 39585 1224 1704 | T:ref | gcc -march=native -mtune=native -O -fwrapv -fPIC -fPIE -gdwarf-4 -Wall | 20260521 | 20260330 |
| 603398 | 5238 0 0 | 34784 1208 1672 | T:ref | gcc -march=native -mtune=native -Os -fwrapv -fPIC -fPIE -gdwarf-4 -Wall | 20260521 | 20260330 |
Compiler output
try.c: /usr/bin/ld: libcrypto_aead_omdsha512k256n256tau256v1.a(omdsha512.o):.../supercop-data/h2atom/amd64/try/c/clang_-march=native_-O2_-fwrapv_-Qunused-arguments_-fPIC_-fPIE_-gdwarf-4_-Wall/timingleaks/crypto_aead/omdsha512k256n256tau256v1/avx1/work/./omdsha512.h:146: multiple definition of `Hash'; libcrypto_aead_omdsha512k256n256tau256v1.a(encrypt.o):.../supercop-data/h2atom/amd64/try/c/clang_-march=native_-O2_-fwrapv_-Qunused-arguments_-fPIC_-fPIE_-gdwarf-4_-Wall/timingleaks/crypto_aead/omdsha512k256n256tau256v1/avx1/work/./omdsha512.h:146: first defined here
try.c: clang: error: linker command failed with exit code 1 (use -v to see invocation)
Number of similar (implementation,compiler) pairs: 1, namely:
| Implementation | Compiler |
| T:avx1 | clang -march=native -O2 -fwrapv -Qunused-arguments -fPIC -fPIE -gdwarf-4 -Wall (Ubuntu_Clang_18.1.3_(1ubuntu1)) |
Compiler output
try.c: /usr/bin/ld: libcrypto_aead_omdsha512k256n256tau256v1.a(omdsha512.o):.../supercop-data/h2atom/amd64/try/c/clang_-march=native_-O3_-fwrapv_-Qunused-arguments_-fPIC_-fPIE_-gdwarf-4_-Wall/timingleaks/crypto_aead/omdsha512k256n256tau256v1/avx1/work/./omdsha512.h:146: multiple definition of `Hash'; libcrypto_aead_omdsha512k256n256tau256v1.a(encrypt.o):.../supercop-data/h2atom/amd64/try/c/clang_-march=native_-O3_-fwrapv_-Qunused-arguments_-fPIC_-fPIE_-gdwarf-4_-Wall/timingleaks/crypto_aead/omdsha512k256n256tau256v1/avx1/work/./omdsha512.h:146: first defined here
try.c: clang: error: linker command failed with exit code 1 (use -v to see invocation)
Number of similar (implementation,compiler) pairs: 1, namely:
| Implementation | Compiler |
| T:avx1 | clang -march=native -O3 -fwrapv -Qunused-arguments -fPIC -fPIE -gdwarf-4 -Wall (Ubuntu_Clang_18.1.3_(1ubuntu1)) |
Compiler output
try.c: /usr/bin/ld: libcrypto_aead_omdsha512k256n256tau256v1.a(omdsha512.o):.../supercop-data/h2atom/amd64/try/c/clang_-march=native_-O_-fwrapv_-Qunused-arguments_-fPIC_-fPIE_-gdwarf-4_-Wall/timingleaks/crypto_aead/omdsha512k256n256tau256v1/avx1/work/./omdsha512.h:146: multiple definition of `Hash'; libcrypto_aead_omdsha512k256n256tau256v1.a(encrypt.o):.../supercop-data/h2atom/amd64/try/c/clang_-march=native_-O_-fwrapv_-Qunused-arguments_-fPIC_-fPIE_-gdwarf-4_-Wall/timingleaks/crypto_aead/omdsha512k256n256tau256v1/avx1/work/./omdsha512.h:146: first defined here
try.c: clang: error: linker command failed with exit code 1 (use -v to see invocation)
Number of similar (implementation,compiler) pairs: 1, namely:
| Implementation | Compiler |
| T:avx1 | clang -march=native -O -fwrapv -Qunused-arguments -fPIC -fPIE -gdwarf-4 -Wall (Ubuntu_Clang_18.1.3_(1ubuntu1)) |
Compiler output
try.c: /usr/bin/ld: libcrypto_aead_omdsha512k256n256tau256v1.a(omdsha512.o):.../supercop-data/h2atom/amd64/try/c/clang_-march=native_-Os_-fwrapv_-Qunused-arguments_-fPIC_-fPIE_-gdwarf-4_-Wall/timingleaks/crypto_aead/omdsha512k256n256tau256v1/avx1/work/./omdsha512.h:146: multiple definition of `Hash'; libcrypto_aead_omdsha512k256n256tau256v1.a(encrypt.o):.../supercop-data/h2atom/amd64/try/c/clang_-march=native_-Os_-fwrapv_-Qunused-arguments_-fPIC_-fPIE_-gdwarf-4_-Wall/timingleaks/crypto_aead/omdsha512k256n256tau256v1/avx1/work/./omdsha512.h:146: first defined here
try.c: clang: error: linker command failed with exit code 1 (use -v to see invocation)
Number of similar (implementation,compiler) pairs: 1, namely:
| Implementation | Compiler |
| T:avx1 | clang -march=native -Os -fwrapv -Qunused-arguments -fPIC -fPIE -gdwarf-4 -Wall (Ubuntu_Clang_18.1.3_(1ubuntu1)) |
Compiler output
try.c: /usr/bin/ld: libcrypto_aead_omdsha512k256n256tau256v1.a(omdsha512.o):.../supercop-data/h2atom/amd64/try/c/clang_-mcpu=native_-O3_-fwrapv_-Qunused-arguments_-fPIC_-fPIE_-gdwarf-4_-Wall/timingleaks/crypto_aead/omdsha512k256n256tau256v1/avx1/work/./omdsha512.h:146: multiple definition of `Hash'; libcrypto_aead_omdsha512k256n256tau256v1.a(encrypt.o):.../supercop-data/h2atom/amd64/try/c/clang_-mcpu=native_-O3_-fwrapv_-Qunused-arguments_-fPIC_-fPIE_-gdwarf-4_-Wall/timingleaks/crypto_aead/omdsha512k256n256tau256v1/avx1/work/./omdsha512.h:146: first defined here
try.c: clang: error: linker command failed with exit code 1 (use -v to see invocation)
Number of similar (implementation,compiler) pairs: 1, namely:
| Implementation | Compiler |
| T:avx1 | clang -mcpu=native -O3 -fwrapv -Qunused-arguments -fPIC -fPIE -gdwarf-4 -Wall (Ubuntu_Clang_18.1.3_(1ubuntu1)) |
Compiler output
encrypt.c: /tmp/ccTK2uV8.s: Assembler messages:
encrypt.c: /tmp/ccTK2uV8.s:3548: Warning: dwarf line number information for .data ignored
encrypt.c: /tmp/ccTK2uV8.s:3550: Warning: dwarf line number information for .data ignored
encrypt.c: /tmp/ccTK2uV8.s:3552: Warning: dwarf line number information for .data ignored
encrypt.c: /tmp/ccTK2uV8.s:3553: Warning: dwarf line number information for .data ignored
encrypt.c: /tmp/ccTK2uV8.s:3554: Warning: dwarf line number information for .data ignored
encrypt.c: /tmp/ccTK2uV8.s:3556: Warning: dwarf line number information for .data ignored
encrypt.c: /tmp/ccTK2uV8.s:3559: Warning: dwarf line number information for .data ignored
encrypt.c: /tmp/ccTK2uV8.s:3560: Warning: dwarf line number information for .data ignored
encrypt.c: /tmp/ccTK2uV8.s:3563: Warning: dwarf line number information for .data ignored
encrypt.c: /tmp/ccTK2uV8.s:3566: Warning: dwarf line number information for .data ignored
encrypt.c: /tmp/ccTK2uV8.s:3569: Warning: dwarf line number information for .data ignored
encrypt.c: /tmp/ccTK2uV8.s:3572: Warning: dwarf line number information for .data ignored
encrypt.c: /tmp/ccTK2uV8.s:3582: Warning: dwarf line number information for .data ignored
encrypt.c: /tmp/ccTK2uV8.s:3584: Warning: dwarf line number information for .data ignored
encrypt.c: /tmp/ccTK2uV8.s:3586: Warning: dwarf line number information for .data ignored
encrypt.c: /tmp/ccTK2uV8.s:3587: Warning: dwarf line number information for .data ignored
encrypt.c: /tmp/ccTK2uV8.s:3588: Warning: dwarf line number information for .data ignored
encrypt.c: /tmp/ccTK2uV8.s:3591: Warning: dwarf line number information for .data ignored
encrypt.c: /tmp/ccTK2uV8.s:3594: Warning: dwarf line number information for .data ignored
encrypt.c: /tmp/ccTK2uV8.s:3596: Warning: dwarf line number information for .data ignored
encrypt.c: /tmp/ccTK2uV8.s:3598: Warning: dwarf line number information for .data ignored
encrypt.c: /tmp/ccTK2uV8.s:3600: Warning: dwarf line number information for .data ignored
encrypt.c: /tmp/ccTK2uV8.s:3603: Warning: dwarf line number information for .data ignored
encrypt.c: /tmp/ccTK2uV8.s:3605: Warning: dwarf line number information for .data ignored
encrypt.c: ...
Number of similar (implementation,compiler) pairs: 1, namely:
| Implementation | Compiler |
| T:avx1 | gcc -march=native -mtune=native -O2 -fwrapv -fPIC -fPIE -gdwarf-4 -Wall (13.3.0) |
Compiler output
encrypt.c: /tmp/ccPgx3OF.s: Assembler messages:
encrypt.c: /tmp/ccPgx3OF.s:3548: Warning: dwarf line number information for .data ignored
encrypt.c: /tmp/ccPgx3OF.s:3550: Warning: dwarf line number information for .data ignored
encrypt.c: /tmp/ccPgx3OF.s:3552: Warning: dwarf line number information for .data ignored
encrypt.c: /tmp/ccPgx3OF.s:3553: Warning: dwarf line number information for .data ignored
encrypt.c: /tmp/ccPgx3OF.s:3554: Warning: dwarf line number information for .data ignored
encrypt.c: /tmp/ccPgx3OF.s:3556: Warning: dwarf line number information for .data ignored
encrypt.c: /tmp/ccPgx3OF.s:3559: Warning: dwarf line number information for .data ignored
encrypt.c: /tmp/ccPgx3OF.s:3560: Warning: dwarf line number information for .data ignored
encrypt.c: /tmp/ccPgx3OF.s:3563: Warning: dwarf line number information for .data ignored
encrypt.c: /tmp/ccPgx3OF.s:3566: Warning: dwarf line number information for .data ignored
encrypt.c: /tmp/ccPgx3OF.s:3569: Warning: dwarf line number information for .data ignored
encrypt.c: /tmp/ccPgx3OF.s:3572: Warning: dwarf line number information for .data ignored
encrypt.c: /tmp/ccPgx3OF.s:3582: Warning: dwarf line number information for .data ignored
encrypt.c: /tmp/ccPgx3OF.s:3584: Warning: dwarf line number information for .data ignored
encrypt.c: /tmp/ccPgx3OF.s:3586: Warning: dwarf line number information for .data ignored
encrypt.c: /tmp/ccPgx3OF.s:3587: Warning: dwarf line number information for .data ignored
encrypt.c: /tmp/ccPgx3OF.s:3588: Warning: dwarf line number information for .data ignored
encrypt.c: /tmp/ccPgx3OF.s:3591: Warning: dwarf line number information for .data ignored
encrypt.c: /tmp/ccPgx3OF.s:3594: Warning: dwarf line number information for .data ignored
encrypt.c: /tmp/ccPgx3OF.s:3596: Warning: dwarf line number information for .data ignored
encrypt.c: /tmp/ccPgx3OF.s:3598: Warning: dwarf line number information for .data ignored
encrypt.c: /tmp/ccPgx3OF.s:3600: Warning: dwarf line number information for .data ignored
encrypt.c: /tmp/ccPgx3OF.s:3603: Warning: dwarf line number information for .data ignored
encrypt.c: /tmp/ccPgx3OF.s:3605: Warning: dwarf line number information for .data ignored
encrypt.c: ...
Number of similar (implementation,compiler) pairs: 1, namely:
| Implementation | Compiler |
| T:avx1 | gcc -march=native -mtune=native -O3 -fwrapv -fPIC -fPIE -gdwarf-4 -Wall (13.3.0) |
Compiler output
encrypt.c: /tmp/ccyJeKnD.s: Assembler messages:
encrypt.c: /tmp/ccyJeKnD.s:3547: Warning: dwarf line number information for .data ignored
encrypt.c: /tmp/ccyJeKnD.s:3549: Warning: dwarf line number information for .data ignored
encrypt.c: /tmp/ccyJeKnD.s:3553: Warning: dwarf line number information for .data ignored
encrypt.c: /tmp/ccyJeKnD.s:3554: Warning: dwarf line number information for .data ignored
encrypt.c: /tmp/ccyJeKnD.s:3555: Warning: dwarf line number information for .data ignored
encrypt.c: /tmp/ccyJeKnD.s:3558: Warning: dwarf line number information for .data ignored
encrypt.c: /tmp/ccyJeKnD.s:3559: Warning: dwarf line number information for .data ignored
encrypt.c: /tmp/ccyJeKnD.s:3565: Warning: dwarf line number information for .data ignored
encrypt.c: /tmp/ccyJeKnD.s:3568: Warning: dwarf line number information for .data ignored
encrypt.c: /tmp/ccyJeKnD.s:3580: Warning: dwarf line number information for .data ignored
encrypt.c: /tmp/ccyJeKnD.s:3582: Warning: dwarf line number information for .data ignored
encrypt.c: /tmp/ccyJeKnD.s:3588: Warning: dwarf line number information for .data ignored
encrypt.c: /tmp/ccyJeKnD.s:3591: Warning: dwarf line number information for .data ignored
encrypt.c: /tmp/ccyJeKnD.s:3594: Warning: dwarf line number information for .data ignored
encrypt.c: /tmp/ccyJeKnD.s:3595: Warning: dwarf line number information for .data ignored
encrypt.c: /tmp/ccyJeKnD.s:3596: Warning: dwarf line number information for .data ignored
encrypt.c: /tmp/ccyJeKnD.s:3600: Warning: dwarf line number information for .data ignored
encrypt.c: /tmp/ccyJeKnD.s:3601: Warning: dwarf line number information for .data ignored
encrypt.c: /tmp/ccyJeKnD.s:3607: Warning: dwarf line number information for .data ignored
encrypt.c: /tmp/ccyJeKnD.s:3610: Warning: dwarf line number information for .data ignored
encrypt.c: /tmp/ccyJeKnD.s:3613: Warning: dwarf line number information for .data ignored
encrypt.c: /tmp/ccyJeKnD.s:10146: Error: leb128 operand is an undefined symbol: .LVU20
encrypt.c: /tmp/ccyJeKnD.s:10147: Error: leb128 operand is an undefined symbol: .LVU20
encrypt.c: /tmp/ccyJeKnD.s:10165: Error: leb128 operand is an undefined symbol: .LVU19
encrypt.c: ...
Number of similar (implementation,compiler) pairs: 1, namely:
| Implementation | Compiler |
| T:avx1 | gcc -march=native -mtune=native -O -fwrapv -fPIC -fPIE -gdwarf-4 -Wall (13.3.0) |
Compiler output
encrypt.c: /tmp/ccJ6YI5x.s: Assembler messages:
encrypt.c: /tmp/ccJ6YI5x.s:3547: Warning: dwarf line number information for .data ignored
encrypt.c: /tmp/ccJ6YI5x.s:3549: Warning: dwarf line number information for .data ignored
encrypt.c: /tmp/ccJ6YI5x.s:3551: Warning: dwarf line number information for .data ignored
encrypt.c: /tmp/ccJ6YI5x.s:3552: Warning: dwarf line number information for .data ignored
encrypt.c: /tmp/ccJ6YI5x.s:3553: Warning: dwarf line number information for .data ignored
encrypt.c: /tmp/ccJ6YI5x.s:3556: Warning: dwarf line number information for .data ignored
encrypt.c: /tmp/ccJ6YI5x.s:3557: Warning: dwarf line number information for .data ignored
encrypt.c: /tmp/ccJ6YI5x.s:3560: Warning: dwarf line number information for .data ignored
encrypt.c: /tmp/ccJ6YI5x.s:3562: Warning: dwarf line number information for .data ignored
encrypt.c: /tmp/ccJ6YI5x.s:3565: Warning: dwarf line number information for .data ignored
encrypt.c: /tmp/ccJ6YI5x.s:3569: Warning: dwarf line number information for .data ignored
encrypt.c: /tmp/ccJ6YI5x.s:3572: Warning: dwarf line number information for .data ignored
encrypt.c: /tmp/ccJ6YI5x.s:3581: Warning: dwarf line number information for .data ignored
encrypt.c: /tmp/ccJ6YI5x.s:3583: Warning: dwarf line number information for .data ignored
encrypt.c: /tmp/ccJ6YI5x.s:3585: Warning: dwarf line number information for .data ignored
encrypt.c: /tmp/ccJ6YI5x.s:3586: Warning: dwarf line number information for .data ignored
encrypt.c: /tmp/ccJ6YI5x.s:3587: Warning: dwarf line number information for .data ignored
encrypt.c: /tmp/ccJ6YI5x.s:3590: Warning: dwarf line number information for .data ignored
encrypt.c: /tmp/ccJ6YI5x.s:3593: Warning: dwarf line number information for .data ignored
encrypt.c: /tmp/ccJ6YI5x.s:3597: Warning: dwarf line number information for .data ignored
encrypt.c: /tmp/ccJ6YI5x.s:3600: Warning: dwarf line number information for .data ignored
encrypt.c: /tmp/ccJ6YI5x.s:3603: Warning: dwarf line number information for .data ignored
encrypt.c: /tmp/ccJ6YI5x.s:3604: Warning: dwarf line number information for .data ignored
encrypt.c: /tmp/ccJ6YI5x.s:3607: Warning: dwarf line number information for .data ignored
encrypt.c: ...
Number of similar (implementation,compiler) pairs: 1, namely:
| Implementation | Compiler |
| T:avx1 | gcc -march=native -mtune=native -Os -fwrapv -fPIC -fPIE -gdwarf-4 -Wall (13.3.0) |
Compiler output
try.c: /usr/bin/ld: libcrypto_aead_omdsha512k256n256tau256v1.a(omdsha512.o):.../supercop-data/h2atom/amd64/try/c/clang_-march=native_-O2_-fwrapv_-Qunused-arguments_-fPIC_-fPIE_-gdwarf-4_-Wall/timingleaks/crypto_aead/omdsha512k256n256tau256v1/sse4/work/./omdsha512.h:146: multiple definition of `Hash'; libcrypto_aead_omdsha512k256n256tau256v1.a(encrypt.o):.../supercop-data/h2atom/amd64/try/c/clang_-march=native_-O2_-fwrapv_-Qunused-arguments_-fPIC_-fPIE_-gdwarf-4_-Wall/timingleaks/crypto_aead/omdsha512k256n256tau256v1/sse4/work/./omdsha512.h:146: first defined here
try.c: clang: error: linker command failed with exit code 1 (use -v to see invocation)
Number of similar (implementation,compiler) pairs: 1, namely:
| Implementation | Compiler |
| T:sse4 | clang -march=native -O2 -fwrapv -Qunused-arguments -fPIC -fPIE -gdwarf-4 -Wall (Ubuntu_Clang_18.1.3_(1ubuntu1)) |
Compiler output
try.c: /usr/bin/ld: libcrypto_aead_omdsha512k256n256tau256v1.a(omdsha512.o):.../supercop-data/h2atom/amd64/try/c/clang_-march=native_-O3_-fwrapv_-Qunused-arguments_-fPIC_-fPIE_-gdwarf-4_-Wall/timingleaks/crypto_aead/omdsha512k256n256tau256v1/sse4/work/./omdsha512.h:146: multiple definition of `Hash'; libcrypto_aead_omdsha512k256n256tau256v1.a(encrypt.o):.../supercop-data/h2atom/amd64/try/c/clang_-march=native_-O3_-fwrapv_-Qunused-arguments_-fPIC_-fPIE_-gdwarf-4_-Wall/timingleaks/crypto_aead/omdsha512k256n256tau256v1/sse4/work/./omdsha512.h:146: first defined here
try.c: clang: error: linker command failed with exit code 1 (use -v to see invocation)
Number of similar (implementation,compiler) pairs: 1, namely:
| Implementation | Compiler |
| T:sse4 | clang -march=native -O3 -fwrapv -Qunused-arguments -fPIC -fPIE -gdwarf-4 -Wall (Ubuntu_Clang_18.1.3_(1ubuntu1)) |
Compiler output
try.c: /usr/bin/ld: libcrypto_aead_omdsha512k256n256tau256v1.a(omdsha512.o):.../supercop-data/h2atom/amd64/try/c/clang_-march=native_-O_-fwrapv_-Qunused-arguments_-fPIC_-fPIE_-gdwarf-4_-Wall/timingleaks/crypto_aead/omdsha512k256n256tau256v1/sse4/work/./omdsha512.h:146: multiple definition of `Hash'; libcrypto_aead_omdsha512k256n256tau256v1.a(encrypt.o):.../supercop-data/h2atom/amd64/try/c/clang_-march=native_-O_-fwrapv_-Qunused-arguments_-fPIC_-fPIE_-gdwarf-4_-Wall/timingleaks/crypto_aead/omdsha512k256n256tau256v1/sse4/work/./omdsha512.h:146: first defined here
try.c: clang: error: linker command failed with exit code 1 (use -v to see invocation)
Number of similar (implementation,compiler) pairs: 1, namely:
| Implementation | Compiler |
| T:sse4 | clang -march=native -O -fwrapv -Qunused-arguments -fPIC -fPIE -gdwarf-4 -Wall (Ubuntu_Clang_18.1.3_(1ubuntu1)) |
Compiler output
try.c: /usr/bin/ld: libcrypto_aead_omdsha512k256n256tau256v1.a(omdsha512.o):.../supercop-data/h2atom/amd64/try/c/clang_-march=native_-Os_-fwrapv_-Qunused-arguments_-fPIC_-fPIE_-gdwarf-4_-Wall/timingleaks/crypto_aead/omdsha512k256n256tau256v1/sse4/work/./omdsha512.h:146: multiple definition of `Hash'; libcrypto_aead_omdsha512k256n256tau256v1.a(encrypt.o):.../supercop-data/h2atom/amd64/try/c/clang_-march=native_-Os_-fwrapv_-Qunused-arguments_-fPIC_-fPIE_-gdwarf-4_-Wall/timingleaks/crypto_aead/omdsha512k256n256tau256v1/sse4/work/./omdsha512.h:146: first defined here
try.c: clang: error: linker command failed with exit code 1 (use -v to see invocation)
Number of similar (implementation,compiler) pairs: 1, namely:
| Implementation | Compiler |
| T:sse4 | clang -march=native -Os -fwrapv -Qunused-arguments -fPIC -fPIE -gdwarf-4 -Wall (Ubuntu_Clang_18.1.3_(1ubuntu1)) |
Compiler output
try.c: /usr/bin/ld: libcrypto_aead_omdsha512k256n256tau256v1.a(omdsha512.o):.../supercop-data/h2atom/amd64/try/c/clang_-mcpu=native_-O3_-fwrapv_-Qunused-arguments_-fPIC_-fPIE_-gdwarf-4_-Wall/timingleaks/crypto_aead/omdsha512k256n256tau256v1/sse4/work/./omdsha512.h:146: multiple definition of `Hash'; libcrypto_aead_omdsha512k256n256tau256v1.a(encrypt.o):.../supercop-data/h2atom/amd64/try/c/clang_-mcpu=native_-O3_-fwrapv_-Qunused-arguments_-fPIC_-fPIE_-gdwarf-4_-Wall/timingleaks/crypto_aead/omdsha512k256n256tau256v1/sse4/work/./omdsha512.h:146: first defined here
try.c: clang: error: linker command failed with exit code 1 (use -v to see invocation)
Number of similar (implementation,compiler) pairs: 1, namely:
| Implementation | Compiler |
| T:sse4 | clang -mcpu=native -O3 -fwrapv -Qunused-arguments -fPIC -fPIE -gdwarf-4 -Wall (Ubuntu_Clang_18.1.3_(1ubuntu1)) |
Compiler output
encrypt.c: /tmp/cc2eeD4H.s: Assembler messages:
encrypt.c: /tmp/cc2eeD4H.s:3376: Warning: dwarf line number information for .data ignored
encrypt.c: /tmp/cc2eeD4H.s:3378: Warning: dwarf line number information for .data ignored
encrypt.c: /tmp/cc2eeD4H.s:3380: Warning: dwarf line number information for .data ignored
encrypt.c: /tmp/cc2eeD4H.s:3381: Warning: dwarf line number information for .data ignored
encrypt.c: /tmp/cc2eeD4H.s:3382: Warning: dwarf line number information for .data ignored
encrypt.c: /tmp/cc2eeD4H.s:3384: Warning: dwarf line number information for .data ignored
encrypt.c: /tmp/cc2eeD4H.s:3387: Warning: dwarf line number information for .data ignored
encrypt.c: /tmp/cc2eeD4H.s:3388: Warning: dwarf line number information for .data ignored
encrypt.c: /tmp/cc2eeD4H.s:3391: Warning: dwarf line number information for .data ignored
encrypt.c: /tmp/cc2eeD4H.s:3394: Warning: dwarf line number information for .data ignored
encrypt.c: /tmp/cc2eeD4H.s:3397: Warning: dwarf line number information for .data ignored
encrypt.c: /tmp/cc2eeD4H.s:3400: Warning: dwarf line number information for .data ignored
encrypt.c: /tmp/cc2eeD4H.s:3410: Warning: dwarf line number information for .data ignored
encrypt.c: /tmp/cc2eeD4H.s:3412: Warning: dwarf line number information for .data ignored
encrypt.c: /tmp/cc2eeD4H.s:3414: Warning: dwarf line number information for .data ignored
encrypt.c: /tmp/cc2eeD4H.s:3415: Warning: dwarf line number information for .data ignored
encrypt.c: /tmp/cc2eeD4H.s:3416: Warning: dwarf line number information for .data ignored
encrypt.c: /tmp/cc2eeD4H.s:3419: Warning: dwarf line number information for .data ignored
encrypt.c: /tmp/cc2eeD4H.s:3422: Warning: dwarf line number information for .data ignored
encrypt.c: /tmp/cc2eeD4H.s:3424: Warning: dwarf line number information for .data ignored
encrypt.c: /tmp/cc2eeD4H.s:3426: Warning: dwarf line number information for .data ignored
encrypt.c: /tmp/cc2eeD4H.s:3428: Warning: dwarf line number information for .data ignored
encrypt.c: /tmp/cc2eeD4H.s:3431: Warning: dwarf line number information for .data ignored
encrypt.c: /tmp/cc2eeD4H.s:3433: Warning: dwarf line number information for .data ignored
encrypt.c: ...
Number of similar (implementation,compiler) pairs: 1, namely:
| Implementation | Compiler |
| T:sse4 | gcc -march=native -mtune=native -O2 -fwrapv -fPIC -fPIE -gdwarf-4 -Wall (13.3.0) |
Compiler output
encrypt.c: /tmp/ccRb36gU.s: Assembler messages:
encrypt.c: /tmp/ccRb36gU.s:3376: Warning: dwarf line number information for .data ignored
encrypt.c: /tmp/ccRb36gU.s:3378: Warning: dwarf line number information for .data ignored
encrypt.c: /tmp/ccRb36gU.s:3380: Warning: dwarf line number information for .data ignored
encrypt.c: /tmp/ccRb36gU.s:3381: Warning: dwarf line number information for .data ignored
encrypt.c: /tmp/ccRb36gU.s:3382: Warning: dwarf line number information for .data ignored
encrypt.c: /tmp/ccRb36gU.s:3384: Warning: dwarf line number information for .data ignored
encrypt.c: /tmp/ccRb36gU.s:3387: Warning: dwarf line number information for .data ignored
encrypt.c: /tmp/ccRb36gU.s:3388: Warning: dwarf line number information for .data ignored
encrypt.c: /tmp/ccRb36gU.s:3391: Warning: dwarf line number information for .data ignored
encrypt.c: /tmp/ccRb36gU.s:3394: Warning: dwarf line number information for .data ignored
encrypt.c: /tmp/ccRb36gU.s:3397: Warning: dwarf line number information for .data ignored
encrypt.c: /tmp/ccRb36gU.s:3400: Warning: dwarf line number information for .data ignored
encrypt.c: /tmp/ccRb36gU.s:3410: Warning: dwarf line number information for .data ignored
encrypt.c: /tmp/ccRb36gU.s:3412: Warning: dwarf line number information for .data ignored
encrypt.c: /tmp/ccRb36gU.s:3414: Warning: dwarf line number information for .data ignored
encrypt.c: /tmp/ccRb36gU.s:3415: Warning: dwarf line number information for .data ignored
encrypt.c: /tmp/ccRb36gU.s:3416: Warning: dwarf line number information for .data ignored
encrypt.c: /tmp/ccRb36gU.s:3419: Warning: dwarf line number information for .data ignored
encrypt.c: /tmp/ccRb36gU.s:3422: Warning: dwarf line number information for .data ignored
encrypt.c: /tmp/ccRb36gU.s:3424: Warning: dwarf line number information for .data ignored
encrypt.c: /tmp/ccRb36gU.s:3426: Warning: dwarf line number information for .data ignored
encrypt.c: /tmp/ccRb36gU.s:3428: Warning: dwarf line number information for .data ignored
encrypt.c: /tmp/ccRb36gU.s:3431: Warning: dwarf line number information for .data ignored
encrypt.c: /tmp/ccRb36gU.s:3433: Warning: dwarf line number information for .data ignored
encrypt.c: ...
Number of similar (implementation,compiler) pairs: 1, namely:
| Implementation | Compiler |
| T:sse4 | gcc -march=native -mtune=native -O3 -fwrapv -fPIC -fPIE -gdwarf-4 -Wall (13.3.0) |
Compiler output
encrypt.c: /tmp/ccDVRuNX.s: Assembler messages:
encrypt.c: /tmp/ccDVRuNX.s:3375: Warning: dwarf line number information for .data ignored
encrypt.c: /tmp/ccDVRuNX.s:3377: Warning: dwarf line number information for .data ignored
encrypt.c: /tmp/ccDVRuNX.s:3381: Warning: dwarf line number information for .data ignored
encrypt.c: /tmp/ccDVRuNX.s:3382: Warning: dwarf line number information for .data ignored
encrypt.c: /tmp/ccDVRuNX.s:3383: Warning: dwarf line number information for .data ignored
encrypt.c: /tmp/ccDVRuNX.s:3386: Warning: dwarf line number information for .data ignored
encrypt.c: /tmp/ccDVRuNX.s:3387: Warning: dwarf line number information for .data ignored
encrypt.c: /tmp/ccDVRuNX.s:3393: Warning: dwarf line number information for .data ignored
encrypt.c: /tmp/ccDVRuNX.s:3396: Warning: dwarf line number information for .data ignored
encrypt.c: /tmp/ccDVRuNX.s:3408: Warning: dwarf line number information for .data ignored
encrypt.c: /tmp/ccDVRuNX.s:3410: Warning: dwarf line number information for .data ignored
encrypt.c: /tmp/ccDVRuNX.s:3416: Warning: dwarf line number information for .data ignored
encrypt.c: /tmp/ccDVRuNX.s:3419: Warning: dwarf line number information for .data ignored
encrypt.c: /tmp/ccDVRuNX.s:3422: Warning: dwarf line number information for .data ignored
encrypt.c: /tmp/ccDVRuNX.s:3423: Warning: dwarf line number information for .data ignored
encrypt.c: /tmp/ccDVRuNX.s:3424: Warning: dwarf line number information for .data ignored
encrypt.c: /tmp/ccDVRuNX.s:3428: Warning: dwarf line number information for .data ignored
encrypt.c: /tmp/ccDVRuNX.s:3429: Warning: dwarf line number information for .data ignored
encrypt.c: /tmp/ccDVRuNX.s:3435: Warning: dwarf line number information for .data ignored
encrypt.c: /tmp/ccDVRuNX.s:3438: Warning: dwarf line number information for .data ignored
encrypt.c: /tmp/ccDVRuNX.s:3441: Warning: dwarf line number information for .data ignored
encrypt.c: /tmp/ccDVRuNX.s:9974: Error: leb128 operand is an undefined symbol: .LVU20
encrypt.c: /tmp/ccDVRuNX.s:9975: Error: leb128 operand is an undefined symbol: .LVU20
encrypt.c: /tmp/ccDVRuNX.s:9993: Error: leb128 operand is an undefined symbol: .LVU19
encrypt.c: ...
Number of similar (implementation,compiler) pairs: 1, namely:
| Implementation | Compiler |
| T:sse4 | gcc -march=native -mtune=native -O -fwrapv -fPIC -fPIE -gdwarf-4 -Wall (13.3.0) |
Compiler output
encrypt.c: /tmp/ccry5ul5.s: Assembler messages:
encrypt.c: /tmp/ccry5ul5.s:3375: Warning: dwarf line number information for .data ignored
encrypt.c: /tmp/ccry5ul5.s:3377: Warning: dwarf line number information for .data ignored
encrypt.c: /tmp/ccry5ul5.s:3379: Warning: dwarf line number information for .data ignored
encrypt.c: /tmp/ccry5ul5.s:3380: Warning: dwarf line number information for .data ignored
encrypt.c: /tmp/ccry5ul5.s:3381: Warning: dwarf line number information for .data ignored
encrypt.c: /tmp/ccry5ul5.s:3384: Warning: dwarf line number information for .data ignored
encrypt.c: /tmp/ccry5ul5.s:3385: Warning: dwarf line number information for .data ignored
encrypt.c: /tmp/ccry5ul5.s:3388: Warning: dwarf line number information for .data ignored
encrypt.c: /tmp/ccry5ul5.s:3390: Warning: dwarf line number information for .data ignored
encrypt.c: /tmp/ccry5ul5.s:3393: Warning: dwarf line number information for .data ignored
encrypt.c: /tmp/ccry5ul5.s:3397: Warning: dwarf line number information for .data ignored
encrypt.c: /tmp/ccry5ul5.s:3400: Warning: dwarf line number information for .data ignored
encrypt.c: /tmp/ccry5ul5.s:3409: Warning: dwarf line number information for .data ignored
encrypt.c: /tmp/ccry5ul5.s:3411: Warning: dwarf line number information for .data ignored
encrypt.c: /tmp/ccry5ul5.s:3413: Warning: dwarf line number information for .data ignored
encrypt.c: /tmp/ccry5ul5.s:3414: Warning: dwarf line number information for .data ignored
encrypt.c: /tmp/ccry5ul5.s:3415: Warning: dwarf line number information for .data ignored
encrypt.c: /tmp/ccry5ul5.s:3418: Warning: dwarf line number information for .data ignored
encrypt.c: /tmp/ccry5ul5.s:3421: Warning: dwarf line number information for .data ignored
encrypt.c: /tmp/ccry5ul5.s:3425: Warning: dwarf line number information for .data ignored
encrypt.c: /tmp/ccry5ul5.s:3428: Warning: dwarf line number information for .data ignored
encrypt.c: /tmp/ccry5ul5.s:3431: Warning: dwarf line number information for .data ignored
encrypt.c: /tmp/ccry5ul5.s:3432: Warning: dwarf line number information for .data ignored
encrypt.c: /tmp/ccry5ul5.s:3435: Warning: dwarf line number information for .data ignored
encrypt.c: ...
Number of similar (implementation,compiler) pairs: 1, namely:
| Implementation | Compiler |
| T:sse4 | gcc -march=native -mtune=native -Os -fwrapv -fPIC -fPIE -gdwarf-4 -Wall (13.3.0) |
Namespace violations
omdsha512.o calc_L_i T
omdsha512.o double_block T
omdsha512.o final_masking_associated_data T
omdsha512.o final_masking_message T
omdsha512.o hash T
omdsha512.o increment_masking_associated_data T
omdsha512.o increment_masking_message T
omdsha512.o key_func T
omdsha512.o l2b T
omdsha512.o ntz T
omdsha512.o omdsha512_process T
omdsha512.o triple_block T
omdsha512.o xor_block T
sha512.o sha512_comp T
Number of similar (implementation,compiler) pairs: 9, namely:
| Implementation | Compiler |
| T:ref | clang -march=native -O2 -fwrapv -Qunused-arguments -fPIC -fPIE -gdwarf-4 -Wall (Ubuntu_Clang_18.1.3_(1ubuntu1)) |
| T:ref | clang -march=native -O3 -fwrapv -Qunused-arguments -fPIC -fPIE -gdwarf-4 -Wall (Ubuntu_Clang_18.1.3_(1ubuntu1)) |
| T:ref | clang -march=native -O -fwrapv -Qunused-arguments -fPIC -fPIE -gdwarf-4 -Wall (Ubuntu_Clang_18.1.3_(1ubuntu1)) |
| T:ref | clang -march=native -Os -fwrapv -Qunused-arguments -fPIC -fPIE -gdwarf-4 -Wall (Ubuntu_Clang_18.1.3_(1ubuntu1)) |
| T:ref | clang -mcpu=native -O3 -fwrapv -Qunused-arguments -fPIC -fPIE -gdwarf-4 -Wall (Ubuntu_Clang_18.1.3_(1ubuntu1)) |
| T:ref | gcc -march=native -mtune=native -O2 -fwrapv -fPIC -fPIE -gdwarf-4 -Wall (13.3.0) |
| T:ref | gcc -march=native -mtune=native -O3 -fwrapv -fPIC -fPIE -gdwarf-4 -Wall (13.3.0) |
| T:ref | gcc -march=native -mtune=native -O -fwrapv -fPIC -fPIE -gdwarf-4 -Wall (13.3.0) |
| T:ref | gcc -march=native -mtune=native -Os -fwrapv -fPIC -fPIE -gdwarf-4 -Wall (13.3.0) |