Test results for amd64, h2atom, crypto_aead/aes256gcmv1
[Page version: 20260919 18:54:16]
Measurements for amd64, h2atom, crypto_aead
Test results for amd64, h2atom, crypto_aead
Test results for crypto_aead/aes256gcmv1
Computer: h2atom
Microarchitecture: amd64; Bonnell (106ca)
Architecture: amd64
CPU ID: GenuineIntel-000106ca-bfe9fbff
SUPERCOP version: 20260330
Operation: crypto_aead
Primitive: aes256gcmv1
| Time | Object size | Test size | Implementation | Compiler | Benchmark date | SUPERCOP version |
| 453848 | 22252 6160 0 | 1810681 151568 11496 | T:cryptopp | clang++ -march=native -O -fwrapv -Qunused-arguments -fPIC -fPIE -gdwarf-4 -Wall | 20260517 | 20260330 |
| 455653 | 16240 4072 0 | 1781679 149824 11592 | T:cryptopp | g++ -march=native -mtune=native -Os -fwrapv -fPIC -fPIE -gdwarf-4 -Wall | 20260517 | 20260330 |
| 455910 | 37205 3040 0 | 1810486 148992 11624 | T:cryptopp | g++ -march=native -mtune=native -O -fwrapv -fPIC -fPIE -gdwarf-4 -Wall | 20260517 | 20260330 |
| 457903 | 14124 2456 0 | 1798509 149008 11496 | T:cryptopp | clang++ -march=native -Os -fwrapv -Qunused-arguments -fPIC -fPIE -gdwarf-4 -Wall | 20260517 | 20260330 |
| 458245 | 41027 3072 0 | 1817656 149024 11624 | T:cryptopp | g++ -march=native -mtune=native -O3 -fwrapv -fPIC -fPIE -gdwarf-4 -Wall | 20260517 | 20260330 |
| 458887 | 17867 3040 0 | 1801813 149008 11496 | T:cryptopp | clang++ -march=native -O2 -fwrapv -Qunused-arguments -fPIC -fPIE -gdwarf-4 -Wall | 20260517 | 20260330 |
| 713302 | 18637 3040 0 | 1803977 149008 11496 | T:cryptopp | clang++ -march=native -O3 -fwrapv -Qunused-arguments -fPIC -fPIE -gdwarf-4 -Wall | 20260517 | 20260330 |
| 753813 | 37986 3072 0 | 1812912 149024 11624 | T:cryptopp | g++ -march=native -mtune=native -O2 -fwrapv -fPIC -fPIE -gdwarf-4 -Wall | 20260517 | 20260330 |
| 9196881 | 3020 0 16 | 42020 1240 1640 | T:ref | clang -mcpu=native -O3 -fwrapv -Qunused-arguments -fPIC -fPIE -gdwarf-4 -Wall | 20260517 | 20260330 |
| 9603257 | 2688 0 16 | 41924 1240 1640 | T:ref | clang -march=native -O3 -fwrapv -Qunused-arguments -fPIC -fPIE -gdwarf-4 -Wall | 20260517 | 20260330 |
| 9604457 | 2688 0 16 | 40732 1240 1640 | T:ref | clang -march=native -O2 -fwrapv -Qunused-arguments -fPIC -fPIE -gdwarf-4 -Wall | 20260517 | 20260330 |
| 10529468 | 2401 0 16 | 40339 1224 1736 | T:ref | gcc -march=native -mtune=native -O2 -fwrapv -fPIC -fPIE -gdwarf-4 -Wall | 20260517 | 20260330 |
| 11464832 | 1734 0 16 | 37742 1232 1640 | T:ref | clang -march=native -Os -fwrapv -Qunused-arguments -fPIC -fPIE -gdwarf-4 -Wall | 20260517 | 20260330 |
| 13344474 | 4593 0 16 | 43611 1224 1736 | T:ref | gcc -march=native -mtune=native -O3 -fwrapv -fPIC -fPIE -gdwarf-4 -Wall | 20260517 | 20260330 |
| 42036100 | 1917 0 16 | 38460 1240 1640 | T:ref | clang -march=native -O -fwrapv -Qunused-arguments -fPIC -fPIE -gdwarf-4 -Wall | 20260517 | 20260330 |
| 54585039 | 1925 0 16 | 37185 1200 1704 | T:ref | gcc -march=native -mtune=native -Os -fwrapv -fPIC -fPIE -gdwarf-4 -Wall | 20260517 | 20260330 |
| 63030468 | 2169 0 16 | 39178 1216 1736 | T:ref | gcc -march=native -mtune=native -O -fwrapv -fPIC -fPIE -gdwarf-4 -Wall | 20260517 | 20260330 |
| 160279384 | 3020 0 16 | 39692 1240 1640 | ref | clang -mcpu=native -O3 -fwrapv -Qunused-arguments -fPIC -fPIE -gdwarf-4 -Wall | 20260517 | 20260330 |
| 160634288 | 2688 0 16 | 38404 1240 1640 | ref | clang -march=native -O2 -fwrapv -Qunused-arguments -fPIC -fPIE -gdwarf-4 -Wall | 20260517 | 20260330 |
| 160664745 | 2688 0 16 | 39596 1240 1640 | ref | clang -march=native -O3 -fwrapv -Qunused-arguments -fPIC -fPIE -gdwarf-4 -Wall | 20260517 | 20260330 |
| 161590109 | 2401 0 16 | 38011 1224 1736 | ref | gcc -march=native -mtune=native -O2 -fwrapv -fPIC -fPIE -gdwarf-4 -Wall | 20260517 | 20260330 |
| 162536004 | 1734 0 16 | 35414 1232 1640 | ref | clang -march=native -Os -fwrapv -Qunused-arguments -fPIC -fPIE -gdwarf-4 -Wall | 20260517 | 20260330 |
| 164399797 | 4593 0 16 | 41283 1224 1736 | ref | gcc -march=native -mtune=native -O3 -fwrapv -fPIC -fPIE -gdwarf-4 -Wall | 20260517 | 20260330 |
| 193105057 | 1917 0 16 | 36132 1240 1640 | ref | clang -march=native -O -fwrapv -Qunused-arguments -fPIC -fPIE -gdwarf-4 -Wall | 20260517 | 20260330 |
| 205636794 | 1925 0 16 | 34865 1200 1704 | ref | gcc -march=native -mtune=native -Os -fwrapv -fPIC -fPIE -gdwarf-4 -Wall | 20260517 | 20260330 |
| 214099038 | 2169 0 16 | 36858 1216 1736 | ref | gcc -march=native -mtune=native -O -fwrapv -fPIC -fPIE -gdwarf-4 -Wall | 20260517 | 20260330 |
Compiler output
try.cpp: In file included from try-anything.cpp:22:
try.cpp: .../supercop-data/h2atom/amd64/include/stq.h:32:13: warning: unused function 'stq_sort' [-Wunused-function]
try.cpp: 32 | static void stq_sort(stq_doublearray S,long long n)
try.cpp: | ^~~~~~~~
try.cpp: 1 warning generated.
try.cpp: In file included from try-anything.cpp:22:
try.cpp: .../supercop-data/h2atom/amd64/include/stq.h:32:13: warning: unused function 'stq_sort' [-Wunused-function]
try.cpp: 32 | static void stq_sort(stq_doublearray S,long long n)
try.cpp: | ^~~~~~~~
try.cpp: 1 warning generated.
measure.cpp: In file included from measure-anything.cpp:19:
measure.cpp: .../supercop-data/h2atom/amd64/include/stq.h:32:13: warning: unused function 'stq_sort' [-Wunused-function]
measure.cpp: 32 | static void stq_sort(stq_doublearray S,long long n)
measure.cpp: | ^~~~~~~~
measure.cpp: 1 warning generated.
Number of similar (implementation,compiler) pairs: 4, namely:
| Implementation | Compiler |
| T:cryptopp | clang++ -march=native -O2 -fwrapv -Qunused-arguments -fPIC -fPIE -gdwarf-4 -Wall (Ubuntu_Clang_18.1.3_(1ubuntu1)) |
| T:cryptopp | clang++ -march=native -O3 -fwrapv -Qunused-arguments -fPIC -fPIE -gdwarf-4 -Wall (Ubuntu_Clang_18.1.3_(1ubuntu1)) |
| T:cryptopp | clang++ -march=native -O -fwrapv -Qunused-arguments -fPIC -fPIE -gdwarf-4 -Wall (Ubuntu_Clang_18.1.3_(1ubuntu1)) |
| T:cryptopp | clang++ -march=native -Os -fwrapv -Qunused-arguments -fPIC -fPIE -gdwarf-4 -Wall (Ubuntu_Clang_18.1.3_(1ubuntu1)) |
Compiler output
try.cpp: In file included from try-anything.cpp:22:
try.cpp: .../supercop-data/h2atom/amd64/include/stq.h:32:13: warning: 'void stq_sort(std::vector<double>, long long int)' defined but not used [-Wunused-function]
try.cpp: 32 | static void stq_sort(stq_doublearray S,long long n)
try.cpp: | ^~~~~~~~
try.cpp: In file included from try-anything.cpp:22:
try.cpp: .../supercop-data/h2atom/amd64/include/stq.h:32:13: warning: 'void stq_sort(std::vector<double>, long long int)' defined but not used [-Wunused-function]
try.cpp: 32 | static void stq_sort(stq_doublearray S,long long n)
try.cpp: | ^~~~~~~~
measure.cpp: In file included from measure-anything.cpp:19:
measure.cpp: .../supercop-data/h2atom/amd64/include/stq.h:32:13: warning: 'void stq_sort(std::vector<double>, long long int)' defined but not used [-Wunused-function]
measure.cpp: 32 | static void stq_sort(stq_doublearray S,long long n)
measure.cpp: | ^~~~~~~~
Number of similar (implementation,compiler) pairs: 4, namely:
| Implementation | Compiler |
| T:cryptopp | g++ -march=native -mtune=native -O2 -fwrapv -fPIC -fPIE -gdwarf-4 -Wall (13.3.0) |
| T:cryptopp | g++ -march=native -mtune=native -O3 -fwrapv -fPIC -fPIE -gdwarf-4 -Wall (13.3.0) |
| T:cryptopp | g++ -march=native -mtune=native -O -fwrapv -fPIC -fPIE -gdwarf-4 -Wall (13.3.0) |
| T:cryptopp | g++ -march=native -mtune=native -Os -fwrapv -fPIC -fPIE -gdwarf-4 -Wall (13.3.0) |
Compiler output
aesenc-int.c: aesenc-int.c:270:17: warning: unused variable 'rev' [-Wunused-variable]
aesenc-int.c: 270 | const __m128i rev = _mm_set_epi8(0,1,2,3,4,5,6,7,8,9,10,11,12,13,14,15);
aesenc-int.c: | ^~~
aesenc-int.c: aesenc-int.c:364:15: warning: unused variable 'tmplo' [-Wunused-variable]
aesenc-int.c: 364 | __m128i lo, tmplo, hi, tmphi;
aesenc-int.c: | ^~~~~
aesenc-int.c: aesenc-int.c:364:26: warning: unused variable 'tmphi' [-Wunused-variable]
aesenc-int.c: 364 | __m128i lo, tmplo, hi, tmphi;
aesenc-int.c: | ^~~~~
aesenc-int.c: aesenc-int.c:468:15: warning: unused variable 'tmplo' [-Wunused-variable]
aesenc-int.c: 468 | __m128i lo, tmplo, hi, tmphi;
aesenc-int.c: | ^~~~~
aesenc-int.c: aesenc-int.c:468:26: warning: unused variable 'tmphi' [-Wunused-variable]
aesenc-int.c: 468 | __m128i lo, tmplo, hi, tmphi;
aesenc-int.c: | ^~~~~
aesenc-int.c: aesenc-int.c:161:20: warning: unused function 'inc' [-Wunused-function]
aesenc-int.c: 161 | static inline void inc(unsigned char *n) {
aesenc-int.c: | ^~~
aesenc-int.c: aesenc-int.c:184:1: warning: unused function 'aesni_encrypt2' [-Wunused-function]
aesenc-int.c: 184 | FUNC(2, MAKE2)
aesenc-int.c: | ^~~~~~~~~~~~~~
aesenc-int.c: aesenc-int.c:171:22: note: expanded from macro 'FUNC'
aesenc-int.c: 171 | static inline void aesni_encrypt##N(unsigned char *out, unsigned int *n, const __m128i rkeys[16]) { \
aesenc-int.c: | ^~~~~~~~~~~~~~~~
aesenc-int.c: <scratch space>:204:1: note: expanded from here
aesenc-int.c: ...
Number of similar (implementation,compiler) pairs: 4, namely:
| Implementation | Compiler |
| dolbeau/aesenc-int | clang -march=native -O2 -fwrapv -Qunused-arguments -fPIC -fPIE -gdwarf-4 -Wall (Ubuntu_Clang_18.1.3_(1ubuntu1)) |
| dolbeau/aesenc-int | clang -march=native -O3 -fwrapv -Qunused-arguments -fPIC -fPIE -gdwarf-4 -Wall (Ubuntu_Clang_18.1.3_(1ubuntu1)) |
| dolbeau/aesenc-int | clang -march=native -O -fwrapv -Qunused-arguments -fPIC -fPIE -gdwarf-4 -Wall (Ubuntu_Clang_18.1.3_(1ubuntu1)) |
| dolbeau/aesenc-int | clang -march=native -Os -fwrapv -Qunused-arguments -fPIC -fPIE -gdwarf-4 -Wall (Ubuntu_Clang_18.1.3_(1ubuntu1)) |
Compiler output
aesenc-int.c: aesenc-int.c:270:17: warning: unused variable 'rev' [-Wunused-variable]
aesenc-int.c: 270 | const __m128i rev = _mm_set_epi8(0,1,2,3,4,5,6,7,8,9,10,11,12,13,14,15);
aesenc-int.c: | ^~~
aesenc-int.c: aesenc-int.c:364:15: warning: unused variable 'tmplo' [-Wunused-variable]
aesenc-int.c: 364 | __m128i lo, tmplo, hi, tmphi;
aesenc-int.c: | ^~~~~
aesenc-int.c: aesenc-int.c:364:26: warning: unused variable 'tmphi' [-Wunused-variable]
aesenc-int.c: 364 | __m128i lo, tmplo, hi, tmphi;
aesenc-int.c: | ^~~~~
aesenc-int.c: aesenc-int.c:468:15: warning: unused variable 'tmplo' [-Wunused-variable]
aesenc-int.c: 468 | __m128i lo, tmplo, hi, tmphi;
aesenc-int.c: | ^~~~~
aesenc-int.c: aesenc-int.c:468:26: warning: unused variable 'tmphi' [-Wunused-variable]
aesenc-int.c: 468 | __m128i lo, tmplo, hi, tmphi;
aesenc-int.c: | ^~~~~
aesenc-int.c: aesenc-int.c:665:16: error: always_inline function '_mm_shuffle_epi8' requires target feature 'ssse3', but would be inlined into function 'crypto_aead_aes256gcmv1_dolbeau_aesenc_int_constbranchindex_encrypt' that is compiled without support for 'ssse3'
aesenc-int.c: 665 | __m128i Hv = _mm_shuffle_epi8(_mm_loadu_si128((const __m128i*)H), rev);
aesenc-int.c: | ^
aesenc-int.c: 5 warnings and 1 error generated.
Number of similar (implementation,compiler) pairs: 1, namely:
| Implementation | Compiler |
| dolbeau/aesenc-int | clang -mcpu=native -O3 -fwrapv -Qunused-arguments -fPIC -fPIE -gdwarf-4 -Wall (Ubuntu_Clang_18.1.3_(1ubuntu1)) |
Compiler output
aesenc-int.c: aesenc-int.c:25: warning: "_bswap64" redefined
aesenc-int.c: 25 | #define _bswap64(a) __builtin_bswap64(a)
aesenc-int.c: |
aesenc-int.c: In file included from /usr/lib/gcc/x86_64-linux-gnu/13/include/x86gprintrin.h:33,
aesenc-int.c: from /usr/lib/gcc/x86_64-linux-gnu/13/include/immintrin.h:27,
aesenc-int.c: from aesenc-int.c:11:
aesenc-int.c: /usr/lib/gcc/x86_64-linux-gnu/13/include/ia32intrin.h:273: note: this is the location of the previous definition
aesenc-int.c: 273 | #define _bswap64(a) __bswapq(a)
aesenc-int.c: |
aesenc-int.c: aesenc-int.c:26: warning: "_bswap" redefined
aesenc-int.c: 26 | #define _bswap(a) __builtin_bswap32(a)
aesenc-int.c: |
aesenc-int.c: /usr/lib/gcc/x86_64-linux-gnu/13/include/ia32intrin.h:307: note: this is the location of the previous definition
aesenc-int.c: 307 | #define _bswap(a) __bswapd(a)
aesenc-int.c: |
aesenc-int.c: aesenc-int.c: In function 'aesni_encrypt1':
aesenc-int.c: aesenc-int.c:98: warning: ignoring '#pragma unroll ' [-Wunknown-pragmas]
aesenc-int.c: 98 | #pragma unroll(13)
aesenc-int.c: |
aesenc-int.c: aesenc-int.c: In function 'addmul':
aesenc-int.c: aesenc-int.c:217:64: warning: suggest parentheses around arithmetic in operand of '^' [-Wparentheses]
aesenc-int.c: 217 | unsigned long long mask = -1ull ^ (1ull<<(((16-xlen)%8)*8))-1ull;
aesenc-int.c: | ~~~~~~~~~~~~~~~~~~~~~~~~~^~~~~
aesenc-int.c: aesenc-int.c: In function 'mulv':
aesenc-int.c: aesenc-int.c:270:17: warning: unused variable 'rev' [-Wunused-variable]
aesenc-int.c: ...
Number of similar (implementation,compiler) pairs: 4, namely:
| Implementation | Compiler |
| dolbeau/aesenc-int | gcc -march=native -mtune=native -O2 -fwrapv -fPIC -fPIE -gdwarf-4 -Wall (13.3.0) |
| dolbeau/aesenc-int | gcc -march=native -mtune=native -O3 -fwrapv -fPIC -fPIE -gdwarf-4 -Wall (13.3.0) |
| dolbeau/aesenc-int | gcc -march=native -mtune=native -O -fwrapv -fPIC -fPIE -gdwarf-4 -Wall (13.3.0) |
| dolbeau/aesenc-int | gcc -march=native -mtune=native -Os -fwrapv -fPIC -fPIE -gdwarf-4 -Wall (13.3.0) |
Compiler output
vaesenc-int.c: vaesenc-int.c:16:2: error: "This code requires AVX enabled in the compiler."
vaesenc-int.c: 16 | #error "This code requires AVX enabled in the compiler."
vaesenc-int.c: | ^
vaesenc-int.c: vaesenc-int.c:20:2: error: "This code requires VAES enabled in the compiler."
vaesenc-int.c: 20 | #error "This code requires VAES enabled in the compiler."
vaesenc-int.c: | ^
vaesenc-int.c: vaesenc-int.c:403:17: warning: unused variable 'rev' [-Wunused-variable]
vaesenc-int.c: 403 | const __m128i rev = _mm_set_epi8(0,1,2,3,4,5,6,7,8,9,10,11,12,13,14,15);
vaesenc-int.c: | ^~~
vaesenc-int.c: vaesenc-int.c:446:17: warning: unused variable 'rev' [-Wunused-variable]
vaesenc-int.c: 446 | const __m256i rev = _mm256_broadcastsi128_si256(_mm_set_epi8(0,1,2,3,4,5,6,7,8,9,10,11,12,13,14,15));
vaesenc-int.c: | ^~~
vaesenc-int.c: vaesenc-int.c:679:15: warning: unused variable 'tmplo' [-Wunused-variable]
vaesenc-int.c: 679 | __m128i lo, tmplo, hi, tmphi;
vaesenc-int.c: | ^~~~~
vaesenc-int.c: vaesenc-int.c:679:26: warning: unused variable 'tmphi' [-Wunused-variable]
vaesenc-int.c: 679 | __m128i lo, tmplo, hi, tmphi;
vaesenc-int.c: | ^~~~~
vaesenc-int.c: vaesenc-int.c:698:24: warning: unused variable 'tmp1' [-Wunused-variable]
vaesenc-int.c: 698 | __m128i tmp0, tmp0B, tmp1, tmp1B, tmp2, tmp2B, tmp3, tmp3B;
vaesenc-int.c: | ^~~~
vaesenc-int.c: vaesenc-int.c:1237:22: warning: unused variable 'mlen_rnd256' [-Wunused-variable]
vaesenc-int.c: 1237 | unsigned long long mlen_rnd256 = mlen & ~255ull;
vaesenc-int.c: | ^~~~~~~~~~~
vaesenc-int.c: vaesenc-int.c:1449:22: warning: unused variable 'mlen_rnd256' [-Wunused-variable]
vaesenc-int.c: ...
Number of similar (implementation,compiler) pairs: 5, namely:
| Implementation | Compiler |
| dolbeau/vaesenc-int | clang -march=native -O2 -fwrapv -Qunused-arguments -fPIC -fPIE -gdwarf-4 -Wall (Ubuntu_Clang_18.1.3_(1ubuntu1)) |
| dolbeau/vaesenc-int | clang -march=native -O3 -fwrapv -Qunused-arguments -fPIC -fPIE -gdwarf-4 -Wall (Ubuntu_Clang_18.1.3_(1ubuntu1)) |
| dolbeau/vaesenc-int | clang -march=native -O -fwrapv -Qunused-arguments -fPIC -fPIE -gdwarf-4 -Wall (Ubuntu_Clang_18.1.3_(1ubuntu1)) |
| dolbeau/vaesenc-int | clang -march=native -Os -fwrapv -Qunused-arguments -fPIC -fPIE -gdwarf-4 -Wall (Ubuntu_Clang_18.1.3_(1ubuntu1)) |
| dolbeau/vaesenc-int | clang -mcpu=native -O3 -fwrapv -Qunused-arguments -fPIC -fPIE -gdwarf-4 -Wall (Ubuntu_Clang_18.1.3_(1ubuntu1)) |
Compiler output
vaesenc-int.c: vaesenc-int.c:16:2: error: #error "This code requires AVX enabled in the compiler."
vaesenc-int.c: 16 | #error "This code requires AVX enabled in the compiler."
vaesenc-int.c: | ^~~~~
vaesenc-int.c: vaesenc-int.c:20:2: error: #error "This code requires VAES enabled in the compiler."
vaesenc-int.c: 20 | #error "This code requires VAES enabled in the compiler."
vaesenc-int.c: | ^~~~~
vaesenc-int.c: vaesenc-int.c: In function 'aesni_encrypt1':
vaesenc-int.c: vaesenc-int.c:139: warning: ignoring '#pragma unroll ' [-Wunknown-pragmas]
vaesenc-int.c: 139 | #pragma unroll(13)
vaesenc-int.c: |
vaesenc-int.c: vaesenc-int.c: In function 'aesni_encryptv2':
vaesenc-int.c: vaesenc-int.c:316: warning: ignoring '#pragma unroll ' [-Wunknown-pragmas]
vaesenc-int.c: 316 | #pragma unroll(13)
vaesenc-int.c: |
vaesenc-int.c: vaesenc-int.c: In function 'addmul':
vaesenc-int.c: vaesenc-int.c:350:64: warning: suggest parentheses around arithmetic in operand of '^' [-Wparentheses]
vaesenc-int.c: 350 | unsigned long long mask = -1ull ^ (1ull<<(((16-xlen)%8)*8))-1ull;
vaesenc-int.c: | ~~~~~~~~~~~~~~~~~~~~~~~~~^~~~~
vaesenc-int.c: vaesenc-int.c: In function 'mulv':
vaesenc-int.c: vaesenc-int.c:403:17: warning: unused variable 'rev' [-Wunused-variable]
vaesenc-int.c: 403 | const __m128i rev = _mm_set_epi8(0,1,2,3,4,5,6,7,8,9,10,11,12,13,14,15);
vaesenc-int.c: | ^~~
vaesenc-int.c: vaesenc-int.c: In function 'mulvv2':
vaesenc-int.c: vaesenc-int.c:445:30: warning: AVX vector return without AVX enabled changes the ABI [-Wpsabi]
vaesenc-int.c: 445 | __m256i B) {
vaesenc-int.c: ...
Number of similar (implementation,compiler) pairs: 4, namely:
| Implementation | Compiler |
| dolbeau/vaesenc-int | gcc -march=native -mtune=native -O2 -fwrapv -fPIC -fPIE -gdwarf-4 -Wall (13.3.0) |
| dolbeau/vaesenc-int | gcc -march=native -mtune=native -O3 -fwrapv -fPIC -fPIE -gdwarf-4 -Wall (13.3.0) |
| dolbeau/vaesenc-int | gcc -march=native -mtune=native -O -fwrapv -fPIC -fPIE -gdwarf-4 -Wall (13.3.0) |
| dolbeau/vaesenc-int | gcc -march=native -mtune=native -Os -fwrapv -fPIC -fPIE -gdwarf-4 -Wall (13.3.0) |
Compiler output
decrypt.c: decrypt.c:1:10: fatal error: 'openssl/evp.h' file not found
decrypt.c: 1 | #include <openssl/evp.h>
decrypt.c: | ^~~~~~~~~~~~~~~
decrypt.c: 1 error generated.
Number of similar (implementation,compiler) pairs: 10, namely:
| Implementation | Compiler |
| T:openssl | clang -march=native -O2 -fwrapv -Qunused-arguments -fPIC -fPIE -gdwarf-4 -Wall (Ubuntu_Clang_18.1.3_(1ubuntu1)) |
| T:openssl | clang -march=native -O3 -fwrapv -Qunused-arguments -fPIC -fPIE -gdwarf-4 -Wall (Ubuntu_Clang_18.1.3_(1ubuntu1)) |
| T:openssl | clang -march=native -O -fwrapv -Qunused-arguments -fPIC -fPIE -gdwarf-4 -Wall (Ubuntu_Clang_18.1.3_(1ubuntu1)) |
| T:openssl | clang -march=native -Os -fwrapv -Qunused-arguments -fPIC -fPIE -gdwarf-4 -Wall (Ubuntu_Clang_18.1.3_(1ubuntu1)) |
| T:openssl | clang -mcpu=native -O3 -fwrapv -Qunused-arguments -fPIC -fPIE -gdwarf-4 -Wall (Ubuntu_Clang_18.1.3_(1ubuntu1)) |
| T:opensslnew | clang -march=native -O2 -fwrapv -Qunused-arguments -fPIC -fPIE -gdwarf-4 -Wall (Ubuntu_Clang_18.1.3_(1ubuntu1)) |
| T:opensslnew | clang -march=native -O3 -fwrapv -Qunused-arguments -fPIC -fPIE -gdwarf-4 -Wall (Ubuntu_Clang_18.1.3_(1ubuntu1)) |
| T:opensslnew | clang -march=native -O -fwrapv -Qunused-arguments -fPIC -fPIE -gdwarf-4 -Wall (Ubuntu_Clang_18.1.3_(1ubuntu1)) |
| T:opensslnew | clang -march=native -Os -fwrapv -Qunused-arguments -fPIC -fPIE -gdwarf-4 -Wall (Ubuntu_Clang_18.1.3_(1ubuntu1)) |
| T:opensslnew | clang -mcpu=native -O3 -fwrapv -Qunused-arguments -fPIC -fPIE -gdwarf-4 -Wall (Ubuntu_Clang_18.1.3_(1ubuntu1)) |
Compiler output
decrypt.c: decrypt.c:1:10: fatal error: openssl/evp.h: No such file or directory
decrypt.c: 1 | #include <openssl/evp.h>
decrypt.c: | ^~~~~~~~~~~~~~~
decrypt.c: compilation terminated.
Number of similar (implementation,compiler) pairs: 8, namely:
| Implementation | Compiler |
| T:openssl | gcc -march=native -mtune=native -O2 -fwrapv -fPIC -fPIE -gdwarf-4 -Wall (13.3.0) |
| T:openssl | gcc -march=native -mtune=native -O3 -fwrapv -fPIC -fPIE -gdwarf-4 -Wall (13.3.0) |
| T:openssl | gcc -march=native -mtune=native -O -fwrapv -fPIC -fPIE -gdwarf-4 -Wall (13.3.0) |
| T:openssl | gcc -march=native -mtune=native -Os -fwrapv -fPIC -fPIE -gdwarf-4 -Wall (13.3.0) |
| T:opensslnew | gcc -march=native -mtune=native -O2 -fwrapv -fPIC -fPIE -gdwarf-4 -Wall (13.3.0) |
| T:opensslnew | gcc -march=native -mtune=native -O3 -fwrapv -fPIC -fPIE -gdwarf-4 -Wall (13.3.0) |
| T:opensslnew | gcc -march=native -mtune=native -O -fwrapv -fPIC -fPIE -gdwarf-4 -Wall (13.3.0) |
| T:opensslnew | gcc -march=native -mtune=native -Os -fwrapv -fPIC -fPIE -gdwarf-4 -Wall (13.3.0) |
TIMECOP error (can be valgrind bug)
error 124
Number of similar (implementation,compiler) pairs: 9, namely:
| Implementation | Compiler |
| ref | clang -march=native -O2 -fwrapv -Qunused-arguments -fPIC -fPIE -gdwarf-4 -Wall (Ubuntu_Clang_18.1.3_(1ubuntu1)) |
| ref | clang -march=native -O3 -fwrapv -Qunused-arguments -fPIC -fPIE -gdwarf-4 -Wall (Ubuntu_Clang_18.1.3_(1ubuntu1)) |
| ref | clang -march=native -O -fwrapv -Qunused-arguments -fPIC -fPIE -gdwarf-4 -Wall (Ubuntu_Clang_18.1.3_(1ubuntu1)) |
| ref | clang -march=native -Os -fwrapv -Qunused-arguments -fPIC -fPIE -gdwarf-4 -Wall (Ubuntu_Clang_18.1.3_(1ubuntu1)) |
| ref | clang -mcpu=native -O3 -fwrapv -Qunused-arguments -fPIC -fPIE -gdwarf-4 -Wall (Ubuntu_Clang_18.1.3_(1ubuntu1)) |
| ref | gcc -march=native -mtune=native -O2 -fwrapv -fPIC -fPIE -gdwarf-4 -Wall (13.3.0) |
| ref | gcc -march=native -mtune=native -O3 -fwrapv -fPIC -fPIE -gdwarf-4 -Wall (13.3.0) |
| ref | gcc -march=native -mtune=native -O -fwrapv -fPIC -fPIE -gdwarf-4 -Wall (13.3.0) |
| ref | gcc -march=native -mtune=native -Os -fwrapv -fPIC -fPIE -gdwarf-4 -Wall (13.3.0) |