Implementation notes: amd64, gcc14, crypto_stream/aes128ctr

Computer: gcc14
Architecture: amd64
CPU ID: GenuineIntel-00010676-bfebfbff
SUPERCOP version: 20211108
Operation: crypto_stream
Primitive: aes128ctr
TimeObject sizeTest sizeImplementationCompilerBenchmark dateSUPERCOP version
13308619 0 016909 900 1000T:opensslgcc_-march=native_-mtune=native_-O3_-fomit-frame-pointer_-fwrapv_-fPIC_-fPIE2021011420210114
13310360 0 013168 876 968T:opensslgcc_-march=native_-mtune=native_-Os_-fomit-frame-pointer_-fwrapv_-fPIC_-fPIE2021011420210114
13314394 0 014478 876 968T:opensslclang_-march=native_-O_-fomit-frame-pointer_-fwrapv_-Qunused-arguments_-fPIC_-fPIE2021011420210114
13319394 0 015414 876 968T:opensslclang_-march=native_-O3_-fomit-frame-pointer_-fwrapv_-Qunused-arguments_-fPIC_-fPIE2021011420210114
13322394 0 015254 876 968T:opensslclang_-mcpu=native_-O3_-fomit-frame-pointer_-fwrapv_-Qunused-arguments_-fPIC_-fPIE2021011420210114
13325452 0 014469 900 1000T:opensslgcc_-march=native_-mtune=native_-O_-fomit-frame-pointer_-fwrapv_-fPIC_-fPIE2021011420210114
13335389 0 013328 868 968T:opensslclang_-march=native_-Os_-fomit-frame-pointer_-fwrapv_-Qunused-arguments_-fPIC_-fPIE2021011420210114
13341394 0 014478 876 968T:opensslclang_-march=native_-O2_-fomit-frame-pointer_-fwrapv_-Qunused-arguments_-fPIC_-fPIE2021011420210114
13342456 0 014821 900 1000T:opensslgcc_-march=native_-mtune=native_-O2_-fomit-frame-pointer_-fwrapv_-fPIC_-fPIE2021011420210114
2205713120 2800 01499148 145772 10480T:cryptoppg++_-march=native_-mtune=native_-O3_-fomit-frame-pointer_-fwrapv_-fPIC_-fPIE2021032420210323
222388336 3272 01495169 146852 10448T:cryptoppg++_-march=native_-mtune=native_-Os_-fomit-frame-pointer_-fwrapv_-fPIC_-fPIE2021032420210323
2235613051 2800 01497184 145772 10480T:cryptoppg++_-march=native_-mtune=native_-O2_-fomit-frame-pointer_-fwrapv_-fPIC_-fPIE2021032420210323
2237912628 2800 01496009 145780 10480T:cryptoppg++_-march=native_-mtune=native_-O_-fomit-frame-pointer_-fwrapv_-fPIC_-fPIE2021032420210323

Compiler output

Implementation: T:cryptopp
Security model: timingleaks
Compiler: clang++ -march=native -O2 -fomit-frame-pointer -fwrapv -Qunused-arguments -fPIC -fPIE
try.cpp: libcrypto_stream_aes128ctr.a(stream.o):(.data.rel.ro._ZTVN8CryptoPP16BlockCipherFinalILNS_9CipherDirE0ENS_8Rijndael3EncEEE[_ZTVN8CryptoPP16BlockCipherFinalILNS_9CipherDirE0ENS_8Rijndael3EncEEE]+0x100): undefined reference to `non-virtual thunk to CryptoPP::Rijndael::Base::AlgorithmProvider[abi:cxx11]() const'
try.cpp: clang: error: linker command failed with exit code 1 (use -v to see invocation)

Number of similar (compiler,implementation) pairs: 4, namely:
CompilerImplementations
clang++ -march=native -O2 -fomit-frame-pointer -fwrapv -Qunused-arguments -fPIC -fPIE T:cryptopp
clang++ -march=native -O3 -fomit-frame-pointer -fwrapv -Qunused-arguments -fPIC -fPIE T:cryptopp
clang++ -march=native -O -fomit-frame-pointer -fwrapv -Qunused-arguments -fPIC -fPIE T:cryptopp
clang++ -march=native -Os -fomit-frame-pointer -fwrapv -Qunused-arguments -fPIC -fPIE T:cryptopp

Compiler output

Implementation: T:dolbeau/aesenc-int
Security model: timingleaks
Compiler: clang -march=native -O2 -fomit-frame-pointer -fwrapv -Qunused-arguments -fPIC -fPIE
aesenc-int.c: aesenc-int.c:45:3: error: '__builtin_ia32_aeskeygenassist128' needs target feature aes
aesenc-int.c: BLOCK1(0x01);
aesenc-int.c: ^
aesenc-int.c: aesenc-int.c:36:11: note: expanded from macro 'BLOCK1'
aesenc-int.c: temp1 = _mm_aeskeygenassist_si128(temp0, IMM); \
aesenc-int.c: ^
aesenc-int.c: /usr/lib/llvm-3.8/bin/../lib/clang/3.8.1/include/__wmmintrin_aes.h:62:12: note: expanded from macro '_mm_aeskeygenassist_si128'
aesenc-int.c: (__m128i)__builtin_ia32_aeskeygenassist128((__v2di)(__m128i)(C), (int)(R))
aesenc-int.c: ^
aesenc-int.c: aesenc-int.c:46:3: error: '__builtin_ia32_aeskeygenassist128' needs target feature aes
aesenc-int.c: BLOCK1(0x02);
aesenc-int.c: ^
aesenc-int.c: aesenc-int.c:36:11: note: expanded from macro 'BLOCK1'
aesenc-int.c: temp1 = _mm_aeskeygenassist_si128(temp0, IMM); \
aesenc-int.c: ^
aesenc-int.c: /usr/lib/llvm-3.8/bin/../lib/clang/3.8.1/include/__wmmintrin_aes.h:62:12: note: expanded from macro '_mm_aeskeygenassist_si128'
aesenc-int.c: (__m128i)__builtin_ia32_aeskeygenassist128((__v2di)(__m128i)(C), (int)(R))
aesenc-int.c: ^
aesenc-int.c: aesenc-int.c:47:3: error: '__builtin_ia32_aeskeygenassist128' needs target feature aes
aesenc-int.c: BLOCK1(0x04);
aesenc-int.c: ^
aesenc-int.c: aesenc-int.c:36:11: note: expanded from macro 'BLOCK1'
aesenc-int.c: temp1 = _mm_aeskeygenassist_si128(temp0, IMM); \
aesenc-int.c: ^
aesenc-int.c: /usr/lib/llvm-3.8/bin/../lib/clang/3.8.1/include/__wmmintrin_aes.h:62:12: note: expanded from macro '_mm_aeskeygenassist_si128'
aesenc-int.c: ...

Number of similar (compiler,implementation) pairs: 5, namely:
CompilerImplementations
clang -march=native -O2 -fomit-frame-pointer -fwrapv -Qunused-arguments -fPIC -fPIE T:dolbeau/aesenc-int
clang -march=native -O3 -fomit-frame-pointer -fwrapv -Qunused-arguments -fPIC -fPIE T:dolbeau/aesenc-int
clang -march=native -O -fomit-frame-pointer -fwrapv -Qunused-arguments -fPIC -fPIE T:dolbeau/aesenc-int
clang -march=native -Os -fomit-frame-pointer -fwrapv -Qunused-arguments -fPIC -fPIE T:dolbeau/aesenc-int
clang -mcpu=native -O3 -fomit-frame-pointer -fwrapv -Qunused-arguments -fPIC -fPIE T:dolbeau/aesenc-int

Compiler output

Implementation: T:dolbeau/aesenc-int
Security model: timingleaks
Compiler: gcc -march=native -mtune=native -O2 -fomit-frame-pointer -fwrapv -fPIC -fPIE
aesenc-int.c: In file included from /usr/lib/gcc/x86_64-linux-gnu/6/include/immintrin.h:39:0,
aesenc-int.c: from aesenc-int.c:12:
aesenc-int.c: aesenc-int.c: In function 'aesni_key128_expand':
aesenc-int.c: /usr/lib/gcc/x86_64-linux-gnu/6/include/wmmintrin.h:87:1: error: inlining failed in call to always_inline '_mm_aeskeygenassist_si128': target specific option mismatch
aesenc-int.c: _mm_aeskeygenassist_si128 (__m128i __X, const int __C)
aesenc-int.c: ^~~~~~~~~~~~~~~~~~~~~~~~~
aesenc-int.c: aesenc-int.c:36:9: note: called from here
aesenc-int.c: temp1 = _mm_aeskeygenassist_si128(temp0, IMM); \
aesenc-int.c: ~~~~~~^~~~~~~~~~~~~~~~~~~~~~~~~~~~~~~~~~~~~~~
aesenc-int.c: aesenc-int.c:54:3: note: in expansion of macro 'BLOCK1'
aesenc-int.c: BLOCK1(0x36);
aesenc-int.c: ^~~~~~
aesenc-int.c: In file included from /usr/lib/gcc/x86_64-linux-gnu/6/include/immintrin.h:39:0,
aesenc-int.c: from aesenc-int.c:12:
aesenc-int.c: /usr/lib/gcc/x86_64-linux-gnu/6/include/wmmintrin.h:87:1: error: inlining failed in call to always_inline '_mm_aeskeygenassist_si128': target specific option mismatch
aesenc-int.c: _mm_aeskeygenassist_si128 (__m128i __X, const int __C)
aesenc-int.c: ^~~~~~~~~~~~~~~~~~~~~~~~~
aesenc-int.c: aesenc-int.c:36:9: note: called from here
aesenc-int.c: temp1 = _mm_aeskeygenassist_si128(temp0, IMM); \
aesenc-int.c: ~~~~~~^~~~~~~~~~~~~~~~~~~~~~~~~~~~~~~~~~~~~~~
aesenc-int.c: aesenc-int.c:53:3: note: in expansion of macro 'BLOCK1'
aesenc-int.c: BLOCK1(0x1b);
aesenc-int.c: ^~~~~~
aesenc-int.c: In file included from /usr/lib/gcc/x86_64-linux-gnu/6/include/immintrin.h:39:0,
aesenc-int.c: from aesenc-int.c:12:
aesenc-int.c: ...

Number of similar (compiler,implementation) pairs: 4, namely:
CompilerImplementations
gcc -march=native -mtune=native -O2 -fomit-frame-pointer -fwrapv -fPIC -fPIE T:dolbeau/aesenc-int
gcc -march=native -mtune=native -O3 -fomit-frame-pointer -fwrapv -fPIC -fPIE T:dolbeau/aesenc-int
gcc -march=native -mtune=native -O -fomit-frame-pointer -fwrapv -fPIC -fPIE T:dolbeau/aesenc-int
gcc -march=native -mtune=native -Os -fomit-frame-pointer -fwrapv -fPIC -fPIE T:dolbeau/aesenc-int