Implementation notes: amd64, gcc14, crypto_hash/luffa384

Computer: gcc14
Architecture: amd64
CPU ID: GenuineIntel-00010676-bfebfbff
SUPERCOP version: 20211108
Operation: crypto_hash
Primitive: luffa384
TimeObject sizeTest sizeImplementationCompilerBenchmark dateSUPERCOP version
2457611854 0 022947 820 1440T:sse2clang_-march=native_-O2_-fomit-frame-pointer_-fwrapv_-Qunused-arguments_-fPIC_-fPIE2021011420210114
2459411854 0 022947 820 1440T:sse2clang_-march=native_-O_-fomit-frame-pointer_-fwrapv_-Qunused-arguments_-fPIC_-fPIE2021011420210114
2459611854 0 023883 820 1440T:sse2clang_-march=native_-O3_-fomit-frame-pointer_-fwrapv_-Qunused-arguments_-fPIC_-fPIE2021011420210114
2473611799 0 023691 820 1440T:sse2clang_-mcpu=native_-O3_-fomit-frame-pointer_-fwrapv_-Qunused-arguments_-fPIC_-fPIE2021011420210114
2554911665 0 024950 844 1472T:sse2gcc_-march=native_-mtune=native_-O3_-fomit-frame-pointer_-fwrapv_-fPIC_-fPIE2021011420210114
264759590 0 019725 812 1440T:sse2clang_-march=native_-Os_-fomit-frame-pointer_-fwrapv_-Qunused-arguments_-fPIC_-fPIE2021011420210114
270398576 0 018617 820 1472T:sse2gcc_-march=native_-mtune=native_-Os_-fomit-frame-pointer_-fwrapv_-fPIC_-fPIE2021011420210114
2797310050 0 021389 836 1472T:sse2gcc_-march=native_-mtune=native_-O2_-fomit-frame-pointer_-fwrapv_-fPIC_-fPIE2021011420210114
2957010314 0 021333 836 1472T:sse2gcc_-march=native_-mtune=native_-O_-fomit-frame-pointer_-fwrapv_-fPIC_-fPIE2021011420210114
6819716816 320 030206 1172 920T:opt32gcc_-march=native_-mtune=native_-O3_-fomit-frame-pointer_-fwrapv_-fPIC_-fPIE2021011420210114
8113815951 320 028276 1156 888T:opt32clang_-march=native_-O3_-fomit-frame-pointer_-fwrapv_-Qunused-arguments_-fPIC_-fPIE2021011420210114
8308410443 320 021877 1164 920T:opt32gcc_-march=native_-mtune=native_-O2_-fomit-frame-pointer_-fwrapv_-fPIC_-fPIE2021011420210114
832308820 320 018961 1148 920T:opt32gcc_-march=native_-mtune=native_-Os_-fomit-frame-pointer_-fwrapv_-fPIC_-fPIE2021011420210114
840279731 320 019925 1140 888T:opt32clang_-march=native_-Os_-fomit-frame-pointer_-fwrapv_-Qunused-arguments_-fPIC_-fPIE2021011420210114
8445315535 320 027732 1156 888T:opt32clang_-mcpu=native_-O3_-fomit-frame-pointer_-fwrapv_-Qunused-arguments_-fPIC_-fPIE2021011420210114
8589915679 320 027068 1156 888T:opt32clang_-march=native_-O2_-fomit-frame-pointer_-fwrapv_-Qunused-arguments_-fPIC_-fPIE2021011420210114
8604315679 320 027068 1156 888T:opt32clang_-march=native_-O_-fomit-frame-pointer_-fwrapv_-Qunused-arguments_-fPIC_-fPIE2021011420210114
8678310127 320 021245 1164 920T:opt32gcc_-march=native_-mtune=native_-O_-fomit-frame-pointer_-fwrapv_-fPIC_-fPIE2021011420210114

Compiler output

Implementation: T:sse2_x64asm
Security model: timingleaks
Compiler: clang -march=native -O2 -fomit-frame-pointer -fwrapv -Qunused-arguments -fPIC -fPIE
luffa_x64asm.s: luffa_x64asm.s:780:13: error: unknown token in expression
luffa_x64asm.s: movaps %xmm0, [IV ]
luffa_x64asm.s: ^
luffa_x64asm.s: luffa_x64asm.s:780:13: error: unknown token in expression
luffa_x64asm.s: movaps %xmm0, [IV ]
luffa_x64asm.s: ^
luffa_x64asm.s: luffa_x64asm.s:781:13: error: unknown token in expression
luffa_x64asm.s: movaps %xmm1, [IV+16]
luffa_x64asm.s: ^
luffa_x64asm.s: luffa_x64asm.s:781:13: error: unknown token in expression
luffa_x64asm.s: movaps %xmm1, [IV+16]
luffa_x64asm.s: ^
luffa_x64asm.s: luffa_x64asm.s:782:13: error: unknown token in expression
luffa_x64asm.s: movaps %xmm2, [IV+32]
luffa_x64asm.s: ^
luffa_x64asm.s: luffa_x64asm.s:782:13: error: unknown token in expression
luffa_x64asm.s: movaps %xmm2, [IV+32]
luffa_x64asm.s: ^
luffa_x64asm.s: luffa_x64asm.s:783:13: error: unknown token in expression
luffa_x64asm.s: movaps %xmm3, [IV+48]
luffa_x64asm.s: ^
luffa_x64asm.s: luffa_x64asm.s:783:13: error: unknown token in expression
luffa_x64asm.s: movaps %xmm3, [IV+48]
luffa_x64asm.s: ^
luffa_x64asm.s: luffa_x64asm.s:784:13: error: unknown token in expression
luffa_x64asm.s: ...

Number of similar (compiler,implementation) pairs: 10, namely:
CompilerImplementations
clang -march=native -O2 -fomit-frame-pointer -fwrapv -Qunused-arguments -fPIC -fPIE T:sse2_x64asm
clang -march=native -O3 -fomit-frame-pointer -fwrapv -Qunused-arguments -fPIC -fPIE T:sse2_x64asm
clang -march=native -O -fomit-frame-pointer -fwrapv -Qunused-arguments -fPIC -fPIE T:sse2_x64asm
clang -march=native -Os -fomit-frame-pointer -fwrapv -Qunused-arguments -fPIC -fPIE T:sse2_x64asm
clang -mcpu=native -O3 -fomit-frame-pointer -fwrapv -Qunused-arguments -fPIC -fPIE T:sse2_x64asm
clang -march=native -O2 -fomit-frame-pointer -fwrapv -Qunused-arguments -fPIC -fPIE T:ssse3_x64asm
clang -march=native -O3 -fomit-frame-pointer -fwrapv -Qunused-arguments -fPIC -fPIE T:ssse3_x64asm
clang -march=native -O -fomit-frame-pointer -fwrapv -Qunused-arguments -fPIC -fPIE T:ssse3_x64asm
clang -march=native -Os -fomit-frame-pointer -fwrapv -Qunused-arguments -fPIC -fPIE T:ssse3_x64asm
clang -mcpu=native -O3 -fomit-frame-pointer -fwrapv -Qunused-arguments -fPIC -fPIE T:ssse3_x64asm

Compiler output

Implementation: T:sse2_x64asm
Security model: timingleaks
Compiler: gcc -march=native -mtune=native -O2 -fomit-frame-pointer -fwrapv -fPIC -fPIE
try.c: /usr/bin/ld: crypto_hash_luffa384.a(luffa_x64asm.o): relocation R_X86_64_32S against symbol `IV' can not be used when making a shared object; recompile with -fPIC
try.c: /usr/bin/ld: final link failed: Nonrepresentable section on output
try.c: collect2: error: ld returned 1 exit status

Number of similar (compiler,implementation) pairs: 16, namely:
CompilerImplementations
gcc -march=native -mtune=native -O2 -fomit-frame-pointer -fwrapv -fPIC -fPIE T:sse2_x64asm
gcc -march=native -mtune=native -O3 -fomit-frame-pointer -fwrapv -fPIC -fPIE T:sse2_x64asm
gcc -march=native -mtune=native -O -fomit-frame-pointer -fwrapv -fPIC -fPIE T:sse2_x64asm
gcc -march=native -mtune=native -Os -fomit-frame-pointer -fwrapv -fPIC -fPIE T:sse2_x64asm
gcc -march=native -mtune=native -O2 -fomit-frame-pointer -fwrapv -fPIC -fPIE T:sse2_x64asm-2
gcc -march=native -mtune=native -O3 -fomit-frame-pointer -fwrapv -fPIC -fPIE T:sse2_x64asm-2
gcc -march=native -mtune=native -O -fomit-frame-pointer -fwrapv -fPIC -fPIE T:sse2_x64asm-2
gcc -march=native -mtune=native -Os -fomit-frame-pointer -fwrapv -fPIC -fPIE T:sse2_x64asm-2
gcc -march=native -mtune=native -O2 -fomit-frame-pointer -fwrapv -fPIC -fPIE T:ssse3_x64asm
gcc -march=native -mtune=native -O3 -fomit-frame-pointer -fwrapv -fPIC -fPIE T:ssse3_x64asm
gcc -march=native -mtune=native -O -fomit-frame-pointer -fwrapv -fPIC -fPIE T:ssse3_x64asm
gcc -march=native -mtune=native -Os -fomit-frame-pointer -fwrapv -fPIC -fPIE T:ssse3_x64asm
gcc -march=native -mtune=native -O2 -fomit-frame-pointer -fwrapv -fPIC -fPIE T:ssse3_x64asm-2
gcc -march=native -mtune=native -O3 -fomit-frame-pointer -fwrapv -fPIC -fPIE T:ssse3_x64asm-2
gcc -march=native -mtune=native -O -fomit-frame-pointer -fwrapv -fPIC -fPIE T:ssse3_x64asm-2
gcc -march=native -mtune=native -Os -fomit-frame-pointer -fwrapv -fPIC -fPIE T:ssse3_x64asm-2

Compiler output

Implementation: T:sse2_x64asm-2
Security model: timingleaks
Compiler: clang -march=native -O2 -fomit-frame-pointer -fwrapv -Qunused-arguments -fPIC -fPIE
luffa_x64asm.s: luffa_x64asm.s:780:13: error: unknown token in expression
luffa_x64asm.s: movdqa %xmm0, [IV ]
luffa_x64asm.s: ^
luffa_x64asm.s: luffa_x64asm.s:780:13: error: unknown token in expression
luffa_x64asm.s: movdqa %xmm0, [IV ]
luffa_x64asm.s: ^
luffa_x64asm.s: luffa_x64asm.s:781:13: error: unknown token in expression
luffa_x64asm.s: movdqa %xmm1, [IV+16]
luffa_x64asm.s: ^
luffa_x64asm.s: luffa_x64asm.s:781:13: error: unknown token in expression
luffa_x64asm.s: movdqa %xmm1, [IV+16]
luffa_x64asm.s: ^
luffa_x64asm.s: luffa_x64asm.s:782:13: error: unknown token in expression
luffa_x64asm.s: movdqa %xmm2, [IV+32]
luffa_x64asm.s: ^
luffa_x64asm.s: luffa_x64asm.s:782:13: error: unknown token in expression
luffa_x64asm.s: movdqa %xmm2, [IV+32]
luffa_x64asm.s: ^
luffa_x64asm.s: luffa_x64asm.s:783:13: error: unknown token in expression
luffa_x64asm.s: movdqa %xmm3, [IV+48]
luffa_x64asm.s: ^
luffa_x64asm.s: luffa_x64asm.s:783:13: error: unknown token in expression
luffa_x64asm.s: movdqa %xmm3, [IV+48]
luffa_x64asm.s: ^
luffa_x64asm.s: luffa_x64asm.s:784:13: error: unknown token in expression
luffa_x64asm.s: ...

Number of similar (compiler,implementation) pairs: 10, namely:
CompilerImplementations
clang -march=native -O2 -fomit-frame-pointer -fwrapv -Qunused-arguments -fPIC -fPIE T:sse2_x64asm-2
clang -march=native -O3 -fomit-frame-pointer -fwrapv -Qunused-arguments -fPIC -fPIE T:sse2_x64asm-2
clang -march=native -O -fomit-frame-pointer -fwrapv -Qunused-arguments -fPIC -fPIE T:sse2_x64asm-2
clang -march=native -Os -fomit-frame-pointer -fwrapv -Qunused-arguments -fPIC -fPIE T:sse2_x64asm-2
clang -mcpu=native -O3 -fomit-frame-pointer -fwrapv -Qunused-arguments -fPIC -fPIE T:sse2_x64asm-2
clang -march=native -O2 -fomit-frame-pointer -fwrapv -Qunused-arguments -fPIC -fPIE T:ssse3_x64asm-2
clang -march=native -O3 -fomit-frame-pointer -fwrapv -Qunused-arguments -fPIC -fPIE T:ssse3_x64asm-2
clang -march=native -O -fomit-frame-pointer -fwrapv -Qunused-arguments -fPIC -fPIE T:ssse3_x64asm-2
clang -march=native -Os -fomit-frame-pointer -fwrapv -Qunused-arguments -fPIC -fPIE T:ssse3_x64asm-2
clang -mcpu=native -O3 -fomit-frame-pointer -fwrapv -Qunused-arguments -fPIC -fPIE T:ssse3_x64asm-2

Compiler output

Implementation: T:ssse3_x64asm-PS
Security model: timingleaks
Compiler: clang -march=native -O2 -fomit-frame-pointer -fwrapv -Qunused-arguments -fPIC -fPIE
luffa256_x64asm.s: luffa256_x64asm.s:297:9: error: unknown token in expression
luffa256_x64asm.s: movaps %xmm0, [IV ]
luffa256_x64asm.s: ^
luffa256_x64asm.s: luffa256_x64asm.s:297:9: error: unknown token in expression
luffa256_x64asm.s: movaps %xmm0, [IV ]
luffa256_x64asm.s: ^
luffa256_x64asm.s: luffa256_x64asm.s:298:9: error: unknown token in expression
luffa256_x64asm.s: movaps %xmm1, [IV+16]
luffa256_x64asm.s: ^
luffa256_x64asm.s: luffa256_x64asm.s:298:9: error: unknown token in expression
luffa256_x64asm.s: movaps %xmm1, [IV+16]
luffa256_x64asm.s: ^
luffa256_x64asm.s: luffa256_x64asm.s:299:9: error: unknown token in expression
luffa256_x64asm.s: movaps %xmm2, [IV+32]
luffa256_x64asm.s: ^
luffa256_x64asm.s: luffa256_x64asm.s:299:9: error: unknown token in expression
luffa256_x64asm.s: movaps %xmm2, [IV+32]
luffa256_x64asm.s: ^
luffa256_x64asm.s: luffa256_x64asm.s:300:9: error: unknown token in expression
luffa256_x64asm.s: movaps %xmm3, [IV+48]
luffa256_x64asm.s: ^
luffa256_x64asm.s: luffa256_x64asm.s:300:9: error: unknown token in expression
luffa256_x64asm.s: movaps %xmm3, [IV+48]
luffa256_x64asm.s: ^
luffa256_x64asm.s: luffa256_x64asm.s:301:9: error: unknown token in expression
luffa256_x64asm.s: ...

Number of similar (compiler,implementation) pairs: 5, namely:
CompilerImplementations
clang -march=native -O2 -fomit-frame-pointer -fwrapv -Qunused-arguments -fPIC -fPIE T:ssse3_x64asm-PS
clang -march=native -O3 -fomit-frame-pointer -fwrapv -Qunused-arguments -fPIC -fPIE T:ssse3_x64asm-PS
clang -march=native -O -fomit-frame-pointer -fwrapv -Qunused-arguments -fPIC -fPIE T:ssse3_x64asm-PS
clang -march=native -Os -fomit-frame-pointer -fwrapv -Qunused-arguments -fPIC -fPIE T:ssse3_x64asm-PS
clang -mcpu=native -O3 -fomit-frame-pointer -fwrapv -Qunused-arguments -fPIC -fPIE T:ssse3_x64asm-PS

Compiler output

Implementation: T:ssse3_x64asm-PS
Security model: timingleaks
Compiler: gcc -march=native -mtune=native -O2 -fomit-frame-pointer -fwrapv -fPIC -fPIE
try.c: /usr/bin/ld: crypto_hash_luffa384.a(luffa256_x64asm.o): relocation R_X86_64_32S against `.rodata' can not be used when making a shared object; recompile with -fPIC
try.c: /usr/bin/ld: crypto_hash_luffa384.a(luffa384_x64asm.o): relocation R_X86_64_32S against `.rodata' can not be used when making a shared object; recompile with -fPIC
try.c: /usr/bin/ld: crypto_hash_luffa384.a(luffa512_x64asm.o): relocation R_X86_64_32S against `.rodata' can not be used when making a shared object; recompile with -fPIC
try.c: /usr/bin/ld: final link failed: Nonrepresentable section on output
try.c: collect2: error: ld returned 1 exit status

Number of similar (compiler,implementation) pairs: 8, namely:
CompilerImplementations
gcc -march=native -mtune=native -O2 -fomit-frame-pointer -fwrapv -fPIC -fPIE T:ssse3_x64asm-PS
gcc -march=native -mtune=native -O3 -fomit-frame-pointer -fwrapv -fPIC -fPIE T:ssse3_x64asm-PS
gcc -march=native -mtune=native -O -fomit-frame-pointer -fwrapv -fPIC -fPIE T:ssse3_x64asm-PS
gcc -march=native -mtune=native -Os -fomit-frame-pointer -fwrapv -fPIC -fPIE T:ssse3_x64asm-PS
gcc -march=native -mtune=native -O2 -fomit-frame-pointer -fwrapv -fPIC -fPIE T:ssse3_x64asm-PS-2
gcc -march=native -mtune=native -O3 -fomit-frame-pointer -fwrapv -fPIC -fPIE T:ssse3_x64asm-PS-2
gcc -march=native -mtune=native -O -fomit-frame-pointer -fwrapv -fPIC -fPIE T:ssse3_x64asm-PS-2
gcc -march=native -mtune=native -Os -fomit-frame-pointer -fwrapv -fPIC -fPIE T:ssse3_x64asm-PS-2

Compiler output

Implementation: T:ssse3_x64asm-PS-2
Security model: timingleaks
Compiler: clang -march=native -O2 -fomit-frame-pointer -fwrapv -Qunused-arguments -fPIC -fPIE
luffa256_x64asm.s: luffa256_x64asm.s:297:9: error: unknown token in expression
luffa256_x64asm.s: movdqa %xmm0, [IV ]
luffa256_x64asm.s: ^
luffa256_x64asm.s: luffa256_x64asm.s:297:9: error: unknown token in expression
luffa256_x64asm.s: movdqa %xmm0, [IV ]
luffa256_x64asm.s: ^
luffa256_x64asm.s: luffa256_x64asm.s:298:9: error: unknown token in expression
luffa256_x64asm.s: movdqa %xmm1, [IV+16]
luffa256_x64asm.s: ^
luffa256_x64asm.s: luffa256_x64asm.s:298:9: error: unknown token in expression
luffa256_x64asm.s: movdqa %xmm1, [IV+16]
luffa256_x64asm.s: ^
luffa256_x64asm.s: luffa256_x64asm.s:299:9: error: unknown token in expression
luffa256_x64asm.s: movdqa %xmm2, [IV+32]
luffa256_x64asm.s: ^
luffa256_x64asm.s: luffa256_x64asm.s:299:9: error: unknown token in expression
luffa256_x64asm.s: movdqa %xmm2, [IV+32]
luffa256_x64asm.s: ^
luffa256_x64asm.s: luffa256_x64asm.s:300:9: error: unknown token in expression
luffa256_x64asm.s: movdqa %xmm3, [IV+48]
luffa256_x64asm.s: ^
luffa256_x64asm.s: luffa256_x64asm.s:300:9: error: unknown token in expression
luffa256_x64asm.s: movdqa %xmm3, [IV+48]
luffa256_x64asm.s: ^
luffa256_x64asm.s: luffa256_x64asm.s:301:9: error: unknown token in expression
luffa256_x64asm.s: ...

Number of similar (compiler,implementation) pairs: 5, namely:
CompilerImplementations
clang -march=native -O2 -fomit-frame-pointer -fwrapv -Qunused-arguments -fPIC -fPIE T:ssse3_x64asm-PS-2
clang -march=native -O3 -fomit-frame-pointer -fwrapv -Qunused-arguments -fPIC -fPIE T:ssse3_x64asm-PS-2
clang -march=native -O -fomit-frame-pointer -fwrapv -Qunused-arguments -fPIC -fPIE T:ssse3_x64asm-PS-2
clang -march=native -Os -fomit-frame-pointer -fwrapv -Qunused-arguments -fPIC -fPIE T:ssse3_x64asm-PS-2
clang -mcpu=native -O3 -fomit-frame-pointer -fwrapv -Qunused-arguments -fPIC -fPIE T:ssse3_x64asm-PS-2

Compiler output

Implementation: T:thomaz/asm-PS
Security model: timingleaks
Compiler: clang -march=native -O2 -fomit-frame-pointer -fwrapv -Qunused-arguments -fPIC -fPIE
hash.c: hash.c:32:12: warning: passing 'const unsigned char *' to parameter of type 'unsigned char *' discards qualifiers [-Wincompatible-pointer-types-discards-qualifiers]
hash.c: fLuffa384(in, out, inlen);
hash.c: ^~
hash.c: hash.c:29:31: note: passing argument to parameter 'input' here
hash.c: void fLuffa384(unsigned char *input, unsigned char *output, int len);
hash.c: ^
hash.c: 1 warning generated.
luffa_384.s: <instantiation>:1:8: error: unknown token in expression
luffa_384.s: pshufb %xmm8, maskShufLittleEndian
luffa_384.s: ^
luffa_384.s: <instantiation>:1:1: note: while in macro instantiation
luffa_384.s: mPSSTEPI %xmm8, %xmm9, maskShufLittleEndian
luffa_384.s: ^
luffa_384.s: luffa_384.s:266:2: note: while in macro instantiation
luffa_384.s: mPS %xmm8, %xmm9, %xmm10, %xmm11, %xmm12, %xmm13
luffa_384.s: ^
luffa_384.s: <instantiation>:1:8: error: unknown token in expression
luffa_384.s: pshufb %xmm8, maskShufLittleEndian
luffa_384.s: ^
luffa_384.s: <instantiation>:1:1: note: while in macro instantiation
luffa_384.s: mPSSTEPI %xmm8, %xmm9, maskShufLittleEndian
luffa_384.s: ^
luffa_384.s: luffa_384.s:266:2: note: while in macro instantiation
luffa_384.s: mPS %xmm8, %xmm9, %xmm10, %xmm11, %xmm12, %xmm13
luffa_384.s: ^
luffa_384.s: <instantiation>:2:9: error: unknown token in expression
luffa_384.s: pshufb %xmm9, maskShufLittleEndian
luffa_384.s: ^
luffa_384.s: <instantiation>:1:1: note: while in macro instantiation
luffa_384.s: mPSSTEPI %xmm8, %xmm9, maskShufLittleEndian
luffa_384.s: ^
luffa_384.s: luffa_384.s:266:2: note: while in macro instantiation
luffa_384.s: ...

Number of similar (compiler,implementation) pairs: 5, namely:
CompilerImplementations
clang -march=native -O2 -fomit-frame-pointer -fwrapv -Qunused-arguments -fPIC -fPIE T:thomaz/asm-PS
clang -march=native -O3 -fomit-frame-pointer -fwrapv -Qunused-arguments -fPIC -fPIE T:thomaz/asm-PS
clang -march=native -O -fomit-frame-pointer -fwrapv -Qunused-arguments -fPIC -fPIE T:thomaz/asm-PS
clang -march=native -Os -fomit-frame-pointer -fwrapv -Qunused-arguments -fPIC -fPIE T:thomaz/asm-PS
clang -mcpu=native -O3 -fomit-frame-pointer -fwrapv -Qunused-arguments -fPIC -fPIE T:thomaz/asm-PS

Compiler output

Implementation: T:thomaz/asm-PS
Security model: timingleaks
Compiler: gcc -march=native -mtune=native -O2 -fomit-frame-pointer -fwrapv -fPIC -fPIE
hash.c: hash.c: In function 'crypto_hash_luffa384_thomaz_asm_PS_timingleaks':
hash.c: hash.c:32:12: warning: passing argument 1 of 'fLuffa384' discards 'const' qualifier from pointer target type [-Wdiscarded-qualifiers]
hash.c: fLuffa384(in, out, inlen);
hash.c: ^~
hash.c: hash.c:29:6: note: expected 'unsigned char *' but argument is of type 'const unsigned char *'
hash.c: void fLuffa384(unsigned char *input, unsigned char *output, int len);
hash.c: ^~~~~~~~~
try.c: /usr/bin/ld: crypto_hash_luffa384.a(luffa_384.o): relocation R_X86_64_32S against `.rodata' can not be used when making a shared object; recompile with -fPIC
try.c: /usr/bin/ld: final link failed: Nonrepresentable section on output
try.c: collect2: error: ld returned 1 exit status

Number of similar (compiler,implementation) pairs: 4, namely:
CompilerImplementations
gcc -march=native -mtune=native -O2 -fomit-frame-pointer -fwrapv -fPIC -fPIE T:thomaz/asm-PS
gcc -march=native -mtune=native -O3 -fomit-frame-pointer -fwrapv -fPIC -fPIE T:thomaz/asm-PS
gcc -march=native -mtune=native -O -fomit-frame-pointer -fwrapv -fPIC -fPIE T:thomaz/asm-PS
gcc -march=native -mtune=native -Os -fomit-frame-pointer -fwrapv -fPIC -fPIE T:thomaz/asm-PS

Compiler output

Implementation: T:thomaz/asm-PS-v2-FP
Security model: timingleaks
Compiler: clang -march=native -O2 -fomit-frame-pointer -fwrapv -Qunused-arguments -fPIC -fPIE
hash.c: hash.c:32:12: warning: passing 'const unsigned char *' to parameter of type 'unsigned char *' discards qualifiers [-Wincompatible-pointer-types-discards-qualifiers]
hash.c: fLuffa384(in, out, inlen);
hash.c: ^~
hash.c: hash.c:29:31: note: passing argument to parameter 'input' here
hash.c: void fLuffa384(unsigned char *input, unsigned char *output, int len);
hash.c: ^
hash.c: 1 warning generated.
luffa_384.s: <instantiation>:1:8: error: unknown token in expression
luffa_384.s: pshufb %xmm8, maskShufLittleEndian
luffa_384.s: ^
luffa_384.s: <instantiation>:1:1: note: while in macro instantiation
luffa_384.s: mPSSTEPI %xmm8, %xmm9, maskShufLittleEndian
luffa_384.s: ^
luffa_384.s: luffa_384.s:267:2: note: while in macro instantiation
luffa_384.s: mPS %xmm8, %xmm9, %xmm10, %xmm11, %xmm12, %xmm13
luffa_384.s: ^
luffa_384.s: <instantiation>:1:8: error: unknown token in expression
luffa_384.s: pshufb %xmm8, maskShufLittleEndian
luffa_384.s: ^
luffa_384.s: <instantiation>:1:1: note: while in macro instantiation
luffa_384.s: mPSSTEPI %xmm8, %xmm9, maskShufLittleEndian
luffa_384.s: ^
luffa_384.s: luffa_384.s:267:2: note: while in macro instantiation
luffa_384.s: mPS %xmm8, %xmm9, %xmm10, %xmm11, %xmm12, %xmm13
luffa_384.s: ^
luffa_384.s: <instantiation>:2:9: error: unknown token in expression
luffa_384.s: pshufb %xmm9, maskShufLittleEndian
luffa_384.s: ^
luffa_384.s: <instantiation>:1:1: note: while in macro instantiation
luffa_384.s: mPSSTEPI %xmm8, %xmm9, maskShufLittleEndian
luffa_384.s: ^
luffa_384.s: luffa_384.s:267:2: note: while in macro instantiation
luffa_384.s: ...

Number of similar (compiler,implementation) pairs: 10, namely:
CompilerImplementations
clang -march=native -O2 -fomit-frame-pointer -fwrapv -Qunused-arguments -fPIC -fPIE T:thomaz/asm-PS-v2-FP
clang -march=native -O3 -fomit-frame-pointer -fwrapv -Qunused-arguments -fPIC -fPIE T:thomaz/asm-PS-v2-FP
clang -march=native -O -fomit-frame-pointer -fwrapv -Qunused-arguments -fPIC -fPIE T:thomaz/asm-PS-v2-FP
clang -march=native -Os -fomit-frame-pointer -fwrapv -Qunused-arguments -fPIC -fPIE T:thomaz/asm-PS-v2-FP
clang -mcpu=native -O3 -fomit-frame-pointer -fwrapv -Qunused-arguments -fPIC -fPIE T:thomaz/asm-PS-v2-FP
clang -march=native -O2 -fomit-frame-pointer -fwrapv -Qunused-arguments -fPIC -fPIE T:thomaz/asm-PS-v2-INT
clang -march=native -O3 -fomit-frame-pointer -fwrapv -Qunused-arguments -fPIC -fPIE T:thomaz/asm-PS-v2-INT
clang -march=native -O -fomit-frame-pointer -fwrapv -Qunused-arguments -fPIC -fPIE T:thomaz/asm-PS-v2-INT
clang -march=native -Os -fomit-frame-pointer -fwrapv -Qunused-arguments -fPIC -fPIE T:thomaz/asm-PS-v2-INT
clang -mcpu=native -O3 -fomit-frame-pointer -fwrapv -Qunused-arguments -fPIC -fPIE T:thomaz/asm-PS-v2-INT

Compiler output

Implementation: T:thomaz/asm-PS-v2-FP
Security model: timingleaks
Compiler: gcc -march=native -mtune=native -O2 -fomit-frame-pointer -fwrapv -fPIC -fPIE
hash.c: hash.c: In function 'crypto_hash_luffa384_thomaz_asm_PS_v2_FP_timingleaks':
hash.c: hash.c:32:12: warning: passing argument 1 of 'fLuffa384' discards 'const' qualifier from pointer target type [-Wdiscarded-qualifiers]
hash.c: fLuffa384(in, out, inlen);
hash.c: ^~
hash.c: hash.c:29:6: note: expected 'unsigned char *' but argument is of type 'const unsigned char *'
hash.c: void fLuffa384(unsigned char *input, unsigned char *output, int len);
hash.c: ^~~~~~~~~
try.c: /usr/bin/ld: crypto_hash_luffa384.a(luffa_384.o): relocation R_X86_64_32S against `.rodata' can not be used when making a shared object; recompile with -fPIC
try.c: /usr/bin/ld: final link failed: Nonrepresentable section on output
try.c: collect2: error: ld returned 1 exit status

Number of similar (compiler,implementation) pairs: 4, namely:
CompilerImplementations
gcc -march=native -mtune=native -O2 -fomit-frame-pointer -fwrapv -fPIC -fPIE T:thomaz/asm-PS-v2-FP
gcc -march=native -mtune=native -O3 -fomit-frame-pointer -fwrapv -fPIC -fPIE T:thomaz/asm-PS-v2-FP
gcc -march=native -mtune=native -O -fomit-frame-pointer -fwrapv -fPIC -fPIE T:thomaz/asm-PS-v2-FP
gcc -march=native -mtune=native -Os -fomit-frame-pointer -fwrapv -fPIC -fPIE T:thomaz/asm-PS-v2-FP

Compiler output

Implementation: T:thomaz/asm-PS-v2-INT
Security model: timingleaks
Compiler: gcc -march=native -mtune=native -O2 -fomit-frame-pointer -fwrapv -fPIC -fPIE
hash.c: hash.c: In function 'crypto_hash_luffa384_thomaz_asm_PS_v2_INT_timingleaks':
hash.c: hash.c:32:12: warning: passing argument 1 of 'fLuffa384' discards 'const' qualifier from pointer target type [-Wdiscarded-qualifiers]
hash.c: fLuffa384(in, out, inlen);
hash.c: ^~
hash.c: hash.c:29:6: note: expected 'unsigned char *' but argument is of type 'const unsigned char *'
hash.c: void fLuffa384(unsigned char *input, unsigned char *output, int len);
hash.c: ^~~~~~~~~
try.c: /usr/bin/ld: crypto_hash_luffa384.a(luffa_384.o): relocation R_X86_64_32S against `.rodata' can not be used when making a shared object; recompile with -fPIC
try.c: /usr/bin/ld: final link failed: Nonrepresentable section on output
try.c: collect2: error: ld returned 1 exit status

Number of similar (compiler,implementation) pairs: 4, namely:
CompilerImplementations
gcc -march=native -mtune=native -O2 -fomit-frame-pointer -fwrapv -fPIC -fPIE T:thomaz/asm-PS-v2-INT
gcc -march=native -mtune=native -O3 -fomit-frame-pointer -fwrapv -fPIC -fPIE T:thomaz/asm-PS-v2-INT
gcc -march=native -mtune=native -O -fomit-frame-pointer -fwrapv -fPIC -fPIE T:thomaz/asm-PS-v2-INT
gcc -march=native -mtune=native -Os -fomit-frame-pointer -fwrapv -fPIC -fPIE T:thomaz/asm-PS-v2-INT

Compiler output

Implementation: T:thomaz/asm-PSPar-v2-FP
Security model: timingleaks
Compiler: clang -march=native -O2 -fomit-frame-pointer -fwrapv -Qunused-arguments -fPIC -fPIE
hash.c: hash.c:32:12: warning: passing 'const unsigned char *' to parameter of type 'unsigned char *' discards qualifiers [-Wincompatible-pointer-types-discards-qualifiers]
hash.c: fLuffa384(in, out, inlen);
hash.c: ^~
hash.c: hash.c:29:31: note: passing argument to parameter 'input' here
hash.c: void fLuffa384(unsigned char *input, unsigned char *output, int len);
hash.c: ^
hash.c: 1 warning generated.
luffa384.s: <instantiation>:1:8: error: unknown token in expression
luffa384.s: pshufb %xmm8, maskShufLittleEndian
luffa384.s: ^
luffa384.s: <instantiation>:1:1: note: while in macro instantiation
luffa384.s: mPSSTEPI %xmm8, %xmm9, maskShufLittleEndian
luffa384.s: ^
luffa384.s: luffa384.s:401:2: note: while in macro instantiation
luffa384.s: mPS %xmm8, %xmm9, %xmm10, %xmm11, %xmm12, %xmm13
luffa384.s: ^
luffa384.s: <instantiation>:1:8: error: unknown token in expression
luffa384.s: pshufb %xmm8, maskShufLittleEndian
luffa384.s: ^
luffa384.s: <instantiation>:1:1: note: while in macro instantiation
luffa384.s: mPSSTEPI %xmm8, %xmm9, maskShufLittleEndian
luffa384.s: ^
luffa384.s: luffa384.s:401:2: note: while in macro instantiation
luffa384.s: mPS %xmm8, %xmm9, %xmm10, %xmm11, %xmm12, %xmm13
luffa384.s: ^
luffa384.s: <instantiation>:2:9: error: unknown token in expression
luffa384.s: pshufb %xmm9, maskShufLittleEndian
luffa384.s: ^
luffa384.s: <instantiation>:1:1: note: while in macro instantiation
luffa384.s: mPSSTEPI %xmm8, %xmm9, maskShufLittleEndian
luffa384.s: ^
luffa384.s: luffa384.s:401:2: note: while in macro instantiation
luffa384.s: ...

Number of similar (compiler,implementation) pairs: 5, namely:
CompilerImplementations
clang -march=native -O2 -fomit-frame-pointer -fwrapv -Qunused-arguments -fPIC -fPIE T:thomaz/asm-PSPar-v2-FP
clang -march=native -O3 -fomit-frame-pointer -fwrapv -Qunused-arguments -fPIC -fPIE T:thomaz/asm-PSPar-v2-FP
clang -march=native -O -fomit-frame-pointer -fwrapv -Qunused-arguments -fPIC -fPIE T:thomaz/asm-PSPar-v2-FP
clang -march=native -Os -fomit-frame-pointer -fwrapv -Qunused-arguments -fPIC -fPIE T:thomaz/asm-PSPar-v2-FP
clang -mcpu=native -O3 -fomit-frame-pointer -fwrapv -Qunused-arguments -fPIC -fPIE T:thomaz/asm-PSPar-v2-FP

Compiler output

Implementation: T:thomaz/asm-PSPar-v2-FP
Security model: timingleaks
Compiler: gcc -march=native -mtune=native -O2 -fomit-frame-pointer -fwrapv -fPIC -fPIE
hash.c: hash.c: In function 'crypto_hash_luffa384_thomaz_asm_PSPar_v2_FP_timingleaks':
hash.c: hash.c:32:12: warning: passing argument 1 of 'fLuffa384' discards 'const' qualifier from pointer target type [-Wdiscarded-qualifiers]
hash.c: fLuffa384(in, out, inlen);
hash.c: ^~
hash.c: hash.c:29:6: note: expected 'unsigned char *' but argument is of type 'const unsigned char *'
hash.c: void fLuffa384(unsigned char *input, unsigned char *output, int len);
hash.c: ^~~~~~~~~
try.c: /usr/bin/ld: crypto_hash_luffa384.a(luffa384.o): relocation R_X86_64_32S against `.rodata' can not be used when making a shared object; recompile with -fPIC
try.c: /usr/bin/ld: final link failed: Nonrepresentable section on output
try.c: collect2: error: ld returned 1 exit status

Number of similar (compiler,implementation) pairs: 4, namely:
CompilerImplementations
gcc -march=native -mtune=native -O2 -fomit-frame-pointer -fwrapv -fPIC -fPIE T:thomaz/asm-PSPar-v2-FP
gcc -march=native -mtune=native -O3 -fomit-frame-pointer -fwrapv -fPIC -fPIE T:thomaz/asm-PSPar-v2-FP
gcc -march=native -mtune=native -O -fomit-frame-pointer -fwrapv -fPIC -fPIE T:thomaz/asm-PSPar-v2-FP
gcc -march=native -mtune=native -Os -fomit-frame-pointer -fwrapv -fPIC -fPIE T:thomaz/asm-PSPar-v2-FP

Compiler output

Implementation: T:thomaz/asm-PSPar-v2-INT
Security model: timingleaks
Compiler: clang -march=native -O2 -fomit-frame-pointer -fwrapv -Qunused-arguments -fPIC -fPIE
hash.c: hash.c:32:12: warning: passing 'const unsigned char *' to parameter of type 'unsigned char *' discards qualifiers [-Wincompatible-pointer-types-discards-qualifiers]
hash.c: fLuffa384(in, out, inlen);
hash.c: ^~
hash.c: hash.c:29:31: note: passing argument to parameter 'input' here
hash.c: void fLuffa384(unsigned char *input, unsigned char *output, int len);
hash.c: ^
hash.c: 1 warning generated.
luffa384.s: <instantiation>:1:8: error: unknown token in expression
luffa384.s: pshufb %xmm8, maskShufLittleEndian
luffa384.s: ^
luffa384.s: <instantiation>:1:1: note: while in macro instantiation
luffa384.s: mPSSTEPI %xmm8, %xmm9, maskShufLittleEndian
luffa384.s: ^
luffa384.s: luffa384.s:400:2: note: while in macro instantiation
luffa384.s: mPS %xmm8, %xmm9, %xmm10, %xmm11, %xmm12, %xmm13
luffa384.s: ^
luffa384.s: <instantiation>:1:8: error: unknown token in expression
luffa384.s: pshufb %xmm8, maskShufLittleEndian
luffa384.s: ^
luffa384.s: <instantiation>:1:1: note: while in macro instantiation
luffa384.s: mPSSTEPI %xmm8, %xmm9, maskShufLittleEndian
luffa384.s: ^
luffa384.s: luffa384.s:400:2: note: while in macro instantiation
luffa384.s: mPS %xmm8, %xmm9, %xmm10, %xmm11, %xmm12, %xmm13
luffa384.s: ^
luffa384.s: <instantiation>:2:9: error: unknown token in expression
luffa384.s: pshufb %xmm9, maskShufLittleEndian
luffa384.s: ^
luffa384.s: <instantiation>:1:1: note: while in macro instantiation
luffa384.s: mPSSTEPI %xmm8, %xmm9, maskShufLittleEndian
luffa384.s: ^
luffa384.s: luffa384.s:400:2: note: while in macro instantiation
luffa384.s: ...

Number of similar (compiler,implementation) pairs: 5, namely:
CompilerImplementations
clang -march=native -O2 -fomit-frame-pointer -fwrapv -Qunused-arguments -fPIC -fPIE T:thomaz/asm-PSPar-v2-INT
clang -march=native -O3 -fomit-frame-pointer -fwrapv -Qunused-arguments -fPIC -fPIE T:thomaz/asm-PSPar-v2-INT
clang -march=native -O -fomit-frame-pointer -fwrapv -Qunused-arguments -fPIC -fPIE T:thomaz/asm-PSPar-v2-INT
clang -march=native -Os -fomit-frame-pointer -fwrapv -Qunused-arguments -fPIC -fPIE T:thomaz/asm-PSPar-v2-INT
clang -mcpu=native -O3 -fomit-frame-pointer -fwrapv -Qunused-arguments -fPIC -fPIE T:thomaz/asm-PSPar-v2-INT

Compiler output

Implementation: T:thomaz/asm-PSPar-v2-INT
Security model: timingleaks
Compiler: gcc -march=native -mtune=native -O2 -fomit-frame-pointer -fwrapv -fPIC -fPIE
hash.c: hash.c: In function 'crypto_hash_luffa384_thomaz_asm_PSPar_v2_INT_timingleaks':
hash.c: hash.c:32:12: warning: passing argument 1 of 'fLuffa384' discards 'const' qualifier from pointer target type [-Wdiscarded-qualifiers]
hash.c: fLuffa384(in, out, inlen);
hash.c: ^~
hash.c: hash.c:29:6: note: expected 'unsigned char *' but argument is of type 'const unsigned char *'
hash.c: void fLuffa384(unsigned char *input, unsigned char *output, int len);
hash.c: ^~~~~~~~~
try.c: /usr/bin/ld: crypto_hash_luffa384.a(luffa384.o): relocation R_X86_64_32S against `.rodata' can not be used when making a shared object; recompile with -fPIC
try.c: /usr/bin/ld: final link failed: Nonrepresentable section on output
try.c: collect2: error: ld returned 1 exit status

Number of similar (compiler,implementation) pairs: 4, namely:
CompilerImplementations
gcc -march=native -mtune=native -O2 -fomit-frame-pointer -fwrapv -fPIC -fPIE T:thomaz/asm-PSPar-v2-INT
gcc -march=native -mtune=native -O3 -fomit-frame-pointer -fwrapv -fPIC -fPIE T:thomaz/asm-PSPar-v2-INT
gcc -march=native -mtune=native -O -fomit-frame-pointer -fwrapv -fPIC -fPIE T:thomaz/asm-PSPar-v2-INT
gcc -march=native -mtune=native -Os -fomit-frame-pointer -fwrapv -fPIC -fPIE T:thomaz/asm-PSPar-v2-INT

Namespace violations

Implementation: T:opt32
Security model: timingleaks
Compiler: clang -march=native -O2 -fomit-frame-pointer -fwrapv -Qunused-arguments -fPIC -fPIE
luffa_for_32.o CNS D
luffa_for_32.o Final T
luffa_for_32.o Hash T
luffa_for_32.o IV R
luffa_for_32.o Init T
luffa_for_32.o Update T
luffa_for_32.o Update256 T
luffa_for_32.o Update384 T
luffa_for_32.o Update512 T
luffa_for_32.o finalization224 T
luffa_for_32.o finalization256 T
luffa_for_32.o finalization384 T
luffa_for_32.o finalization512 T
luffa_for_32.o process_last_msgs256 T
luffa_for_32.o process_last_msgs384 T
luffa_for_32.o process_last_msgs512 T
luffa_for_32.o rnd256 T
luffa_for_32.o rnd384 T
luffa_for_32.o rnd512 T

Number of similar (compiler,implementation) pairs: 9, namely:
CompilerImplementations
clang -march=native -O2 -fomit-frame-pointer -fwrapv -Qunused-arguments -fPIC -fPIE T:opt32
clang -march=native -O3 -fomit-frame-pointer -fwrapv -Qunused-arguments -fPIC -fPIE T:opt32
clang -march=native -O -fomit-frame-pointer -fwrapv -Qunused-arguments -fPIC -fPIE T:opt32
clang -march=native -Os -fomit-frame-pointer -fwrapv -Qunused-arguments -fPIC -fPIE T:opt32
clang -mcpu=native -O3 -fomit-frame-pointer -fwrapv -Qunused-arguments -fPIC -fPIE T:opt32
gcc -march=native -mtune=native -O2 -fomit-frame-pointer -fwrapv -fPIC -fPIE T:opt32
gcc -march=native -mtune=native -O3 -fomit-frame-pointer -fwrapv -fPIC -fPIE T:opt32
gcc -march=native -mtune=native -O -fomit-frame-pointer -fwrapv -fPIC -fPIE T:opt32
gcc -march=native -mtune=native -Os -fomit-frame-pointer -fwrapv -fPIC -fPIE T:opt32

Namespace violations

Implementation: T:sse2
Security model: timingleaks
Compiler: clang -march=native -O2 -fomit-frame-pointer -fwrapv -Qunused-arguments -fPIC -fPIE
luffa_for_sse2.o ALLONE C
luffa_for_sse2.o CNS128 C
luffa_for_sse2.o Final T
luffa_for_sse2.o Hash T
luffa_for_sse2.o Init T
luffa_for_sse2.o MASK C
luffa_for_sse2.o Update T

Number of similar (compiler,implementation) pairs: 9, namely:
CompilerImplementations
clang -march=native -O2 -fomit-frame-pointer -fwrapv -Qunused-arguments -fPIC -fPIE T:sse2
clang -march=native -O3 -fomit-frame-pointer -fwrapv -Qunused-arguments -fPIC -fPIE T:sse2
clang -march=native -O -fomit-frame-pointer -fwrapv -Qunused-arguments -fPIC -fPIE T:sse2
clang -march=native -Os -fomit-frame-pointer -fwrapv -Qunused-arguments -fPIC -fPIE T:sse2
clang -mcpu=native -O3 -fomit-frame-pointer -fwrapv -Qunused-arguments -fPIC -fPIE T:sse2
gcc -march=native -mtune=native -O2 -fomit-frame-pointer -fwrapv -fPIC -fPIE T:sse2
gcc -march=native -mtune=native -O3 -fomit-frame-pointer -fwrapv -fPIC -fPIE T:sse2
gcc -march=native -mtune=native -O -fomit-frame-pointer -fwrapv -fPIC -fPIE T:sse2
gcc -march=native -mtune=native -Os -fomit-frame-pointer -fwrapv -fPIC -fPIE T:sse2