Implementation notes: amd64, gcc14, crypto_aead/paeq128

Computer: gcc14
Architecture: amd64
CPU ID: GenuineIntel-00010676-bfebfbff
SUPERCOP version: 20210604
Operation: crypto_aead
Primitive: paeq128
TimeObject sizeTest sizeImplementationCompilerBenchmark dateSUPERCOP version
378392210274 32 6553624656 892 66544T:refclang++_-march=native_-O_-fomit-frame-pointer_-fwrapv_-Qunused-arguments_-fPIC_-fPIE2021011520210114
380603310274 32 6553625592 892 66544T:refclang++_-march=native_-O3_-fomit-frame-pointer_-fwrapv_-Qunused-arguments_-fPIC_-fPIE2021011520210114
381978310274 32 6553624656 892 66544T:refclang++_-march=native_-O2_-fomit-frame-pointer_-fwrapv_-Qunused-arguments_-fPIC_-fPIE2021011520210114
627331716949 28 6553633771 912 66640T:refg++_-march=native_-mtune=native_-O3_-fomit-frame-pointer_-fwrapv_-fPIC_-fPIE2021011520210114
113322325500 32 6553618706 884 66544T:refclang++_-march=native_-Os_-fomit-frame-pointer_-fwrapv_-Qunused-arguments_-fPIC_-fPIE2021011520210114
128849516103 28 6553620946 904 66640T:refg++_-march=native_-mtune=native_-O2_-fomit-frame-pointer_-fwrapv_-fPIC_-fPIE2021011520210114
130314985438 28 6553620010 904 66640T:refg++_-march=native_-mtune=native_-O_-fomit-frame-pointer_-fwrapv_-fPIC_-fPIE2021011520210114
202771854826 28 6553618214 888 66608T:refg++_-march=native_-mtune=native_-Os_-fomit-frame-pointer_-fwrapv_-fPIC_-fPIE2021011520210114

Compiler output

Implementation: T:aesni
Security model: timingleaks
Compiler: clang++ -march=native -O2 -fomit-frame-pointer -fwrapv -Qunused-arguments -fPIC -fPIE
encrypt.cpp: encrypt.cpp:167:11: error: always_inline function '_mm_aesenc_si128' requires target feature 'aes', but would be inlined into function 'DoubleFPermAsm' that is compiled without support for 'aes'
encrypt.cpp: acc0 = _mm_aesenc_si128(acc0, roundkey0);
encrypt.cpp: ^
encrypt.cpp: encrypt.cpp:168:11: error: always_inline function '_mm_aesenc_si128' requires target feature 'aes', but would be inlined into function 'DoubleFPermAsm' that is compiled without support for 'aes'
encrypt.cpp: acc1 = _mm_aesenc_si128(acc1, roundkey1);
encrypt.cpp: ^
encrypt.cpp: encrypt.cpp:169:11: error: always_inline function '_mm_aesenc_si128' requires target feature 'aes', but would be inlined into function 'DoubleFPermAsm' that is compiled without support for 'aes'
encrypt.cpp: acc2 = _mm_aesenc_si128(acc2, roundkey2);
encrypt.cpp: ^
encrypt.cpp: encrypt.cpp:170:11: error: always_inline function '_mm_aesenc_si128' requires target feature 'aes', but would be inlined into function 'DoubleFPermAsm' that is compiled without support for 'aes'
encrypt.cpp: acc3 = _mm_aesenc_si128(acc3, roundkey3);
encrypt.cpp: ^
encrypt.cpp: encrypt.cpp:172:11: error: always_inline function '_mm_aesenc_si128' requires target feature 'aes', but would be inlined into function 'DoubleFPermAsm' that is compiled without support for 'aes'
encrypt.cpp: acc4 = _mm_aesenc_si128(acc4, roundkey0);
encrypt.cpp: ^
encrypt.cpp: encrypt.cpp:173:11: error: always_inline function '_mm_aesenc_si128' requires target feature 'aes', but would be inlined into function 'DoubleFPermAsm' that is compiled without support for 'aes'
encrypt.cpp: acc5 = _mm_aesenc_si128(acc5, roundkey1);
encrypt.cpp: ^
encrypt.cpp: encrypt.cpp:174:11: error: always_inline function '_mm_aesenc_si128' requires target feature 'aes', but would be inlined into function 'DoubleFPermAsm' that is compiled without support for 'aes'
encrypt.cpp: acc6 = _mm_aesenc_si128(acc6, roundkey2);
encrypt.cpp: ^
encrypt.cpp: encrypt.cpp:175:11: error: always_inline function '_mm_aesenc_si128' requires target feature 'aes', but would be inlined into function 'DoubleFPermAsm' that is compiled without support for 'aes'
encrypt.cpp: acc7 = _mm_aesenc_si128(acc7, roundkey3);
encrypt.cpp: ^
encrypt.cpp: 8 errors generated.

Number of similar (compiler,implementation) pairs: 4, namely:
CompilerImplementations
clang++ -march=native -O2 -fomit-frame-pointer -fwrapv -Qunused-arguments -fPIC -fPIE T:aesni
clang++ -march=native -O3 -fomit-frame-pointer -fwrapv -Qunused-arguments -fPIC -fPIE T:aesni
clang++ -march=native -O -fomit-frame-pointer -fwrapv -Qunused-arguments -fPIC -fPIE T:aesni
clang++ -march=native -Os -fomit-frame-pointer -fwrapv -Qunused-arguments -fPIC -fPIE T:aesni

Compiler output

Implementation: T:aesni
Security model: timingleaks
Compiler: g++ -march=native -mtune=native -O2 -fomit-frame-pointer -fwrapv -fPIC -fPIE
encrypt.cpp: In file included from encrypt.cpp:13:0:
encrypt.cpp: /usr/lib/gcc/x86_64-linux-gnu/6/include/wmmintrin.h: In function 'void DoubleFPermAsm(const __m128i*, const __m128i*, __m128i*, __m128i*)':
encrypt.cpp: /usr/lib/gcc/x86_64-linux-gnu/6/include/wmmintrin.h:61:1: error: inlining failed in call to always_inline '__m128i _mm_aesenc_si128(__m128i, __m128i)': target specific option mismatch
encrypt.cpp: _mm_aesenc_si128 (__m128i __X, __m128i __Y)
encrypt.cpp: ^~~~~~~~~~~~~~~~
encrypt.cpp: encrypt.cpp:175:44: note: called from here
encrypt.cpp: acc7 = _mm_aesenc_si128(acc7, roundkey3);
encrypt.cpp: ^
encrypt.cpp: In file included from encrypt.cpp:13:0:
encrypt.cpp: /usr/lib/gcc/x86_64-linux-gnu/6/include/wmmintrin.h:61:1: error: inlining failed in call to always_inline '__m128i _mm_aesenc_si128(__m128i, __m128i)': target specific option mismatch
encrypt.cpp: _mm_aesenc_si128 (__m128i __X, __m128i __Y)
encrypt.cpp: ^~~~~~~~~~~~~~~~
encrypt.cpp: encrypt.cpp:174:44: note: called from here
encrypt.cpp: acc6 = _mm_aesenc_si128(acc6, roundkey2);
encrypt.cpp: ^
encrypt.cpp: In file included from encrypt.cpp:13:0:
encrypt.cpp: /usr/lib/gcc/x86_64-linux-gnu/6/include/wmmintrin.h:61:1: error: inlining failed in call to always_inline '__m128i _mm_aesenc_si128(__m128i, __m128i)': target specific option mismatch
encrypt.cpp: _mm_aesenc_si128 (__m128i __X, __m128i __Y)
encrypt.cpp: ^~~~~~~~~~~~~~~~
encrypt.cpp: encrypt.cpp:173:44: note: called from here
encrypt.cpp: acc5 = _mm_aesenc_si128(acc5, roundkey1);
encrypt.cpp: ^
encrypt.cpp: In file included from encrypt.cpp:13:0:
encrypt.cpp: /usr/lib/gcc/x86_64-linux-gnu/6/include/wmmintrin.h:61:1: error: inlining failed in call to always_inline '__m128i _mm_aesenc_si128(__m128i, __m128i)': target specific option mismatch
encrypt.cpp: _mm_aesenc_si128 (__m128i __X, __m128i __Y)
encrypt.cpp: ...

Number of similar (compiler,implementation) pairs: 4, namely:
CompilerImplementations
g++ -march=native -mtune=native -O2 -fomit-frame-pointer -fwrapv -fPIC -fPIE T:aesni
g++ -march=native -mtune=native -O3 -fomit-frame-pointer -fwrapv -fPIC -fPIE T:aesni
g++ -march=native -mtune=native -O -fomit-frame-pointer -fwrapv -fPIC -fPIE T:aesni
g++ -march=native -mtune=native -Os -fomit-frame-pointer -fwrapv -fPIC -fPIE T:aesni

Compiler output

Implementation: T:opt-win-aes
Security model: timingleaks
Compiler: clang++ -march=native -O2 -fomit-frame-pointer -fwrapv -Qunused-arguments -fPIC -fPIE
encrypt.cpp: In file included from encrypt.cpp:8:
encrypt.cpp: In file included from /usr/bin/../lib/gcc/x86_64-linux-gnu/6.3.0/../../../../include/c++/6.3.0/cstdint:35:
encrypt.cpp: /usr/bin/../lib/gcc/x86_64-linux-gnu/6.3.0/../../../../include/c++/6.3.0/bits/c++0x_warning.h:32:2: error: This file requires compiler and library support for the ISO C++ 2011 standard. This support must be enabled with the -std=c++11 or -std=gnu++11 compiler options.
encrypt.cpp: #error This file requires compiler and library support \
encrypt.cpp: ^
encrypt.cpp: encrypt.cpp:13:10: fatal error: 'intrin.h' file not found
encrypt.cpp: #include <intrin.h>
encrypt.cpp: ^
encrypt.cpp: 2 errors generated.

Number of similar (compiler,implementation) pairs: 4, namely:
CompilerImplementations
clang++ -march=native -O2 -fomit-frame-pointer -fwrapv -Qunused-arguments -fPIC -fPIE T:opt-win-aes
clang++ -march=native -O3 -fomit-frame-pointer -fwrapv -Qunused-arguments -fPIC -fPIE T:opt-win-aes
clang++ -march=native -O -fomit-frame-pointer -fwrapv -Qunused-arguments -fPIC -fPIE T:opt-win-aes
clang++ -march=native -Os -fomit-frame-pointer -fwrapv -Qunused-arguments -fPIC -fPIE T:opt-win-aes

Compiler output

Implementation: T:opt-win-aes
Security model: timingleaks
Compiler: g++ -march=native -mtune=native -O2 -fomit-frame-pointer -fwrapv -fPIC -fPIE
encrypt.cpp: encrypt.cpp:13:20: fatal error: intrin.h: No such file or directory
encrypt.cpp: #include <intrin.h>
encrypt.cpp: ^
encrypt.cpp: compilation terminated.

Number of similar (compiler,implementation) pairs: 4, namely:
CompilerImplementations
g++ -march=native -mtune=native -O2 -fomit-frame-pointer -fwrapv -fPIC -fPIE T:opt-win-aes
g++ -march=native -mtune=native -O3 -fomit-frame-pointer -fwrapv -fPIC -fPIE T:opt-win-aes
g++ -march=native -mtune=native -O -fomit-frame-pointer -fwrapv -fPIC -fPIE T:opt-win-aes
g++ -march=native -mtune=native -Os -fomit-frame-pointer -fwrapv -fPIC -fPIE T:opt-win-aes